hbase-dev mailing list archives

Site index · List index
Message view « Date » · « Thread »
Top « Date » · « Thread »
From Apache Jenkins Server <jenk...@builds.apache.org>
Subject Build failed in Jenkins: HBase-TRUNK #3925
Date Fri, 08 Mar 2013 02:15:07 GMT
See <https://builds.apache.org/job/HBase-TRUNK/3925/changes>

Changes:

[stack] HBASE-8032 TestNodeHealthCheckChore.testHealthChecker failed 0.95 build #36

[stack] HBASE-8027 hbase-7994 redux; shutdown hbase-example unit tests

------------------------------------------
[...truncated 3893 lines...]
	at sun.reflect.NativeMethodAccessorImpl.invoke(NativeMethodAccessorImpl.java:57)
	at sun.reflect.DelegatingMethodAccessorImpl.invoke(DelegatingMethodAccessorImpl.java:43)
	at java.lang.reflect.Method.invoke(Method.java:601)
	at org.apache.hadoop.hbase.util.Methods.call(Methods.java:41)
	at org.apache.hadoop.hbase.security.User.call(User.java:403)
	at org.apache.hadoop.hbase.security.User.access$300(User.java:51)
	at org.apache.hadoop.hbase.security.User$SecureHadoopUser.runAs(User.java:243)
	at org.apache.hadoop.hbase.MiniHBaseCluster$MiniHBaseClusterRegionServer.run(MiniHBaseCluster.java:133)
	at java.lang.Thread.run(Thread.java:722)
java.lang.InterruptedException: sleep interrupted
	at java.lang.Thread.sleep(Native Method)
	at org.apache.hadoop.hbase.util.Threads.sleep(Threads.java:133)
	at org.apache.hadoop.hbase.regionserver.HRegionServer.waitOnAllRegionsToClose(HRegionServer.java:1157)
	at org.apache.hadoop.hbase.regionserver.HRegionServer.run(HRegionServer.java:993)
	at org.apache.hadoop.hbase.MiniHBaseCluster$MiniHBaseClusterRegionServer.runRegionServer(MiniHBaseCluster.java:151)
	at org.apache.hadoop.hbase.MiniHBaseCluster$MiniHBaseClusterRegionServer.access$000(MiniHBaseCluster.java:103)
	at org.apache.hadoop.hbase.MiniHBaseCluster$MiniHBaseClusterRegionServer$1.run(MiniHBaseCluster.java:135)
	at java.security.AccessController.doPrivileged(Native Method)
	at javax.security.auth.Subject.doAs(Subject.java:356)
	at org.apache.hadoop.security.UserGroupInformation.doAs(UserGroupInformation.java:1118)
	at sun.reflect.NativeMethodAccessorImpl.invoke0(Native Method)
	at sun.reflect.NativeMethodAccessorImpl.invoke(NativeMethodAccessorImpl.java:57)
	at sun.reflect.DelegatingMethodAccessorImpl.invoke(DelegatingMethodAccessorImpl.java:43)
	at java.lang.reflect.Method.invoke(Method.java:601)
	at org.apache.hadoop.hbase.util.Methods.call(Methods.java:41)
	at org.apache.hadoop.hbase.security.User.call(User.java:403)
	at org.apache.hadoop.hbase.security.User.access$300(User.java:51)
	at org.apache.hadoop.hbase.security.User$SecureHadoopUser.runAs(User.java:243)
	at org.apache.hadoop.hbase.MiniHBaseCluster$MiniHBaseClusterRegionServer.run(MiniHBaseCluster.java:133)
	at java.lang.Thread.run(Thread.java:722)
java.lang.InterruptedException: sleep interrupted
	at java.lang.Thread.sleep(Native Method)
	at org.apache.hadoop.hbase.util.Threads.sleep(Threads.java:133)
	at org.apache.hadoop.hbase.regionserver.HRegionServer.waitOnAllRegionsToClose(HRegionServer.java:1157)
	at org.apache.hadoop.hbase.regionserver.HRegionServer.run(HRegionServer.java:993)
	at org.apache.hadoop.hbase.MiniHBaseCluster$MiniHBaseClusterRegionServer.runRegionServer(MiniHBaseCluster.java:151)
	at org.apache.hadoop.hbase.MiniHBaseCluster$MiniHBaseClusterRegionServer.access$000(MiniHBaseCluster.java:103)
	at org.apache.hadoop.hbase.MiniHBaseCluster$MiniHBaseClusterRegionServer$1.run(MiniHBaseCluster.java:135)
	at java.security.AccessController.doPrivileged(Native Method)
	at javax.security.auth.Subject.doAs(Subject.java:356)
	at org.apache.hadoop.security.UserGroupInformation.doAs(UserGroupInformation.java:1118)
	at sun.reflect.NativeMethodAccessorImpl.invoke0(Native Method)
	at sun.reflect.NativeMethodAccessorImpl.invoke(NativeMethodAccessorImpl.java:57)
	at sun.reflect.DelegatingMethodAccessorImpl.invoke(DelegatingMethodAccessorImpl.java:43)
	at java.lang.reflect.Method.invoke(Method.java:601)
	at org.apache.hadoop.hbase.util.Methods.call(Methods.java:41)
	at org.apache.hadoop.hbase.security.User.call(User.java:403)
	at org.apache.hadoop.hbase.security.User.access$300(User.java:51)
	at org.apache.hadoop.hbase.security.User$SecureHadoopUser.runAs(User.java:243)
	at org.apache.hadoop.hbase.MiniHBaseCluster$MiniHBaseClusterRegionServer.run(MiniHBaseCluster.java:133)
	at java.lang.Thread.run(Thread.java:722)
Shutting down the Mini HDFS Cluster
Shutting down DataNode 0
Running org.apache.hadoop.hbase.replication.TestMasterReplication
Tests run: 1, Failures: 0, Errors: 1, Skipped: 0, Time elapsed: 323.433 sec <<< FAILURE!
Running org.apache.hadoop.hbase.replication.TestReplicationDisableInactivePeer
Tests run: 2, Failures: 1, Errors: 1, Skipped: 0, Time elapsed: 575.567 sec <<< FAILURE!
Tests run: 1, Failures: 0, Errors: 0, Skipped: 0, Time elapsed: 294.785 sec
Running org.apache.hadoop.hbase.TestLocalHBaseCluster
Tests run: 1, Failures: 0, Errors: 0, Skipped: 0, Time elapsed: 33.671 sec
Running org.apache.hadoop.hbase.TestAcidGuarantees
Tests run: 3, Failures: 0, Errors: 0, Skipped: 0, Time elapsed: 255.795 sec
Running org.apache.hadoop.hbase.fs.TestBlockReorder
Tests run: 3, Failures: 0, Errors: 0, Skipped: 0, Time elapsed: 261.717 sec
Running org.apache.hadoop.hbase.replication.TestReplicationQueueFailover
Running org.apache.hadoop.hbase.coprocessor.TestRegionServerCoprocessorExceptionWithRemove
Tests run: 1, Failures: 0, Errors: 0, Skipped: 0, Time elapsed: 240.39 sec
Tests run: 1, Failures: 0, Errors: 0, Skipped: 0, Time elapsed: 338.245 sec
Running org.apache.hadoop.hbase.replication.TestReplicationSmallTests
Tests run: 8, Failures: 0, Errors: 0, Skipped: 0, Time elapsed: 539.193 sec
Running org.apache.hadoop.hbase.coprocessor.TestCoprocessorEndpoint
Tests run: 6, Failures: 0, Errors: 0, Skipped: 0, Time elapsed: 22.408 sec
Running org.apache.hadoop.hbase.coprocessor.TestWALObserver
Tests run: 3, Failures: 0, Errors: 0, Skipped: 0, Time elapsed: 27.738 sec
Running org.apache.hadoop.hbase.coprocessor.TestBigDecimalColumnInterpreter
Tests run: 38, Failures: 0, Errors: 0, Skipped: 0, Time elapsed: 24.654 sec
Running org.apache.hadoop.hbase.coprocessor.TestRegionObserverInterface
Tests run: 7, Failures: 0, Errors: 0, Skipped: 0, Time elapsed: 72.703 sec
Running org.apache.hadoop.hbase.coprocessor.TestRegionObserverBypass
Running org.apache.hadoop.hbase.coprocessor.TestMasterObserver
Tests run: 2, Failures: 0, Errors: 0, Skipped: 0, Time elapsed: 24.603 sec
Tests run: 4, Failures: 0, Errors: 0, Skipped: 0, Time elapsed: 80.161 sec
Running org.apache.hadoop.hbase.coprocessor.TestMasterCoprocessorExceptionWithAbort
Running org.apache.hadoop.hbase.coprocessor.TestRegionServerCoprocessorExceptionWithAbort
Tests run: 1, Failures: 0, Errors: 0, Skipped: 0, Time elapsed: 40.009 sec
Running org.apache.hadoop.hbase.coprocessor.TestAggregateProtocol
Tests run: 1, Failures: 0, Errors: 0, Skipped: 0, Time elapsed: 33.103 sec
Tests run: 45, Failures: 0, Errors: 0, Skipped: 0, Time elapsed: 30.203 sec
Running org.apache.hadoop.hbase.coprocessor.TestMasterCoprocessorExceptionWithRemove
Running org.apache.hadoop.hbase.procedure.TestZKProcedureControllers
Tests run: 1, Failures: 0, Errors: 0, Skipped: 0, Time elapsed: 38.91 sec
Tests run: 4, Failures: 0, Errors: 0, Skipped: 0, Time elapsed: 3.81 sec
Running org.apache.hadoop.hbase.procedure.TestZKProcedure
Tests run: 4, Failures: 0, Errors: 0, Skipped: 0, Time elapsed: 6.868 sec
Running org.apache.hadoop.hbase.constraint.TestConstraint
Running org.apache.hadoop.hbase.coprocessor.TestClassLoading
Tests run: 7, Failures: 0, Errors: 0, Skipped: 0, Time elapsed: 105.589 sec
Tests run: 5, Failures: 0, Errors: 0, Skipped: 0, Time elapsed: 90.748 sec
Running org.apache.hadoop.hbase.coprocessor.TestRowProcessorEndpoint
Tests run: 4, Failures: 0, Errors: 0, Skipped: 0, Time elapsed: 164.723 sec
Running org.apache.hadoop.hbase.snapshot.TestSnapshotDescriptionUtils
Tests run: 2, Failures: 0, Errors: 0, Skipped: 0, Time elapsed: 80.143 sec
Running org.apache.hadoop.hbase.snapshot.TestFlushSnapshotFromClient
Tests run: 5, Failures: 0, Errors: 0, Skipped: 0, Time elapsed: 409.01 sec
Running org.apache.hadoop.hbase.snapshot.TestExportSnapshot
Tests run: 2, Failures: 0, Errors: 0, Skipped: 0, Time elapsed: 293.292 sec
Running org.apache.hadoop.hbase.mapred.TestTableInputFormat
Tests run: 10, Failures: 0, Errors: 0, Skipped: 0, Time elapsed: 190.198 sec
Running org.apache.hadoop.hbase.master.TestAssignmentManager
Tests run: 15, Failures: 0, Errors: 0, Skipped: 0, Time elapsed: 48.26 sec
Running org.apache.hadoop.hbase.master.TestActiveMasterManager
Tests run: 2, Failures: 0, Errors: 0, Skipped: 0, Time elapsed: 22.112 sec
Running org.apache.hadoop.hbase.master.TestOpenedRegionHandler
Tests run: 2, Failures: 0, Errors: 0, Skipped: 0, Time elapsed: 142.435 sec
Running org.apache.hadoop.hbase.master.TestMasterFailoverBalancerPersistence
Tests run: 1, Failures: 0, Errors: 0, Skipped: 0, Time elapsed: 75.58 sec
Running org.apache.hadoop.hbase.master.TestMasterRestartAfterDisablingTable
Tests run: 1, Failures: 0, Errors: 0, Skipped: 0, Time elapsed: 96.372 sec
Running org.apache.hadoop.hbase.mapred.TestTableMapReduce
Tests run: 1, Failures: 0, Errors: 0, Skipped: 0, Time elapsed: 573.713 sec
Running org.apache.hadoop.hbase.master.TestMasterFailover
Running org.apache.hadoop.hbase.snapshot.TestRestoreFlushSnapshotFromClient
Tests run: 4, Failures: 0, Errors: 0, Skipped: 0, Time elapsed: 202.133 sec
Running org.apache.hadoop.hbase.master.TestMasterTransitions
Tests run: 3, Failures: 0, Errors: 0, Skipped: 3, Time elapsed: 54.115 sec
Running org.apache.hadoop.hbase.master.TestRollingRestart
Tests run: 5, Failures: 0, Errors: 1, Skipped: 0, Time elapsed: 788.032 sec <<< FAILURE!
Running org.apache.hadoop.hbase.master.TestTableLockManager
Running org.apache.hadoop.hbase.master.TestRestartCluster
Tests run: 4, Failures: 0, Errors: 0, Skipped: 0, Time elapsed: 139.377 sec
Tests run: 2, Failures: 0, Errors: 0, Skipped: 0, Time elapsed: 68.248 sec
Running org.apache.hadoop.hbase.master.TestMasterMetrics
Running org.apache.hadoop.hbase.master.TestMasterStatusServlet
Running org.apache.hadoop.hbase.master.TestHMasterRPCException
Tests run: 5, Failures: 0, Errors: 0, Skipped: 0, Time elapsed: 2.809 sec
Tests run: 1, Failures: 0, Errors: 0, Skipped: 0, Time elapsed: 1.627 sec
Tests run: 2, Failures: 0, Errors: 0, Skipped: 0, Time elapsed: 29.016 sec
Tests run: 1, Failures: 0, Errors: 0, Skipped: 0, Time elapsed: 127.522 sec
Running org.apache.hadoop.hbase.master.balancer.TestBaseLoadBalancer
Tests run: 3, Failures: 0, Errors: 0, Skipped: 0, Time elapsed: 1.096 sec
Running org.apache.hadoop.hbase.master.balancer.TestDefaultLoadBalancer
Tests run: 1, Failures: 0, Errors: 0, Skipped: 0, Time elapsed: 3.107 sec
Running org.apache.hadoop.hbase.master.cleaner.TestHFileCleaner
Tests run: 3, Failures: 0, Errors: 0, Skipped: 0, Time elapsed: 9.719 sec
Running org.apache.hadoop.hbase.master.TestAssignmentManagerOnCluster
Tests run: 3, Failures: 0, Errors: 0, Skipped: 0, Time elapsed: 29.404 sec
Running org.apache.hadoop.hbase.master.TestMaster
Tests run: 1, Failures: 0, Errors: 0, Skipped: 0, Time elapsed: 25.642 sec
Running org.apache.hadoop.hbase.master.cleaner.TestLogsCleaner
Tests run: 1, Failures: 0, Errors: 0, Skipped: 0, Time elapsed: 11.976 sec
Running org.apache.hadoop.hbase.master.TestMasterShutdown
Tests run: 1, Failures: 0, Errors: 0, Skipped: 0, Time elapsed: 29.802 sec
Running org.apache.hadoop.hbase.master.TestMasterFileSystem
Tests run: 1, Failures: 0, Errors: 0, Skipped: 0, Time elapsed: 36.864 sec
Running org.apache.hadoop.hbase.master.cleaner.TestSnapshotFromMaster
Tests run: 4, Failures: 0, Errors: 0, Skipped: 0, Time elapsed: 50.362 sec
Running org.apache.hadoop.hbase.master.balancer.TestStochasticLoadBalancer
Tests run: 4, Failures: 0, Errors: 0, Skipped: 0, Time elapsed: 102.638 sec
Running org.apache.hadoop.hbase.master.snapshot.TestSnapshotFileCache
Tests run: 4, Failures: 0, Errors: 0, Skipped: 0, Time elapsed: 16.461 sec
Running org.apache.hadoop.hbase.master.handler.TestTableDescriptorModification
Tests run: 3, Failures: 0, Errors: 0, Skipped: 0, Time elapsed: 53.163 sec
Running org.apache.hadoop.hbase.master.TestDistributedLogSplitting
Running org.apache.hadoop.hbase.master.handler.TestTableDeleteFamilyHandler
Running org.apache.hadoop.hbase.master.TestSplitLogManager
Tests run: 13, Failures: 0, Errors: 0, Skipped: 0, Time elapsed: 102.74 sec
Tests run: 1, Failures: 0, Errors: 0, Skipped: 0, Time elapsed: 103.447 sec
Running org.apache.hadoop.hbase.master.TestDeadServer
Tests run: 3, Failures: 0, Errors: 0, Skipped: 0, Time elapsed: 1.501 sec
Running org.apache.hadoop.hbase.master.TestMasterNoCluster
Running org.apache.hadoop.hbase.master.TestMasterMetricsWrapper
Tests run: 3, Failures: 0, Errors: 0, Skipped: 0, Time elapsed: 18.331 sec
Tests run: 1, Failures: 0, Errors: 0, Skipped: 0, Time elapsed: 61.963 sec
Tests run: 4, Failures: 0, Errors: 0, Skipped: 0, Time elapsed: 170.847 sec
Running org.apache.hadoop.hbase.master.TestZKBasedOpenCloseRegion
Tests run: 4, Failures: 0, Errors: 0, Skipped: 0, Time elapsed: 31.007 sec

Results :

Failed tests:   testTooManyDelayedRpcs(org.apache.hadoop.hbase.ipc.TestDelayedRpc)
  org.apache.hadoop.hbase.client.TestMultiParallel: Timed out waiting for table to become
available multi_test_table
  testPermissionsWatcher(org.apache.hadoop.hbase.security.access.TestZKPermissionsWatcher)
  testCyclicReplication(org.apache.hadoop.hbase.replication.TestMasterReplication): Waited
too much time for put replication

Tests in error: 
  testDelayedRpcImmediateReturnValue(org.apache.hadoop.hbase.ipc.TestDelayedRpc): Index: 0,
Size: 0
  testRegionServerSessionExpired(org.apache.hadoop.hbase.TestZooKeeper): org.apache.hadoop.hbase.exceptions.NotAllMetaRegionsOnlineException:
Timed out (10000ms)
  testMergeTable(org.apache.hadoop.hbase.util.TestMergeTable): test timed out after 300000
milliseconds
  testDrainingServerWithAbort(org.apache.hadoop.hbase.TestDrainingServer): test timed out
after 30000 milliseconds
  testOnlineSnapshotAppendIndependent(org.apache.hadoop.hbase.client.TestSnapshotCloneIndependence):
org.apache.hadoop.hbase.exceptions.HBaseSnapshotException: Snapshot { ss=snapshot_test1362701234093
table=test1362701234093 type=FLUSH } had an error.  Procedure snapshot_test1362701234093 {
waiting=[minerva.apache.org,36078,1362701220071] done=[] }
  testOfflineSnapshotRegionOperationsIndependent(org.apache.hadoop.hbase.client.TestSnapshotCloneIndependence):
Split did not increase the number of regions
  testScannerNextRPCTimesout(org.apache.hadoop.hbase.client.TestClientScannerRPCTimeout):
Failed 1 action: ExecutionException: 1 time, 
  loadTest[0](org.apache.hadoop.hbase.io.encoding.TestLoadAndSwitchEncodeOnDisk): test timed
out after 180000 milliseconds
  testMinorCompactionOnFamily(org.apache.hadoop.hbase.regionserver.TestCompactionState): test
timed out after 60000 milliseconds
  testMajorCompaction(org.apache.hadoop.hbase.regionserver.TestCompactionState): test timed
out after 60000 milliseconds
  testMultiClusters(org.apache.hadoop.hbase.TestHBaseTestingUtility): test timed out after
180000 milliseconds
  testMultiSlaveReplication(org.apache.hadoop.hbase.replication.TestMultiSlaveReplication):
test timed out after 300000 milliseconds
  queueFailover(org.apache.hadoop.hbase.replication.TestReplicationQueueFailoverCompressed):
Failed 3 actions: ExecutionException: 3 times, 
  testSimplePutDelete(org.apache.hadoop.hbase.replication.TestMasterReplication): Shutting
down
  testCloneNonExistentSnapshot(org.apache.hadoop.hbase.snapshot.TestRestoreFlushSnapshotFromClient):
org.apache.hadoop.hbase.exceptions.SnapshotDoesNotExistException: Snapshot 'snaptb0-1362707663191'
doesn't exist on the filesystem

Tests run: 1244, Failures: 4, Errors: 15, Skipped: 7

[INFO]                                                                         
[INFO] ------------------------------------------------------------------------
[INFO] Skipping HBase
[INFO] This project has been banned from the build due to previous failures.
[INFO] ------------------------------------------------------------------------
[INFO]                                                                         
[INFO] ------------------------------------------------------------------------
[INFO] Skipping HBase
[INFO] This project has been banned from the build due to previous failures.
[INFO] ------------------------------------------------------------------------
[INFO] ------------------------------------------------------------------------
[INFO] Reactor Summary:
[INFO] 
[INFO] HBase ............................................. SUCCESS [7.800s]
[INFO] HBase - Common .................................... SUCCESS [22.773s]
[INFO] HBase - Protocol .................................. SUCCESS [14.750s]
[INFO] HBase - Client .................................... SUCCESS [11.785s]
[INFO] HBase - Prefix Tree ............................... SUCCESS [4.224s]
[INFO] HBase - Hadoop Compatibility ...................... SUCCESS [2.267s]
[INFO] HBase - Hadoop One Compatibility .................. SUCCESS [4.723s]
[INFO] HBase - Server .................................... FAILURE [3:01:14.531s]
[INFO] HBase - Integration Tests ......................... SKIPPED
[INFO] HBase - Examples .................................. SKIPPED
[INFO] ------------------------------------------------------------------------
[INFO] BUILD FAILURE
[INFO] ------------------------------------------------------------------------
[INFO] Total time: 3:02:25.994s
[INFO] Finished at: Fri Mar 08 02:12:15 UTC 2013
[INFO] Final Memory: 73M/1100M
[INFO] ------------------------------------------------------------------------
[ERROR] Failed to execute goal org.apache.maven.plugins:maven-surefire-plugin:2.12-TRUNK-HBASE-2:test
(secondPartTestsExecution) on project hbase-server: Failure or timeout -> [Help 1]
[ERROR] 
[ERROR] To see the full stack trace of the errors, re-run Maven with the -e switch.
[ERROR] Re-run Maven using the -X switch to enable full debug logging.
[ERROR] 
[ERROR] For more information about the errors and possible solutions, please read the following
articles:
[ERROR] [Help 1] http://cwiki.apache.org/confluence/display/MAVEN/MojoExecutionException
[ERROR] 
[ERROR] After correcting the problems, you can resume the build with the command
[ERROR]   mvn <goals> -rf :hbase-server
Build step 'Invoke top-level Maven targets' marked build as failure
Archiving artifacts
Recording test results
Updating HBASE-7994
Updating HBASE-8032
Updating HBASE-8027

Mime
View raw message