hbase-dev mailing list archives

Site index · List index
Message view « Date » · « Thread »
Top « Date » · « Thread »
From Apache Jenkins Server <jenk...@builds.apache.org>
Subject Build failed in Jenkins: hbase-0.95-on-hadoop2 #29
Date Sun, 17 Mar 2013 12:13:17 GMT
See <https://builds.apache.org/job/hbase-0.95-on-hadoop2/29/changes>

Changes:

[mbertozzi] HBASE-8067 TestHFileArchiving.testArchiveOnTableDelete sometimes fails

------------------------------------------
[...truncated 22927 lines...]
Running org.apache.hadoop.hbase.rest.TestGzipFilter
Tests run: 2, Failures: 0, Errors: 0, Skipped: 0, Time elapsed: 10.52 sec
Forking command line: /bin/sh -c cd /x1/jenkins/jenkins-slave/workspace/hbase-0.95-on-hadoop2/0.95-on-hadoop2/hbase-server && /x1/jenkins/tools/java/jdk1.6.0_32-32/jre/bin/java -enableassertions -Xmx1900m -Djava.security.egd=file:/dev/./urandom -Djava.net.preferIPv4Stack=true -jar /x1/jenkins/jenkins-slave/workspace/hbase-0.95-on-hadoop2/0.95-on-hadoop2/hbase-server/target/surefire/surefirebooter956485121290564864.jar /x1/jenkins/jenkins-slave/workspace/hbase-0.95-on-hadoop2/0.95-on-hadoop2/hbase-server/target/surefire/surefire6449572034290034097tmp /x1/jenkins/jenkins-slave/workspace/hbase-0.95-on-hadoop2/0.95-on-hadoop2/hbase-server/target/surefire/surefire_1824497718943287962236tmp
Running org.apache.hadoop.hbase.security.access.TestAccessController
Tests run: 35, Failures: 0, Errors: 0, Skipped: 0, Time elapsed: 153.429 sec
Forking command line: /bin/sh -c cd /x1/jenkins/jenkins-slave/workspace/hbase-0.95-on-hadoop2/0.95-on-hadoop2/hbase-server && /x1/jenkins/tools/java/jdk1.6.0_32-32/jre/bin/java -enableassertions -Xmx1900m -Djava.security.egd=file:/dev/./urandom -Djava.net.preferIPv4Stack=true -jar /x1/jenkins/jenkins-slave/workspace/hbase-0.95-on-hadoop2/0.95-on-hadoop2/hbase-server/target/surefire/surefirebooter1542108357243946698.jar /x1/jenkins/jenkins-slave/workspace/hbase-0.95-on-hadoop2/0.95-on-hadoop2/hbase-server/target/surefire/surefire6535370241630613133tmp /x1/jenkins/jenkins-slave/workspace/hbase-0.95-on-hadoop2/0.95-on-hadoop2/hbase-server/target/surefire/surefire_183897534471968139601tmp
Running org.apache.hadoop.hbase.rest.TestRowResource
Tests run: 12, Failures: 0, Errors: 0, Skipped: 0, Time elapsed: 12.255 sec
Forking command line: /bin/sh -c cd /x1/jenkins/jenkins-slave/workspace/hbase-0.95-on-hadoop2/0.95-on-hadoop2/hbase-server && /x1/jenkins/tools/java/jdk1.6.0_32-32/jre/bin/java -enableassertions -Xmx1900m -Djava.security.egd=file:/dev/./urandom -Djava.net.preferIPv4Stack=true -jar /x1/jenkins/jenkins-slave/workspace/hbase-0.95-on-hadoop2/0.95-on-hadoop2/hbase-server/target/surefire/surefirebooter3797491118158523684.jar /x1/jenkins/jenkins-slave/workspace/hbase-0.95-on-hadoop2/0.95-on-hadoop2/hbase-server/target/surefire/surefire178913479401789085tmp /x1/jenkins/jenkins-slave/workspace/hbase-0.95-on-hadoop2/0.95-on-hadoop2/hbase-server/target/surefire/surefire_1843523411677347484626tmp
Running org.apache.hadoop.hbase.rest.TestVersionResource
Tests run: 7, Failures: 0, Errors: 0, Skipped: 0, Time elapsed: 9.259 sec
Forking command line: /bin/sh -c cd /x1/jenkins/jenkins-slave/workspace/hbase-0.95-on-hadoop2/0.95-on-hadoop2/hbase-server && /x1/jenkins/tools/java/jdk1.6.0_32-32/jre/bin/java -enableassertions -Xmx1900m -Djava.security.egd=file:/dev/./urandom -Djava.net.preferIPv4Stack=true -jar /x1/jenkins/jenkins-slave/workspace/hbase-0.95-on-hadoop2/0.95-on-hadoop2/hbase-server/target/surefire/surefirebooter6313587622958514960.jar /x1/jenkins/jenkins-slave/workspace/hbase-0.95-on-hadoop2/0.95-on-hadoop2/hbase-server/target/surefire/surefire2131563263040614074tmp /x1/jenkins/jenkins-slave/workspace/hbase-0.95-on-hadoop2/0.95-on-hadoop2/hbase-server/target/surefire/surefire_1852970913253327912947tmp
Running org.apache.hadoop.hbase.rest.TestStatusResource
Tests run: 2, Failures: 0, Errors: 0, Skipped: 0, Time elapsed: 8.875 sec
Forking command line: /bin/sh -c cd /x1/jenkins/jenkins-slave/workspace/hbase-0.95-on-hadoop2/0.95-on-hadoop2/hbase-server && /x1/jenkins/tools/java/jdk1.6.0_32-32/jre/bin/java -enableassertions -Xmx1900m -Djava.security.egd=file:/dev/./urandom -Djava.net.preferIPv4Stack=true -jar /x1/jenkins/jenkins-slave/workspace/hbase-0.95-on-hadoop2/0.95-on-hadoop2/hbase-server/target/surefire/surefirebooter842652896316398235.jar /x1/jenkins/jenkins-slave/workspace/hbase-0.95-on-hadoop2/0.95-on-hadoop2/hbase-server/target/surefire/surefire9114444199120489231tmp /x1/jenkins/jenkins-slave/workspace/hbase-0.95-on-hadoop2/0.95-on-hadoop2/hbase-server/target/surefire/surefire_1864146476706426570483tmp
Running org.apache.hadoop.hbase.rest.TestScannerResource
Tests run: 5, Failures: 0, Errors: 0, Skipped: 0, Time elapsed: 26.321 sec
Forking command line: /bin/sh -c cd /x1/jenkins/jenkins-slave/workspace/hbase-0.95-on-hadoop2/0.95-on-hadoop2/hbase-server && /x1/jenkins/tools/java/jdk1.6.0_32-32/jre/bin/java -enableassertions -Xmx1900m -Djava.security.egd=file:/dev/./urandom -Djava.net.preferIPv4Stack=true -jar /x1/jenkins/jenkins-slave/workspace/hbase-0.95-on-hadoop2/0.95-on-hadoop2/hbase-server/target/surefire/surefirebooter7437755923326423607.jar /x1/jenkins/jenkins-slave/workspace/hbase-0.95-on-hadoop2/0.95-on-hadoop2/hbase-server/target/surefire/surefire7838540727435411420tmp /x1/jenkins/jenkins-slave/workspace/hbase-0.95-on-hadoop2/0.95-on-hadoop2/hbase-server/target/surefire/surefire_1876657669676570263292tmp
Running org.apache.hadoop.hbase.trace.TestHTraceHooks
Tests run: 1, Failures: 0, Errors: 0, Skipped: 0, Time elapsed: 8.108 sec
Forking command line: /bin/sh -c cd /x1/jenkins/jenkins-slave/workspace/hbase-0.95-on-hadoop2/0.95-on-hadoop2/hbase-server && /x1/jenkins/tools/java/jdk1.6.0_32-32/jre/bin/java -enableassertions -Xmx1900m -Djava.security.egd=file:/dev/./urandom -Djava.net.preferIPv4Stack=true -jar /x1/jenkins/jenkins-slave/workspace/hbase-0.95-on-hadoop2/0.95-on-hadoop2/hbase-server/target/surefire/surefirebooter1646345588487103824.jar /x1/jenkins/jenkins-slave/workspace/hbase-0.95-on-hadoop2/0.95-on-hadoop2/hbase-server/target/surefire/surefire2690431768751209387tmp /x1/jenkins/jenkins-slave/workspace/hbase-0.95-on-hadoop2/0.95-on-hadoop2/hbase-server/target/surefire/surefire_1886182805299302755661tmp
Running org.apache.hadoop.hbase.rest.TestScannersWithFilters
Tests run: 10, Failures: 0, Errors: 0, Skipped: 0, Time elapsed: 13.311 sec
Forking command line: /bin/sh -c cd /x1/jenkins/jenkins-slave/workspace/hbase-0.95-on-hadoop2/0.95-on-hadoop2/hbase-server && /x1/jenkins/tools/java/jdk1.6.0_32-32/jre/bin/java -enableassertions -Xmx1900m -Djava.security.egd=file:/dev/./urandom -Djava.net.preferIPv4Stack=true -jar /x1/jenkins/jenkins-slave/workspace/hbase-0.95-on-hadoop2/0.95-on-hadoop2/hbase-server/target/surefire/surefirebooter3936243970242060062.jar /x1/jenkins/jenkins-slave/workspace/hbase-0.95-on-hadoop2/0.95-on-hadoop2/hbase-server/target/surefire/surefire626604765624002303tmp /x1/jenkins/jenkins-slave/workspace/hbase-0.95-on-hadoop2/0.95-on-hadoop2/hbase-server/target/surefire/surefire_1893799354276191867159tmp
Running org.apache.hadoop.hbase.io.hfile.TestHFileBlockIndex
Tests run: 10, Failures: 0, Errors: 0, Skipped: 0, Time elapsed: 8.847 sec
Running org.apache.hadoop.hbase.io.hfile.TestHFileSeek
Tests run: 1, Failures: 0, Errors: 0, Skipped: 0, Time elapsed: 5.657 sec
Forking command line: /bin/sh -c cd /x1/jenkins/jenkins-slave/workspace/hbase-0.95-on-hadoop2/0.95-on-hadoop2/hbase-server && /x1/jenkins/tools/java/jdk1.6.0_32-32/jre/bin/java -enableassertions -Xmx1900m -Djava.security.egd=file:/dev/./urandom -Djava.net.preferIPv4Stack=true -jar /x1/jenkins/jenkins-slave/workspace/hbase-0.95-on-hadoop2/0.95-on-hadoop2/hbase-server/target/surefire/surefirebooter8589675592667035938.jar /x1/jenkins/jenkins-slave/workspace/hbase-0.95-on-hadoop2/0.95-on-hadoop2/hbase-server/target/surefire/surefire8803017515241175153tmp /x1/jenkins/jenkins-slave/workspace/hbase-0.95-on-hadoop2/0.95-on-hadoop2/hbase-server/target/surefire/surefire_1902605543910421168600tmp
Forking command line: /bin/sh -c cd /x1/jenkins/jenkins-slave/workspace/hbase-0.95-on-hadoop2/0.95-on-hadoop2/hbase-server && /x1/jenkins/tools/java/jdk1.6.0_32-32/jre/bin/java -enableassertions -Xmx1900m -Djava.security.egd=file:/dev/./urandom -Djava.net.preferIPv4Stack=true -jar /x1/jenkins/jenkins-slave/workspace/hbase-0.95-on-hadoop2/0.95-on-hadoop2/hbase-server/target/surefire/surefirebooter2693294267535259316.jar /x1/jenkins/jenkins-slave/workspace/hbase-0.95-on-hadoop2/0.95-on-hadoop2/hbase-server/target/surefire/surefire3288638977473529705tmp /x1/jenkins/jenkins-slave/workspace/hbase-0.95-on-hadoop2/0.95-on-hadoop2/hbase-server/target/surefire/surefire_1912228519381476499619tmp
Running org.apache.hadoop.hbase.io.hfile.TestHFilePerformance
Tests run: 1, Failures: 0, Errors: 0, Skipped: 0, Time elapsed: 5.137 sec
Forking command line: /bin/sh -c cd /x1/jenkins/jenkins-slave/workspace/hbase-0.95-on-hadoop2/0.95-on-hadoop2/hbase-server && /x1/jenkins/tools/java/jdk1.6.0_32-32/jre/bin/java -enableassertions -Xmx1900m -Djava.security.egd=file:/dev/./urandom -Djava.net.preferIPv4Stack=true -jar /x1/jenkins/jenkins-slave/workspace/hbase-0.95-on-hadoop2/0.95-on-hadoop2/hbase-server/target/surefire/surefirebooter1793970089587229444.jar /x1/jenkins/jenkins-slave/workspace/hbase-0.95-on-hadoop2/0.95-on-hadoop2/hbase-server/target/surefire/surefire3098770858842035975tmp /x1/jenkins/jenkins-slave/workspace/hbase-0.95-on-hadoop2/0.95-on-hadoop2/hbase-server/target/surefire/surefire_192918416549703154719tmp
Running org.apache.hadoop.hbase.io.hfile.TestForceCacheImportantBlocks
Tests run: 2, Failures: 0, Errors: 0, Skipped: 0, Time elapsed: 21.711 sec
Forking command line: /bin/sh -c cd /x1/jenkins/jenkins-slave/workspace/hbase-0.95-on-hadoop2/0.95-on-hadoop2/hbase-server && /x1/jenkins/tools/java/jdk1.6.0_32-32/jre/bin/java -enableassertions -Xmx1900m -Djava.security.egd=file:/dev/./urandom -Djava.net.preferIPv4Stack=true -jar /x1/jenkins/jenkins-slave/workspace/hbase-0.95-on-hadoop2/0.95-on-hadoop2/hbase-server/target/surefire/surefirebooter5353333190326571355.jar /x1/jenkins/jenkins-slave/workspace/hbase-0.95-on-hadoop2/0.95-on-hadoop2/hbase-server/target/surefire/surefire7240812935163820703tmp /x1/jenkins/jenkins-slave/workspace/hbase-0.95-on-hadoop2/0.95-on-hadoop2/hbase-server/target/surefire/surefire_1934663454999007785623tmp
Running org.apache.hadoop.hbase.io.hfile.TestCacheOnWrite
Tests run: 36, Failures: 0, Errors: 0, Skipped: 0, Time elapsed: 30.492 sec
Forking command line: /bin/sh -c cd /x1/jenkins/jenkins-slave/workspace/hbase-0.95-on-hadoop2/0.95-on-hadoop2/hbase-server && /x1/jenkins/tools/java/jdk1.6.0_32-32/jre/bin/java -enableassertions -Xmx1900m -Djava.security.egd=file:/dev/./urandom -Djava.net.preferIPv4Stack=true -jar /x1/jenkins/jenkins-slave/workspace/hbase-0.95-on-hadoop2/0.95-on-hadoop2/hbase-server/target/surefire/surefirebooter6130236574659744650.jar /x1/jenkins/jenkins-slave/workspace/hbase-0.95-on-hadoop2/0.95-on-hadoop2/hbase-server/target/surefire/surefire690502411789411678tmp /x1/jenkins/jenkins-slave/workspace/hbase-0.95-on-hadoop2/0.95-on-hadoop2/hbase-server/target/surefire/surefire_1944410988738668809277tmp
Running org.apache.hadoop.hbase.io.hfile.TestScannerSelectionUsingTTL
Tests run: 6, Failures: 0, Errors: 0, Skipped: 0, Time elapsed: 61.855 sec
Forking command line: /bin/sh -c cd /x1/jenkins/jenkins-slave/workspace/hbase-0.95-on-hadoop2/0.95-on-hadoop2/hbase-server && /x1/jenkins/tools/java/jdk1.6.0_32-32/jre/bin/java -enableassertions -Xmx1900m -Djava.security.egd=file:/dev/./urandom -Djava.net.preferIPv4Stack=true -jar /x1/jenkins/jenkins-slave/workspace/hbase-0.95-on-hadoop2/0.95-on-hadoop2/hbase-server/target/surefire/surefirebooter1052725528793651436.jar /x1/jenkins/jenkins-slave/workspace/hbase-0.95-on-hadoop2/0.95-on-hadoop2/hbase-server/target/surefire/surefire3520116643413101950tmp /x1/jenkins/jenkins-slave/workspace/hbase-0.95-on-hadoop2/0.95-on-hadoop2/hbase-server/target/surefire/surefire_1952012041359997548590tmp
Running org.apache.hadoop.hbase.io.hfile.TestHFileBlock
Tests run: 14, Failures: 0, Errors: 0, Skipped: 0, Time elapsed: 49.815 sec
Forking command line: /bin/sh -c cd /x1/jenkins/jenkins-slave/workspace/hbase-0.95-on-hadoop2/0.95-on-hadoop2/hbase-server && /x1/jenkins/tools/java/jdk1.6.0_32-32/jre/bin/java -enableassertions -Xmx1900m -Djava.security.egd=file:/dev/./urandom -Djava.net.preferIPv4Stack=true -jar /x1/jenkins/jenkins-slave/workspace/hbase-0.95-on-hadoop2/0.95-on-hadoop2/hbase-server/target/surefire/surefirebooter3873232265485460492.jar /x1/jenkins/jenkins-slave/workspace/hbase-0.95-on-hadoop2/0.95-on-hadoop2/hbase-server/target/surefire/surefire6230829418234083966tmp /x1/jenkins/jenkins-slave/workspace/hbase-0.95-on-hadoop2/0.95-on-hadoop2/hbase-server/target/surefire/surefire_1965540872493869381469tmp
Running org.apache.hadoop.hbase.regionserver.wal.TestLogRolling
Tests run: 2, Failures: 0, Errors: 1, Skipped: 0, Time elapsed: 775.668 sec <<< FAILURE!
Forking command line: /bin/sh -c cd /x1/jenkins/jenkins-slave/workspace/hbase-0.95-on-hadoop2/0.95-on-hadoop2/hbase-server && /x1/jenkins/tools/java/jdk1.6.0_32-32/jre/bin/java -enableassertions -Xmx1900m -Djava.security.egd=file:/dev/./urandom -Djava.net.preferIPv4Stack=true -jar /x1/jenkins/jenkins-slave/workspace/hbase-0.95-on-hadoop2/0.95-on-hadoop2/hbase-server/target/surefire/surefirebooter647977442067658410.jar /x1/jenkins/jenkins-slave/workspace/hbase-0.95-on-hadoop2/0.95-on-hadoop2/hbase-server/target/surefire/surefire1111638297497642151tmp /x1/jenkins/jenkins-slave/workspace/hbase-0.95-on-hadoop2/0.95-on-hadoop2/hbase-server/target/surefire/surefire_1973184763969523314810tmp
Running org.apache.hadoop.hbase.io.hfile.slab.TestSlabCache
Tests run: 7, Failures: 0, Errors: 0, Skipped: 0, Time elapsed: 16.219 sec
Forking command line: /bin/sh -c cd /x1/jenkins/jenkins-slave/workspace/hbase-0.95-on-hadoop2/0.95-on-hadoop2/hbase-server && /x1/jenkins/tools/java/jdk1.6.0_32-32/jre/bin/java -enableassertions -Xmx1900m -Djava.security.egd=file:/dev/./urandom -Djava.net.preferIPv4Stack=true -jar /x1/jenkins/jenkins-slave/workspace/hbase-0.95-on-hadoop2/0.95-on-hadoop2/hbase-server/target/surefire/surefirebooter2448691912643352573.jar /x1/jenkins/jenkins-slave/workspace/hbase-0.95-on-hadoop2/0.95-on-hadoop2/hbase-server/target/surefire/surefire6973505356927735518tmp /x1/jenkins/jenkins-slave/workspace/hbase-0.95-on-hadoop2/0.95-on-hadoop2/hbase-server/target/surefire/surefire_1987389617058710739958tmp
Running org.apache.hadoop.hbase.io.TestFileLink
Tests run: 3, Failures: 0, Errors: 0, Skipped: 0, Time elapsed: 13.552 sec
Forking command line: /bin/sh -c cd /x1/jenkins/jenkins-slave/workspace/hbase-0.95-on-hadoop2/0.95-on-hadoop2/hbase-server && /x1/jenkins/tools/java/jdk1.6.0_32-32/jre/bin/java -enableassertions -Xmx1900m -Djava.security.egd=file:/dev/./urandom -Djava.net.preferIPv4Stack=true -jar /x1/jenkins/jenkins-slave/workspace/hbase-0.95-on-hadoop2/0.95-on-hadoop2/hbase-server/target/surefire/surefirebooter2879688937630487971.jar /x1/jenkins/jenkins-slave/workspace/hbase-0.95-on-hadoop2/0.95-on-hadoop2/hbase-server/target/surefire/surefire7939440630393493710tmp /x1/jenkins/jenkins-slave/workspace/hbase-0.95-on-hadoop2/0.95-on-hadoop2/hbase-server/target/surefire/surefire_1998191292166624003554tmp
Running org.apache.hadoop.hbase.io.hfile.slab.TestSingleSizeCache
Tests run: 5, Failures: 0, Errors: 0, Skipped: 0, Time elapsed: 35.059 sec
Forking command line: /bin/sh -c cd /x1/jenkins/jenkins-slave/workspace/hbase-0.95-on-hadoop2/0.95-on-hadoop2/hbase-server && /x1/jenkins/tools/java/jdk1.6.0_32-32/jre/bin/java -enableassertions -Xmx1900m -Djava.security.egd=file:/dev/./urandom -Djava.net.preferIPv4Stack=true -jar /x1/jenkins/jenkins-slave/workspace/hbase-0.95-on-hadoop2/0.95-on-hadoop2/hbase-server/target/surefire/surefirebooter3853030891478371142.jar /x1/jenkins/jenkins-slave/workspace/hbase-0.95-on-hadoop2/0.95-on-hadoop2/hbase-server/target/surefire/surefire6957770829072742317tmp /x1/jenkins/jenkins-slave/workspace/hbase-0.95-on-hadoop2/0.95-on-hadoop2/hbase-server/target/surefire/surefire_2007209129459717385191tmp
Running org.apache.hadoop.hbase.io.encoding.TestEncodedSeekers
Tests run: 10, Failures: 0, Errors: 0, Skipped: 0, Time elapsed: 37.323 sec
Forking command line: /bin/sh -c cd /x1/jenkins/jenkins-slave/workspace/hbase-0.95-on-hadoop2/0.95-on-hadoop2/hbase-server && /x1/jenkins/tools/java/jdk1.6.0_32-32/jre/bin/java -enableassertions -Xmx1900m -Djava.security.egd=file:/dev/./urandom -Djava.net.preferIPv4Stack=true -jar /x1/jenkins/jenkins-slave/workspace/hbase-0.95-on-hadoop2/0.95-on-hadoop2/hbase-server/target/surefire/surefirebooter1316280938929546199.jar /x1/jenkins/jenkins-slave/workspace/hbase-0.95-on-hadoop2/0.95-on-hadoop2/hbase-server/target/surefire/surefire3727093501135883848tmp /x1/jenkins/jenkins-slave/workspace/hbase-0.95-on-hadoop2/0.95-on-hadoop2/hbase-server/target/surefire/surefire_2016444457861251508537tmp
Running org.apache.hadoop.hbase.io.encoding.TestBufferedDataBlockEncoder
Tests run: 1, Failures: 0, Errors: 0, Skipped: 0, Time elapsed: 19.679 sec
Forking command line: /bin/sh -c cd /x1/jenkins/jenkins-slave/workspace/hbase-0.95-on-hadoop2/0.95-on-hadoop2/hbase-server && /x1/jenkins/tools/java/jdk1.6.0_32-32/jre/bin/java -enableassertions -Xmx1900m -Djava.security.egd=file:/dev/./urandom -Djava.net.preferIPv4Stack=true -jar /x1/jenkins/jenkins-slave/workspace/hbase-0.95-on-hadoop2/0.95-on-hadoop2/hbase-server/target/surefire/surefirebooter1435965327546388358.jar /x1/jenkins/jenkins-slave/workspace/hbase-0.95-on-hadoop2/0.95-on-hadoop2/hbase-server/target/surefire/surefire2367597973072391557tmp /x1/jenkins/jenkins-slave/workspace/hbase-0.95-on-hadoop2/0.95-on-hadoop2/hbase-server/target/surefire/surefire_2026687711686507199374tmp
Running org.apache.hadoop.hbase.io.encoding.TestLoadAndSwitchEncodeOnDisk
Tests run: 1, Failures: 0, Errors: 0, Skipped: 0, Time elapsed: 33.748 sec
Forking command line: /bin/sh -c cd /x1/jenkins/jenkins-slave/workspace/hbase-0.95-on-hadoop2/0.95-on-hadoop2/hbase-server && /x1/jenkins/tools/java/jdk1.6.0_32-32/jre/bin/java -enableassertions -Xmx1900m -Djava.security.egd=file:/dev/./urandom -Djava.net.preferIPv4Stack=true -jar /x1/jenkins/jenkins-slave/workspace/hbase-0.95-on-hadoop2/0.95-on-hadoop2/hbase-server/target/surefire/surefirebooter5726130669993617011.jar /x1/jenkins/jenkins-slave/workspace/hbase-0.95-on-hadoop2/0.95-on-hadoop2/hbase-server/target/surefire/surefire5894955109178577482tmp /x1/jenkins/jenkins-slave/workspace/hbase-0.95-on-hadoop2/0.95-on-hadoop2/hbase-server/target/surefire/surefire_2036021926867625352441tmp
Running org.apache.hadoop.hbase.io.encoding.TestDataBlockEncoders
Tests run: 12, Failures: 0, Errors: 0, Skipped: 0, Time elapsed: 96.097 sec
Forking command line: /bin/sh -c cd /x1/jenkins/jenkins-slave/workspace/hbase-0.95-on-hadoop2/0.95-on-hadoop2/hbase-server && /x1/jenkins/tools/java/jdk1.6.0_32-32/jre/bin/java -enableassertions -Xmx1900m -Djava.security.egd=file:/dev/./urandom -Djava.net.preferIPv4Stack=true -jar /x1/jenkins/jenkins-slave/workspace/hbase-0.95-on-hadoop2/0.95-on-hadoop2/hbase-server/target/surefire/surefirebooter4083252973247014628.jar /x1/jenkins/jenkins-slave/workspace/hbase-0.95-on-hadoop2/0.95-on-hadoop2/hbase-server/target/surefire/surefire5147560411017895460tmp /x1/jenkins/jenkins-slave/workspace/hbase-0.95-on-hadoop2/0.95-on-hadoop2/hbase-server/target/surefire/surefire_2047092864179051893913tmp
Running org.apache.hadoop.hbase.TestRegionRebalancing
Tests run: 2, Failures: 0, Errors: 0, Skipped: 0, Time elapsed: 25.381 sec
Forking command line: /bin/sh -c cd /x1/jenkins/jenkins-slave/workspace/hbase-0.95-on-hadoop2/0.95-on-hadoop2/hbase-server && /x1/jenkins/tools/java/jdk1.6.0_32-32/jre/bin/java -enableassertions -Xmx1900m -Djava.security.egd=file:/dev/./urandom -Djava.net.preferIPv4Stack=true -jar /x1/jenkins/jenkins-slave/workspace/hbase-0.95-on-hadoop2/0.95-on-hadoop2/hbase-server/target/surefire/surefirebooter6519781310852618861.jar /x1/jenkins/jenkins-slave/workspace/hbase-0.95-on-hadoop2/0.95-on-hadoop2/hbase-server/target/surefire/surefire7466041000842314893tmp /x1/jenkins/jenkins-slave/workspace/hbase-0.95-on-hadoop2/0.95-on-hadoop2/hbase-server/target/surefire/surefire_205420620574545156691tmp
Running org.apache.hadoop.hbase.mapred.TestTableInputFormat
Tests run: 10, Failures: 0, Errors: 0, Skipped: 0, Time elapsed: 19.629 sec
Forking command line: /bin/sh -c cd /x1/jenkins/jenkins-slave/workspace/hbase-0.95-on-hadoop2/0.95-on-hadoop2/hbase-server && /x1/jenkins/tools/java/jdk1.6.0_32-32/jre/bin/java -enableassertions -Xmx1900m -Djava.security.egd=file:/dev/./urandom -Djava.net.preferIPv4Stack=true -jar /x1/jenkins/jenkins-slave/workspace/hbase-0.95-on-hadoop2/0.95-on-hadoop2/hbase-server/target/surefire/surefirebooter1576062164462458529.jar /x1/jenkins/jenkins-slave/workspace/hbase-0.95-on-hadoop2/0.95-on-hadoop2/hbase-server/target/surefire/surefire6281918376468618495tmp /x1/jenkins/jenkins-slave/workspace/hbase-0.95-on-hadoop2/0.95-on-hadoop2/hbase-server/target/surefire/surefire_2068874502647689170568tmp
Running org.apache.hadoop.hbase.mapred.TestTableMapReduce
Tests run: 1, Failures: 0, Errors: 0, Skipped: 0, Time elapsed: 46.764 sec
Forking command line: /bin/sh -c cd /x1/jenkins/jenkins-slave/workspace/hbase-0.95-on-hadoop2/0.95-on-hadoop2/hbase-server && /x1/jenkins/tools/java/jdk1.6.0_32-32/jre/bin/java -enableassertions -Xmx1900m -Djava.security.egd=file:/dev/./urandom -Djava.net.preferIPv4Stack=true -jar /x1/jenkins/jenkins-slave/workspace/hbase-0.95-on-hadoop2/0.95-on-hadoop2/hbase-server/target/surefire/surefirebooter2011620634600580093.jar /x1/jenkins/jenkins-slave/workspace/hbase-0.95-on-hadoop2/0.95-on-hadoop2/hbase-server/target/surefire/surefire5503160931707146117tmp /x1/jenkins/jenkins-slave/workspace/hbase-0.95-on-hadoop2/0.95-on-hadoop2/hbase-server/target/surefire/surefire_2074462237446508700421tmp
Running org.apache.hadoop.hbase.io.encoding.TestChangingEncoding
Tests run: 4, Failures: 0, Errors: 0, Skipped: 0, Time elapsed: 164.496 sec
Forking command line: /bin/sh -c cd /x1/jenkins/jenkins-slave/workspace/hbase-0.95-on-hadoop2/0.95-on-hadoop2/hbase-server && /x1/jenkins/tools/java/jdk1.6.0_32-32/jre/bin/java -enableassertions -Xmx1900m -Djava.security.egd=file:/dev/./urandom -Djava.net.preferIPv4Stack=true -jar /x1/jenkins/jenkins-slave/workspace/hbase-0.95-on-hadoop2/0.95-on-hadoop2/hbase-server/target/surefire/surefirebooter8011304942026249767.jar /x1/jenkins/jenkins-slave/workspace/hbase-0.95-on-hadoop2/0.95-on-hadoop2/hbase-server/target/surefire/surefire1088968237023381235tmp /x1/jenkins/jenkins-slave/workspace/hbase-0.95-on-hadoop2/0.95-on-hadoop2/hbase-server/target/surefire/surefire_2081594320421064461057tmp
Running org.apache.hadoop.hbase.replication.TestReplicationDisableInactivePeer
Tests run: 1, Failures: 0, Errors: 0, Skipped: 0, Time elapsed: 33.822 sec
Forking command line: /bin/sh -c cd /x1/jenkins/jenkins-slave/workspace/hbase-0.95-on-hadoop2/0.95-on-hadoop2/hbase-server && /x1/jenkins/tools/java/jdk1.6.0_32-32/jre/bin/java -enableassertions -Xmx1900m -Djava.security.egd=file:/dev/./urandom -Djava.net.preferIPv4Stack=true -jar /x1/jenkins/jenkins-slave/workspace/hbase-0.95-on-hadoop2/0.95-on-hadoop2/hbase-server/target/surefire/surefirebooter7415223662577702658.jar /x1/jenkins/jenkins-slave/workspace/hbase-0.95-on-hadoop2/0.95-on-hadoop2/hbase-server/target/surefire/surefire6174980166157439301tmp /x1/jenkins/jenkins-slave/workspace/hbase-0.95-on-hadoop2/0.95-on-hadoop2/hbase-server/target/surefire/surefire_209634072575249506689tmp
Running org.apache.hadoop.hbase.replication.TestReplicationZookeeper
Tests run: 4, Failures: 0, Errors: 0, Skipped: 0, Time elapsed: 0.836 sec
Forking command line: /bin/sh -c cd /x1/jenkins/jenkins-slave/workspace/hbase-0.95-on-hadoop2/0.95-on-hadoop2/hbase-server && /x1/jenkins/tools/java/jdk1.6.0_32-32/jre/bin/java -enableassertions -Xmx1900m -Djava.security.egd=file:/dev/./urandom -Djava.net.preferIPv4Stack=true -jar /x1/jenkins/jenkins-slave/workspace/hbase-0.95-on-hadoop2/0.95-on-hadoop2/hbase-server/target/surefire/surefirebooter4392738310360704553.jar /x1/jenkins/jenkins-slave/workspace/hbase-0.95-on-hadoop2/0.95-on-hadoop2/hbase-server/target/surefire/surefire9121664255278550739tmp /x1/jenkins/jenkins-slave/workspace/hbase-0.95-on-hadoop2/0.95-on-hadoop2/hbase-server/target/surefire/surefire_2103197952623339888857tmp
Running org.apache.hadoop.hbase.replication.regionserver.TestReplicationSink
Tests run: 5, Failures: 0, Errors: 0, Skipped: 0, Time elapsed: 12.564 sec
Forking command line: /bin/sh -c cd /x1/jenkins/jenkins-slave/workspace/hbase-0.95-on-hadoop2/0.95-on-hadoop2/hbase-server && /x1/jenkins/tools/java/jdk1.6.0_32-32/jre/bin/java -enableassertions -Xmx1900m -Djava.security.egd=file:/dev/./urandom -Djava.net.preferIPv4Stack=true -jar /x1/jenkins/jenkins-slave/workspace/hbase-0.95-on-hadoop2/0.95-on-hadoop2/hbase-server/target/surefire/surefirebooter2444937493203476763.jar /x1/jenkins/jenkins-slave/workspace/hbase-0.95-on-hadoop2/0.95-on-hadoop2/hbase-server/target/surefire/surefire6510896162595220450tmp /x1/jenkins/jenkins-slave/workspace/hbase-0.95-on-hadoop2/0.95-on-hadoop2/hbase-server/target/surefire/surefire_2115021200314025921589tmp
Running org.apache.hadoop.hbase.replication.regionserver.TestReplicationSourceManager
Tests run: 2, Failures: 0, Errors: 0, Skipped: 0, Time elapsed: 1.655 sec
Forking command line: /bin/sh -c cd /x1/jenkins/jenkins-slave/workspace/hbase-0.95-on-hadoop2/0.95-on-hadoop2/hbase-server && /x1/jenkins/tools/java/jdk1.6.0_32-32/jre/bin/java -enableassertions -Xmx1900m -Djava.security.egd=file:/dev/./urandom -Djava.net.preferIPv4Stack=true -jar /x1/jenkins/jenkins-slave/workspace/hbase-0.95-on-hadoop2/0.95-on-hadoop2/hbase-server/target/surefire/surefirebooter2093349714063379003.jar /x1/jenkins/jenkins-slave/workspace/hbase-0.95-on-hadoop2/0.95-on-hadoop2/hbase-server/target/surefire/surefire7296678778132541330tmp /x1/jenkins/jenkins-slave/workspace/hbase-0.95-on-hadoop2/0.95-on-hadoop2/hbase-server/target/surefire/surefire_2121215974708594469681tmp
Running org.apache.hadoop.hbase.replication.TestReplicationSource
Tests run: 1, Failures: 0, Errors: 0, Skipped: 0, Time elapsed: 3.565 sec
Forking command line: /bin/sh -c cd /x1/jenkins/jenkins-slave/workspace/hbase-0.95-on-hadoop2/0.95-on-hadoop2/hbase-server && /x1/jenkins/tools/java/jdk1.6.0_32-32/jre/bin/java -enableassertions -Xmx1900m -Djava.security.egd=file:/dev/./urandom -Djava.net.preferIPv4Stack=true -jar /x1/jenkins/jenkins-slave/workspace/hbase-0.95-on-hadoop2/0.95-on-hadoop2/hbase-server/target/surefire/surefirebooter770043480811285210.jar /x1/jenkins/jenkins-slave/workspace/hbase-0.95-on-hadoop2/0.95-on-hadoop2/hbase-server/target/surefire/surefire2883617600772158441tmp /x1/jenkins/jenkins-slave/workspace/hbase-0.95-on-hadoop2/0.95-on-hadoop2/hbase-server/target/surefire/surefire_213521492127602713001tmp
Running org.apache.hadoop.hbase.replication.TestMultiSlaveReplication
Tests run: 1, Failures: 0, Errors: 0, Skipped: 0, Time elapsed: 25.464 sec
Forking command line: /bin/sh -c cd /x1/jenkins/jenkins-slave/workspace/hbase-0.95-on-hadoop2/0.95-on-hadoop2/hbase-server && /x1/jenkins/tools/java/jdk1.6.0_32-32/jre/bin/java -enableassertions -Xmx1900m -Djava.security.egd=file:/dev/./urandom -Djava.net.preferIPv4Stack=true -jar /x1/jenkins/jenkins-slave/workspace/hbase-0.95-on-hadoop2/0.95-on-hadoop2/hbase-server/target/surefire/surefirebooter1362181551914507317.jar /x1/jenkins/jenkins-slave/workspace/hbase-0.95-on-hadoop2/0.95-on-hadoop2/hbase-server/target/surefire/surefire3462237027109454288tmp /x1/jenkins/jenkins-slave/workspace/hbase-0.95-on-hadoop2/0.95-on-hadoop2/hbase-server/target/surefire/surefire_2144149791372524226532tmp
Running org.apache.hadoop.hbase.replication.TestReplicationQueueFailoverCompressed
Tests run: 1, Failures: 0, Errors: 0, Skipped: 0, Time elapsed: 98.089 sec
Forking command line: /bin/sh -c cd /x1/jenkins/jenkins-slave/workspace/hbase-0.95-on-hadoop2/0.95-on-hadoop2/hbase-server && /x1/jenkins/tools/java/jdk1.6.0_32-32/jre/bin/java -enableassertions -Xmx1900m -Djava.security.egd=file:/dev/./urandom -Djava.net.preferIPv4Stack=true -jar /x1/jenkins/jenkins-slave/workspace/hbase-0.95-on-hadoop2/0.95-on-hadoop2/hbase-server/target/surefire/surefirebooter7926449463376044336.jar /x1/jenkins/jenkins-slave/workspace/hbase-0.95-on-hadoop2/0.95-on-hadoop2/hbase-server/target/surefire/surefire1662191738992454916tmp /x1/jenkins/jenkins-slave/workspace/hbase-0.95-on-hadoop2/0.95-on-hadoop2/hbase-server/target/surefire/surefire_2156412999947533513672tmp
Running org.apache.hadoop.hbase.replication.TestReplicationQueueFailover
Tests run: 1, Failures: 0, Errors: 0, Skipped: 0, Time elapsed: 113.467 sec
Forking command line: /bin/sh -c cd /x1/jenkins/jenkins-slave/workspace/hbase-0.95-on-hadoop2/0.95-on-hadoop2/hbase-server && /x1/jenkins/tools/java/jdk1.6.0_32-32/jre/bin/java -enableassertions -Xmx1900m -Djava.security.egd=file:/dev/./urandom -Djava.net.preferIPv4Stack=true -jar /x1/jenkins/jenkins-slave/workspace/hbase-0.95-on-hadoop2/0.95-on-hadoop2/hbase-server/target/surefire/surefirebooter1901162978352501281.jar /x1/jenkins/jenkins-slave/workspace/hbase-0.95-on-hadoop2/0.95-on-hadoop2/hbase-server/target/surefire/surefire3466216323467150358tmp /x1/jenkins/jenkins-slave/workspace/hbase-0.95-on-hadoop2/0.95-on-hadoop2/hbase-server/target/surefire/surefire_2163634525887238652604tmp
Running org.apache.hadoop.hbase.util.TestMergeTool
Tests run: 1, Failures: 0, Errors: 0, Skipped: 0, Time elapsed: 14.389 sec
Forking command line: /bin/sh -c cd /x1/jenkins/jenkins-slave/workspace/hbase-0.95-on-hadoop2/0.95-on-hadoop2/hbase-server && /x1/jenkins/tools/java/jdk1.6.0_32-32/jre/bin/java -enableassertions -Xmx1900m -Djava.security.egd=file:/dev/./urandom -Djava.net.preferIPv4Stack=true -jar /x1/jenkins/jenkins-slave/workspace/hbase-0.95-on-hadoop2/0.95-on-hadoop2/hbase-server/target/surefire/surefirebooter8315934864132450244.jar /x1/jenkins/jenkins-slave/workspace/hbase-0.95-on-hadoop2/0.95-on-hadoop2/hbase-server/target/surefire/surefire3233788635585977711tmp /x1/jenkins/jenkins-slave/workspace/hbase-0.95-on-hadoop2/0.95-on-hadoop2/hbase-server/target/surefire/surefire_2177394200759609783719tmp
Running org.apache.hadoop.hbase.util.TestFSTableDescriptors
Tests run: 12, Failures: 0, Errors: 0, Skipped: 0, Time elapsed: 1.476 sec
Forking command line: /bin/sh -c cd /x1/jenkins/jenkins-slave/workspace/hbase-0.95-on-hadoop2/0.95-on-hadoop2/hbase-server && /x1/jenkins/tools/java/jdk1.6.0_32-32/jre/bin/java -enableassertions -Xmx1900m -Djava.security.egd=file:/dev/./urandom -Djava.net.preferIPv4Stack=true -jar /x1/jenkins/jenkins-slave/workspace/hbase-0.95-on-hadoop2/0.95-on-hadoop2/hbase-server/target/surefire/surefirebooter2563205003035820665.jar /x1/jenkins/jenkins-slave/workspace/hbase-0.95-on-hadoop2/0.95-on-hadoop2/hbase-server/target/surefire/surefire3784456008638066037tmp /x1/jenkins/jenkins-slave/workspace/hbase-0.95-on-hadoop2/0.95-on-hadoop2/hbase-server/target/surefire/surefire_2188885549983648773769tmp
Running org.apache.hadoop.hbase.replication.TestReplicationSmallTests
Tests run: 8, Failures: 0, Errors: 0, Skipped: 0, Time elapsed: 80.49 sec
Forking command line: /bin/sh -c cd /x1/jenkins/jenkins-slave/workspace/hbase-0.95-on-hadoop2/0.95-on-hadoop2/hbase-server && /x1/jenkins/tools/java/jdk1.6.0_32-32/jre/bin/java -enableassertions -Xmx1900m -Djava.security.egd=file:/dev/./urandom -Djava.net.preferIPv4Stack=true -jar /x1/jenkins/jenkins-slave/workspace/hbase-0.95-on-hadoop2/0.95-on-hadoop2/hbase-server/target/surefire/surefirebooter5552631239514606756.jar /x1/jenkins/jenkins-slave/workspace/hbase-0.95-on-hadoop2/0.95-on-hadoop2/hbase-server/target/surefire/surefire5760817210660810732tmp /x1/jenkins/jenkins-slave/workspace/hbase-0.95-on-hadoop2/0.95-on-hadoop2/hbase-server/target/surefire/surefire_2199075687951843991182tmp
Running org.apache.hadoop.hbase.replication.TestMasterReplication
Tests run: 2, Failures: 0, Errors: 0, Skipped: 0, Time elapsed: 38.098 sec
Forking command line: /bin/sh -c cd /x1/jenkins/jenkins-slave/workspace/hbase-0.95-on-hadoop2/0.95-on-hadoop2/hbase-server && /x1/jenkins/tools/java/jdk1.6.0_32-32/jre/bin/java -enableassertions -Xmx1900m -Djava.security.egd=file:/dev/./urandom -Djava.net.preferIPv4Stack=true -jar /x1/jenkins/jenkins-slave/workspace/hbase-0.95-on-hadoop2/0.95-on-hadoop2/hbase-server/target/surefire/surefirebooter476596808755097177.jar /x1/jenkins/jenkins-slave/workspace/hbase-0.95-on-hadoop2/0.95-on-hadoop2/hbase-server/target/surefire/surefire7709972726520704698tmp /x1/jenkins/jenkins-slave/workspace/hbase-0.95-on-hadoop2/0.95-on-hadoop2/hbase-server/target/surefire/surefire_2204601437711471744722tmp
Running org.apache.hadoop.hbase.util.TestIdLock
Tests run: 1, Failures: 0, Errors: 0, Skipped: 0, Time elapsed: 15.39 sec
Forking command line: /bin/sh -c cd /x1/jenkins/jenkins-slave/workspace/hbase-0.95-on-hadoop2/0.95-on-hadoop2/hbase-server && /x1/jenkins/tools/java/jdk1.6.0_32-32/jre/bin/java -enableassertions -Xmx1900m -Djava.security.egd=file:/dev/./urandom -Djava.net.preferIPv4Stack=true -jar /x1/jenkins/jenkins-slave/workspace/hbase-0.95-on-hadoop2/0.95-on-hadoop2/hbase-server/target/surefire/surefirebooter8503085202630643954.jar /x1/jenkins/jenkins-slave/workspace/hbase-0.95-on-hadoop2/0.95-on-hadoop2/hbase-server/target/surefire/surefire8657655938603503579tmp /x1/jenkins/jenkins-slave/workspace/hbase-0.95-on-hadoop2/0.95-on-hadoop2/hbase-server/target/surefire/surefire_2215590124372983760833tmp
Running org.apache.hadoop.hbase.util.TestMergeTable
Tests run: 1, Failures: 0, Errors: 0, Skipped: 0, Time elapsed: 18.463 sec
Forking command line: /bin/sh -c cd /x1/jenkins/jenkins-slave/workspace/hbase-0.95-on-hadoop2/0.95-on-hadoop2/hbase-server && /x1/jenkins/tools/java/jdk1.6.0_32-32/jre/bin/java -enableassertions -Xmx1900m -Djava.security.egd=file:/dev/./urandom -Djava.net.preferIPv4Stack=true -jar /x1/jenkins/jenkins-slave/workspace/hbase-0.95-on-hadoop2/0.95-on-hadoop2/hbase-server/target/surefire/surefirebooter6928361430734472443.jar /x1/jenkins/jenkins-slave/workspace/hbase-0.95-on-hadoop2/0.95-on-hadoop2/hbase-server/target/surefire/surefire8473122486174599044tmp /x1/jenkins/jenkins-slave/workspace/hbase-0.95-on-hadoop2/0.95-on-hadoop2/hbase-server/target/surefire/surefire_2221962227599226430718tmp
Forking command line: /bin/sh -c cd /x1/jenkins/jenkins-slave/workspace/hbase-0.95-on-hadoop2/0.95-on-hadoop2/hbase-server && /x1/jenkins/tools/java/jdk1.6.0_32-32/jre/bin/java -enableassertions -Xmx1900m -Djava.security.egd=file:/dev/./urandom -Djava.net.preferIPv4Stack=true -jar /x1/jenkins/jenkins-slave/workspace/hbase-0.95-on-hadoop2/0.95-on-hadoop2/hbase-server/target/surefire/surefirebooter2031289945595005974.jar /x1/jenkins/jenkins-slave/workspace/hbase-0.95-on-hadoop2/0.95-on-hadoop2/hbase-server/target/surefire/surefire7876292693366679869tmp /x1/jenkins/jenkins-slave/workspace/hbase-0.95-on-hadoop2/0.95-on-hadoop2/hbase-server/target/surefire/surefire_2234415125296199802858tmp
Running org.apache.hadoop.hbase.util.TestFSUtils
Tests run: 6, Failures: 0, Errors: 0, Skipped: 0, Time elapsed: 9.392 sec
Forking command line: /bin/sh -c cd /x1/jenkins/jenkins-slave/workspace/hbase-0.95-on-hadoop2/0.95-on-hadoop2/hbase-server && /x1/jenkins/tools/java/jdk1.6.0_32-32/jre/bin/java -enableassertions -Xmx1900m -Djava.security.egd=file:/dev/./urandom -Djava.net.preferIPv4Stack=true -jar /x1/jenkins/jenkins-slave/workspace/hbase-0.95-on-hadoop2/0.95-on-hadoop2/hbase-server/target/surefire/surefirebooter3783713558957348163.jar /x1/jenkins/jenkins-slave/workspace/hbase-0.95-on-hadoop2/0.95-on-hadoop2/hbase-server/target/surefire/surefire8350278777717264309tmp /x1/jenkins/jenkins-slave/workspace/hbase-0.95-on-hadoop2/0.95-on-hadoop2/hbase-server/target/surefire/surefire_224502457356475347799tmp
Running org.apache.hadoop.hbase.util.TestRegionSplitter
Tests run: 5, Failures: 0, Errors: 0, Skipped: 0, Time elapsed: 12.264 sec
Forking command line: /bin/sh -c cd /x1/jenkins/jenkins-slave/workspace/hbase-0.95-on-hadoop2/0.95-on-hadoop2/hbase-server && /x1/jenkins/tools/java/jdk1.6.0_32-32/jre/bin/java -enableassertions -Xmx1900m -Djava.security.egd=file:/dev/./urandom -Djava.net.preferIPv4Stack=true -jar /x1/jenkins/jenkins-slave/workspace/hbase-0.95-on-hadoop2/0.95-on-hadoop2/hbase-server/target/surefire/surefirebooter3106554292877119184.jar /x1/jenkins/jenkins-slave/workspace/hbase-0.95-on-hadoop2/0.95-on-hadoop2/hbase-server/target/surefire/surefire8582341318570598240tmp /x1/jenkins/jenkins-slave/workspace/hbase-0.95-on-hadoop2/0.95-on-hadoop2/hbase-server/target/surefire/surefire_225185980246938709933tmp
Running org.apache.hadoop.hbase.util.TestProcessBasedCluster
Tests run: 1, Failures: 0, Errors: 0, Skipped: 0, Time elapsed: 0.421 sec
Forking command line: /bin/sh -c cd /x1/jenkins/jenkins-slave/workspace/hbase-0.95-on-hadoop2/0.95-on-hadoop2/hbase-server && /x1/jenkins/tools/java/jdk1.6.0_32-32/jre/bin/java -enableassertions -Xmx1900m -Djava.security.egd=file:/dev/./urandom -Djava.net.preferIPv4Stack=true -jar /x1/jenkins/jenkins-slave/workspace/hbase-0.95-on-hadoop2/0.95-on-hadoop2/hbase-server/target/surefire/surefirebooter7419409695992888487.jar /x1/jenkins/jenkins-slave/workspace/hbase-0.95-on-hadoop2/0.95-on-hadoop2/hbase-server/target/surefire/surefire4010396780290835056tmp /x1/jenkins/jenkins-slave/workspace/hbase-0.95-on-hadoop2/0.95-on-hadoop2/hbase-server/target/surefire/surefire_2264140686521875656592tmp
Running org.apache.hadoop.hbase.util.TestMiniClusterLoadEncoded
Tests run: 5, Failures: 0, Errors: 0, Skipped: 0, Time elapsed: 93.282 sec
Forking command line: /bin/sh -c cd /x1/jenkins/jenkins-slave/workspace/hbase-0.95-on-hadoop2/0.95-on-hadoop2/hbase-server && /x1/jenkins/tools/java/jdk1.6.0_32-32/jre/bin/java -enableassertions -Xmx1900m -Djava.security.egd=file:/dev/./urandom -Djava.net.preferIPv4Stack=true -jar /x1/jenkins/jenkins-slave/workspace/hbase-0.95-on-hadoop2/0.95-on-hadoop2/hbase-server/target/surefire/surefirebooter6788243423221063655.jar /x1/jenkins/jenkins-slave/workspace/hbase-0.95-on-hadoop2/0.95-on-hadoop2/hbase-server/target/surefire/surefire3660972332094592733tmp /x1/jenkins/jenkins-slave/workspace/hbase-0.95-on-hadoop2/0.95-on-hadoop2/hbase-server/target/surefire/surefire_2272658515128499171683tmp
Running org.apache.hadoop.hbase.util.TestCoprocessorScanPolicy
Tests run: 4, Failures: 0, Errors: 0, Skipped: 0, Time elapsed: 18.468 sec
Forking command line: /bin/sh -c cd /x1/jenkins/jenkins-slave/workspace/hbase-0.95-on-hadoop2/0.95-on-hadoop2/hbase-server && /x1/jenkins/tools/java/jdk1.6.0_32-32/jre/bin/java -enableassertions -Xmx1900m -Djava.security.egd=file:/dev/./urandom -Djava.net.preferIPv4Stack=true -jar /x1/jenkins/jenkins-slave/workspace/hbase-0.95-on-hadoop2/0.95-on-hadoop2/hbase-server/target/surefire/surefirebooter3007968889578555773.jar /x1/jenkins/jenkins-slave/workspace/hbase-0.95-on-hadoop2/0.95-on-hadoop2/hbase-server/target/surefire/surefire1506868595819466469tmp /x1/jenkins/jenkins-slave/workspace/hbase-0.95-on-hadoop2/0.95-on-hadoop2/hbase-server/target/surefire/surefire_2288097395531885970090tmp
Running org.apache.hadoop.hbase.util.TestFSVisitor
Tests run: 3, Failures: 0, Errors: 0, Skipped: 0, Time elapsed: 3.66 sec
Forking command line: /bin/sh -c cd /x1/jenkins/jenkins-slave/workspace/hbase-0.95-on-hadoop2/0.95-on-hadoop2/hbase-server && /x1/jenkins/tools/java/jdk1.6.0_32-32/jre/bin/java -enableassertions -Xmx1900m -Djava.security.egd=file:/dev/./urandom -Djava.net.preferIPv4Stack=true -jar /x1/jenkins/jenkins-slave/workspace/hbase-0.95-on-hadoop2/0.95-on-hadoop2/hbase-server/target/surefire/surefirebooter2354183673581235568.jar /x1/jenkins/jenkins-slave/workspace/hbase-0.95-on-hadoop2/0.95-on-hadoop2/hbase-server/target/surefire/surefire8388619049375923754tmp /x1/jenkins/jenkins-slave/workspace/hbase-0.95-on-hadoop2/0.95-on-hadoop2/hbase-server/target/surefire/surefire_2292818579389317972536tmp
Running org.apache.hadoop.hbase.util.hbck.TestOfflineMetaRebuildBase
Tests run: 1, Failures: 0, Errors: 0, Skipped: 0, Time elapsed: 20.353 sec
Forking command line: /bin/sh -c cd /x1/jenkins/jenkins-slave/workspace/hbase-0.95-on-hadoop2/0.95-on-hadoop2/hbase-server && /x1/jenkins/tools/java/jdk1.6.0_32-32/jre/bin/java -enableassertions -Xmx1900m -Djava.security.egd=file:/dev/./urandom -Djava.net.preferIPv4Stack=true -jar /x1/jenkins/jenkins-slave/workspace/hbase-0.95-on-hadoop2/0.95-on-hadoop2/hbase-server/target/surefire/surefirebooter7748612109948414543.jar /x1/jenkins/jenkins-slave/workspace/hbase-0.95-on-hadoop2/0.95-on-hadoop2/hbase-server/target/surefire/surefire3502131983613295001tmp /x1/jenkins/jenkins-slave/workspace/hbase-0.95-on-hadoop2/0.95-on-hadoop2/hbase-server/target/surefire/surefire_2303518222326763930442tmp
Running org.apache.hadoop.hbase.util.hbck.TestOfflineMetaRebuildOverlap
Tests run: 1, Failures: 0, Errors: 0, Skipped: 0, Time elapsed: 18.634 sec
Forking command line: /bin/sh -c cd /x1/jenkins/jenkins-slave/workspace/hbase-0.95-on-hadoop2/0.95-on-hadoop2/hbase-server && /x1/jenkins/tools/java/jdk1.6.0_32-32/jre/bin/java -enableassertions -Xmx1900m -Djava.security.egd=file:/dev/./urandom -Djava.net.preferIPv4Stack=true -jar /x1/jenkins/jenkins-slave/workspace/hbase-0.95-on-hadoop2/0.95-on-hadoop2/hbase-server/target/surefire/surefirebooter8922039300646589783.jar /x1/jenkins/jenkins-slave/workspace/hbase-0.95-on-hadoop2/0.95-on-hadoop2/hbase-server/target/surefire/surefire9178677958662029890tmp /x1/jenkins/jenkins-slave/workspace/hbase-0.95-on-hadoop2/0.95-on-hadoop2/hbase-server/target/surefire/surefire_2311048631620163741458tmp
Running org.apache.hadoop.hbase.util.TestHBaseFsck
Tests run: 35, Failures: 0, Errors: 0, Skipped: 1, Time elapsed: 222.672 sec
Forking command line: /bin/sh -c cd /x1/jenkins/jenkins-slave/workspace/hbase-0.95-on-hadoop2/0.95-on-hadoop2/hbase-server && /x1/jenkins/tools/java/jdk1.6.0_32-32/jre/bin/java -enableassertions -Xmx1900m -Djava.security.egd=file:/dev/./urandom -Djava.net.preferIPv4Stack=true -jar /x1/jenkins/jenkins-slave/workspace/hbase-0.95-on-hadoop2/0.95-on-hadoop2/hbase-server/target/surefire/surefirebooter3369040190594028988.jar /x1/jenkins/jenkins-slave/workspace/hbase-0.95-on-hadoop2/0.95-on-hadoop2/hbase-server/target/surefire/surefire4632331462056126154tmp /x1/jenkins/jenkins-slave/workspace/hbase-0.95-on-hadoop2/0.95-on-hadoop2/hbase-server/target/surefire/surefire_232739059098956167952tmp
Running org.apache.hadoop.hbase.util.TestDefaultEnvironmentEdge
Tests run: 1, Failures: 0, Errors: 0, Skipped: 0, Time elapsed: 0.289 sec
Forking command line: /bin/sh -c cd /x1/jenkins/jenkins-slave/workspace/hbase-0.95-on-hadoop2/0.95-on-hadoop2/hbase-server && /x1/jenkins/tools/java/jdk1.6.0_32-32/jre/bin/java -enableassertions -Xmx1900m -Djava.security.egd=file:/dev/./urandom -Djava.net.preferIPv4Stack=true -jar /x1/jenkins/jenkins-slave/workspace/hbase-0.95-on-hadoop2/0.95-on-hadoop2/hbase-server/target/surefire/surefirebooter7280109599278770922.jar /x1/jenkins/jenkins-slave/workspace/hbase-0.95-on-hadoop2/0.95-on-hadoop2/hbase-server/target/surefire/surefire9106350583623857493tmp /x1/jenkins/jenkins-slave/workspace/hbase-0.95-on-hadoop2/0.95-on-hadoop2/hbase-server/target/surefire/surefire_2335835485122796312667tmp
Running org.apache.hadoop.hbase.TestInfoServers
Tests run: 3, Failures: 0, Errors: 0, Skipped: 0, Time elapsed: 10.862 sec
Running org.apache.hadoop.hbase.util.hbck.TestOfflineMetaRebuildHole
Tests run: 1, Failures: 0, Errors: 0, Skipped: 0, Time elapsed: 17.793 sec
Running org.apache.hadoop.hbase.util.TestMiniClusterLoadParallel
Tests run: 4, Failures: 0, Errors: 2, Skipped: 0, Time elapsed: 461.609 sec <<< FAILURE!
Running org.apache.hadoop.hbase.util.TestMiniClusterLoadSequential
Tests run: 4, Failures: 0, Errors: 2, Skipped: 0, Time elapsed: 487.395 sec <<< FAILURE!

Results :

Failed tests:   testThreeRSAbort(org.apache.hadoop.hbase.master.TestDistributedLogSplitting): Timedout
  testWALPlayer(org.apache.hadoop.hbase.mapreduce.TestWALPlayer): expected:<0> but was:<1>
  testBulkOutputWithAnExistingTable(org.apache.hadoop.hbase.mapreduce.TestImportTsv): expected:<0> but was:<1>
  testMRIncrementalLoad(org.apache.hadoop.hbase.mapreduce.TestHFileOutputFormat)
  testMRIncrementalLoadWithSplit(org.apache.hadoop.hbase.mapreduce.TestHFileOutputFormat)

Tests in error: 
  testExportScannerBatching(org.apache.hadoop.hbase.mapreduce.TestImportExport)
  testWithFilter(org.apache.hadoop.hbase.mapreduce.TestImportExport)
  testJoinedScanners(org.apache.hadoop.hbase.regionserver.TestJoinedScanners): Failed 20 actions: NotServingRegionException: 20 times, 
  testLogRollOnDatanodeDeath(org.apache.hadoop.hbase.regionserver.wal.TestLogRolling): Failed 1 action: ConnectException: 1 time, 
  loadTest[0](org.apache.hadoop.hbase.util.TestMiniClusterLoadParallel): test timed out after 180000 milliseconds
  loadTest[1](org.apache.hadoop.hbase.util.TestMiniClusterLoadParallel): test timed out after 180000 milliseconds
  loadTest[0](org.apache.hadoop.hbase.util.TestMiniClusterLoadSequential): test timed out after 180000 milliseconds
  loadTest[1](org.apache.hadoop.hbase.util.TestMiniClusterLoadSequential): test timed out after 180000 milliseconds

Tests run: 1359, Failures: 5, Errors: 8, Skipped: 13

[INFO]                                                                         
[INFO] ------------------------------------------------------------------------
[INFO] Skipping HBase
[INFO] This project has been banned from the build due to previous failures.
[INFO] ------------------------------------------------------------------------
[INFO] ------------------------------------------------------------------------
[INFO] Reactor Summary:
[INFO] 
[INFO] HBase ............................................. SUCCESS [10.102s]
[INFO] HBase - Common .................................... SUCCESS [19.448s]
[INFO] HBase - Protocol .................................. SUCCESS [12.971s]
[INFO] HBase - Client .................................... SUCCESS [7.576s]
[INFO] HBase - Prefix Tree ............................... SUCCESS [2.970s]
[INFO] HBase - Hadoop Compatibility ...................... SUCCESS [0.696s]
[INFO] HBase - Hadoop Two Compatibility .................. SUCCESS [2.564s]
[INFO] HBase - Server .................................... FAILURE [54:09.966s]
[INFO] HBase - Integration Tests ......................... SKIPPED
[INFO] HBase - Examples .................................. SKIPPED
[INFO] ------------------------------------------------------------------------
[INFO] BUILD FAILURE
[INFO] ------------------------------------------------------------------------
[INFO] Total time: 55:10.967s
[INFO] Finished at: Sun Mar 17 12:12:40 UTC 2013
[INFO] Final Memory: 115M/668M
[INFO] ------------------------------------------------------------------------
[ERROR] Failed to execute goal org.apache.maven.plugins:maven-surefire-plugin:2.12-TRUNK-HBASE-2:test (secondPartTestsExecution) on project hbase-server: Failure or timeout -> [Help 1]
org.apache.maven.lifecycle.LifecycleExecutionException: Failed to execute goal org.apache.maven.plugins:maven-surefire-plugin:2.12-TRUNK-HBASE-2:test (secondPartTestsExecution) on project hbase-server: Failure or timeout
	at org.apache.maven.lifecycle.internal.MojoExecutor.execute(MojoExecutor.java:217)
	at org.apache.maven.lifecycle.internal.MojoExecutor.execute(MojoExecutor.java:153)
	at org.apache.maven.lifecycle.internal.MojoExecutor.execute(MojoExecutor.java:145)
	at org.apache.maven.lifecycle.internal.LifecycleModuleBuilder.buildProject(LifecycleModuleBuilder.java:84)
	at org.apache.maven.lifecycle.internal.LifecycleModuleBuilder.buildProject(LifecycleModuleBuilder.java:59)
	at org.apache.maven.lifecycle.internal.LifecycleStarter.singleThreadedBuild(LifecycleStarter.java:183)
	at org.apache.maven.lifecycle.internal.LifecycleStarter.execute(LifecycleStarter.java:161)
	at org.apache.maven.DefaultMaven.doExecute(DefaultMaven.java:320)
	at org.apache.maven.DefaultMaven.execute(DefaultMaven.java:156)
	at org.apache.maven.cli.MavenCli.execute(MavenCli.java:537)
	at org.apache.maven.cli.MavenCli.doMain(MavenCli.java:196)
	at org.apache.maven.cli.MavenCli.main(MavenCli.java:141)
	at sun.reflect.NativeMethodAccessorImpl.invoke0(Native Method)
	at sun.reflect.NativeMethodAccessorImpl.invoke(NativeMethodAccessorImpl.java:39)
	at sun.reflect.DelegatingMethodAccessorImpl.invoke(DelegatingMethodAccessorImpl.java:25)
	at java.lang.reflect.Method.invoke(Method.java:597)
	at org.codehaus.plexus.classworlds.launcher.Launcher.launchEnhanced(Launcher.java:290)
	at org.codehaus.plexus.classworlds.launcher.Launcher.launch(Launcher.java:230)
	at org.codehaus.plexus.classworlds.launcher.Launcher.mainWithExitCode(Launcher.java:409)
	at org.codehaus.plexus.classworlds.launcher.Launcher.main(Launcher.java:352)
Caused by: org.apache.maven.plugin.MojoExecutionException: Failure or timeout
	at org.apache.maven.plugin.surefire.SurefirePlugin.assertNoFailureOrTimeout(SurefirePlugin.java:643)
	at org.apache.maven.plugin.surefire.SurefirePlugin.handleSummary(SurefirePlugin.java:624)
	at org.apache.maven.plugin.surefire.AbstractSurefireMojo.executeAfterPreconditionsChecked(AbstractSurefireMojo.java:137)
	at org.apache.maven.plugin.surefire.AbstractSurefireMojo.execute(AbstractSurefireMojo.java:98)
	at org.apache.maven.plugin.DefaultBuildPluginManager.executeMojo(DefaultBuildPluginManager.java:101)
	at org.apache.maven.lifecycle.internal.MojoExecutor.execute(MojoExecutor.java:209)
	... 19 more
[ERROR] 
[ERROR] 
[ERROR] For more information about the errors and possible solutions, please read the following articles:
[ERROR] [Help 1] http://cwiki.apache.org/confluence/display/MAVEN/MojoExecutionException
[ERROR] 
[ERROR] After correcting the problems, you can resume the build with the command
[ERROR]   mvn <goals> -rf :hbase-server
Build step 'Invoke top-level Maven targets' marked build as failure
Archiving artifacts
Recording test results
Updating HBASE-8067

Mime
View raw message