hbase-dev mailing list archives

Site index · List index
Message view « Date » · « Thread »
Top « Date » · « Thread »
From Apache Jenkins Server <jenk...@builds.apache.org>
Subject Build failed in Jenkins: hbase-0.95-on-hadoop2 #20
Date Mon, 11 Mar 2013 14:38:54 GMT
See <https://builds.apache.org/job/hbase-0.95-on-hadoop2/20/changes>

Changes:

[stack] HBASE-8058 Upgrade site plugin; fix assembly doc up on jenkins builds

------------------------------------------
[...truncated 22565 lines...]
	at org.apache.hadoop.hbase.MiniHBaseCluster$MiniHBaseClusterRegionServer$1.run(MiniHBaseCluster.java:135)
	at java.security.AccessController.doPrivileged(Native Method)
	at javax.security.auth.Subject.doAs(Subject.java:337)
	at org.apache.hadoop.security.UserGroupInformation.doAs(UserGroupInformation.java:1347)
	at sun.reflect.NativeMethodAccessorImpl.invoke0(Native Method)
	at sun.reflect.NativeMethodAccessorImpl.invoke(NativeMethodAccessorImpl.java:39)
	at sun.reflect.DelegatingMethodAccessorImpl.invoke(DelegatingMethodAccessorImpl.java:25)
	at java.lang.reflect.Method.invoke(Method.java:597)
	at org.apache.hadoop.hbase.util.Methods.call(Methods.java:41)
	at org.apache.hadoop.hbase.security.User.call(User.java:403)
	at org.apache.hadoop.hbase.security.User.access$300(User.java:51)
	at org.apache.hadoop.hbase.security.User$SecureHadoopUser.runAs(User.java:243)
	at org.apache.hadoop.hbase.MiniHBaseCluster$MiniHBaseClusterRegionServer.run(MiniHBaseCluster.java:133)
	at java.lang.Thread.run(Thread.java:662)
java.lang.InterruptedException: sleep interrupted
	at java.lang.Thread.sleep(Native Method)
	at org.apache.hadoop.hbase.util.Threads.sleep(Threads.java:133)
	at org.apache.hadoop.hbase.regionserver.HRegionServer.waitOnAllRegionsToClose(HRegionServer.java:1152)
	at org.apache.hadoop.hbase.regionserver.HRegionServer.run(HRegionServer.java:989)
	at org.apache.hadoop.hbase.MiniHBaseCluster$MiniHBaseClusterRegionServer.runRegionServer(MiniHBaseCluster.java:151)
	at org.apache.hadoop.hbase.MiniHBaseCluster$MiniHBaseClusterRegionServer.access$000(MiniHBaseCluster.java:103)
	at org.apache.hadoop.hbase.MiniHBaseCluster$MiniHBaseClusterRegionServer$1.run(MiniHBaseCluster.java:135)
	at java.security.AccessController.doPrivileged(Native Method)
	at javax.security.auth.Subject.doAs(Subject.java:337)
	at org.apache.hadoop.security.UserGroupInformation.doAs(UserGroupInformation.java:1347)
	at sun.reflect.NativeMethodAccessorImpl.invoke0(Native Method)
	at sun.reflect.NativeMethodAccessorImpl.invoke(NativeMethodAccessorImpl.java:39)
	at sun.reflect.DelegatingMethodAccessorImpl.invoke(DelegatingMethodAccessorImpl.java:25)
	at java.lang.reflect.Method.invoke(Method.java:597)
	at org.apache.hadoop.hbase.util.Methods.call(Methods.java:41)
	at org.apache.hadoop.hbase.security.User.call(User.java:403)
	at org.apache.hadoop.hbase.security.User.access$300(User.java:51)
	at org.apache.hadoop.hbase.security.User$SecureHadoopUser.runAs(User.java:243)
	at org.apache.hadoop.hbase.MiniHBaseCluster$MiniHBaseClusterRegionServer.run(MiniHBaseCluster.java:133)
	at java.lang.Thread.run(Thread.java:662)
java.lang.InterruptedException: sleep interrupted
	at java.lang.Thread.sleep(Native Method)
	at org.apache.hadoop.hbase.util.Threads.sleep(Threads.java:133)
	at org.apache.hadoop.hbase.regionserver.HRegionServer.waitOnAllRegionsToClose(HRegionServer.java:1152)
	at org.apache.hadoop.hbase.regionserver.HRegionServer.run(HRegionServer.java:989)
	at org.apache.hadoop.hbase.MiniHBaseCluster$MiniHBaseClusterRegionServer.runRegionServer(MiniHBaseCluster.java:151)
	at org.apache.hadoop.hbase.MiniHBaseCluster$MiniHBaseClusterRegionServer.access$000(MiniHBaseCluster.java:103)
	at org.apache.hadoop.hbase.MiniHBaseCluster$MiniHBaseClusterRegionServer$1.run(MiniHBaseCluster.java:135)
	at java.security.AccessController.doPrivileged(Native Method)
	at javax.security.auth.Subject.doAs(Subject.java:337)
	at org.apache.hadoop.security.UserGroupInformation.doAs(UserGroupInformation.java:1347)
	at sun.reflect.NativeMethodAccessorImpl.invoke0(Native Method)
	at sun.reflect.NativeMethodAccessorImpl.invoke(NativeMethodAccessorImpl.java:39)
	at sun.reflect.DelegatingMethodAccessorImpl.invoke(DelegatingMethodAccessorImpl.java:25)
	at java.lang.reflect.Method.invoke(Method.java:597)
	at org.apache.hadoop.hbase.util.Methods.call(Methods.java:41)
	at org.apache.hadoop.hbase.security.User.call(User.java:403)
	at org.apache.hadoop.hbase.security.User.access$300(User.java:51)
	at org.apache.hadoop.hbase.security.User$SecureHadoopUser.runAs(User.java:243)
	at org.apache.hadoop.hbase.MiniHBaseCluster$MiniHBaseClusterRegionServer.run(MiniHBaseCluster.java:133)
	at java.lang.Thread.run(Thread.java:662)
Forking command line: /bin/sh -c cd <https://builds.apache.org/job/hbase-0.95-on-hadoop2/ws/0.95-on-hadoop2/hbase-server> && /home/jenkins/tools/java/jdk1.6.0_27-32/jre/bin/java -enableassertions -Xmx1900m -Djava.security.egd=file:/dev/./urandom -Djava.net.preferIPv4Stack=true -jar <https://builds.apache.org/job/hbase-0.95-on-hadoop2/ws/0.95-on-hadoop2/hbase-server/target/surefire/surefirebooter6843874135135046785.jar> <https://builds.apache.org/job/hbase-0.95-on-hadoop2/ws/0.95-on-hadoop2/hbase-server/target/surefire/surefire4210525351174093799tmp> <https://builds.apache.org/job/hbase-0.95-on-hadoop2/ws/0.95-on-hadoop2/hbase-server/target/surefire/surefire_515870168203879266957tmp>
Running org.apache.hadoop.hbase.util.TestFSUtils
Tests run: 6, Failures: 0, Errors: 0, Skipped: 0, Time elapsed: 324.236 sec
Running org.apache.hadoop.hbase.util.TestCoprocessorScanPolicy
Forking command line: /bin/sh -c cd <https://builds.apache.org/job/hbase-0.95-on-hadoop2/ws/0.95-on-hadoop2/hbase-server> && /home/jenkins/tools/java/jdk1.6.0_27-32/jre/bin/java -enableassertions -Xmx1900m -Djava.security.egd=file:/dev/./urandom -Djava.net.preferIPv4Stack=true -jar <https://builds.apache.org/job/hbase-0.95-on-hadoop2/ws/0.95-on-hadoop2/hbase-server/target/surefire/surefirebooter125812600858247002.jar> <https://builds.apache.org/job/hbase-0.95-on-hadoop2/ws/0.95-on-hadoop2/hbase-server/target/surefire/surefire873253047332075845tmp> <https://builds.apache.org/job/hbase-0.95-on-hadoop2/ws/0.95-on-hadoop2/hbase-server/target/surefire/surefire_523943303388373494938tmp>
Tests run: 4, Failures: 0, Errors: 0, Skipped: 0, Time elapsed: 329.235 sec
Forking command line: /bin/sh -c cd <https://builds.apache.org/job/hbase-0.95-on-hadoop2/ws/0.95-on-hadoop2/hbase-server> && /home/jenkins/tools/java/jdk1.6.0_27-32/jre/bin/java -enableassertions -Xmx1900m -Djava.security.egd=file:/dev/./urandom -Djava.net.preferIPv4Stack=true -jar <https://builds.apache.org/job/hbase-0.95-on-hadoop2/ws/0.95-on-hadoop2/hbase-server/target/surefire/surefirebooter8488844414985947495.jar> <https://builds.apache.org/job/hbase-0.95-on-hadoop2/ws/0.95-on-hadoop2/hbase-server/target/surefire/surefire8639131498649885299tmp> <https://builds.apache.org/job/hbase-0.95-on-hadoop2/ws/0.95-on-hadoop2/hbase-server/target/surefire/surefire_535709758024195739271tmp>
Running org.apache.hadoop.hbase.trace.TestHTraceHooks
Tests run: 1, Failures: 0, Errors: 0, Skipped: 0, Time elapsed: 166.461 sec
Running org.apache.hadoop.hbase.TestDrainingServer
Forking command line: /bin/sh -c cd <https://builds.apache.org/job/hbase-0.95-on-hadoop2/ws/0.95-on-hadoop2/hbase-server> && /home/jenkins/tools/java/jdk1.6.0_27-32/jre/bin/java -enableassertions -Xmx1900m -Djava.security.egd=file:/dev/./urandom -Djava.net.preferIPv4Stack=true -jar <https://builds.apache.org/job/hbase-0.95-on-hadoop2/ws/0.95-on-hadoop2/hbase-server/target/surefire/surefirebooter4223884222565163822.jar> <https://builds.apache.org/job/hbase-0.95-on-hadoop2/ws/0.95-on-hadoop2/hbase-server/target/surefire/surefire6336367981559972203tmp> <https://builds.apache.org/job/hbase-0.95-on-hadoop2/ws/0.95-on-hadoop2/hbase-server/target/surefire/surefire_542017604983831678283tmp>
Tests run: 2, Failures: 0, Errors: 0, Skipped: 0, Time elapsed: 177.103 sec
Forking command line: /bin/sh -c cd <https://builds.apache.org/job/hbase-0.95-on-hadoop2/ws/0.95-on-hadoop2/hbase-server> && /home/jenkins/tools/java/jdk1.6.0_27-32/jre/bin/java -enableassertions -Xmx1900m -Djava.security.egd=file:/dev/./urandom -Djava.net.preferIPv4Stack=true -jar <https://builds.apache.org/job/hbase-0.95-on-hadoop2/ws/0.95-on-hadoop2/hbase-server/target/surefire/surefirebooter5180386019057271454.jar> <https://builds.apache.org/job/hbase-0.95-on-hadoop2/ws/0.95-on-hadoop2/hbase-server/target/surefire/surefire2624688987452558641tmp> <https://builds.apache.org/job/hbase-0.95-on-hadoop2/ws/0.95-on-hadoop2/hbase-server/target/surefire/surefire_552090088466293216084tmp>
Running org.apache.hadoop.hbase.client.TestHTablePool$TestHTableReusablePool
Tests run: 8, Failures: 0, Errors: 0, Skipped: 0, Time elapsed: 17.528 sec
Running org.apache.hadoop.hbase.client.TestMetaScanner
Tests run: 1, Failures: 0, Errors: 0, Skipped: 0, Time elapsed: 121.76 sec
Forking command line: /bin/sh -c cd <https://builds.apache.org/job/hbase-0.95-on-hadoop2/ws/0.95-on-hadoop2/hbase-server> && /home/jenkins/tools/java/jdk1.6.0_27-32/jre/bin/java -enableassertions -Xmx1900m -Djava.security.egd=file:/dev/./urandom -Djava.net.preferIPv4Stack=true -jar <https://builds.apache.org/job/hbase-0.95-on-hadoop2/ws/0.95-on-hadoop2/hbase-server/target/surefire/surefirebooter5935304234344798903.jar> <https://builds.apache.org/job/hbase-0.95-on-hadoop2/ws/0.95-on-hadoop2/hbase-server/target/surefire/surefire2836641024406268208tmp> <https://builds.apache.org/job/hbase-0.95-on-hadoop2/ws/0.95-on-hadoop2/hbase-server/target/surefire/surefire_563296512864588216186tmp>
Running org.apache.hadoop.hbase.client.TestHTablePool$TestHTableThreadLocalPool
Tests run: 8, Failures: 0, Errors: 0, Skipped: 0, Time elapsed: 139.243 sec
Forking command line: /bin/sh -c cd <https://builds.apache.org/job/hbase-0.95-on-hadoop2/ws/0.95-on-hadoop2/hbase-server> && /home/jenkins/tools/java/jdk1.6.0_27-32/jre/bin/java -enableassertions -Xmx1900m -Djava.security.egd=file:/dev/./urandom -Djava.net.preferIPv4Stack=true -jar <https://builds.apache.org/job/hbase-0.95-on-hadoop2/ws/0.95-on-hadoop2/hbase-server/target/surefire/surefirebooter1184605748538206893.jar> <https://builds.apache.org/job/hbase-0.95-on-hadoop2/ws/0.95-on-hadoop2/hbase-server/target/surefire/surefire8701375846441094466tmp> <https://builds.apache.org/job/hbase-0.95-on-hadoop2/ws/0.95-on-hadoop2/hbase-server/target/surefire/surefire_571664649776856906011tmp>
Running org.apache.hadoop.hbase.client.TestClientTimeouts
Tests run: 1, Failures: 0, Errors: 0, Skipped: 0, Time elapsed: 325.93 sec
Forking command line: /bin/sh -c cd <https://builds.apache.org/job/hbase-0.95-on-hadoop2/ws/0.95-on-hadoop2/hbase-server> && /home/jenkins/tools/java/jdk1.6.0_27-32/jre/bin/java -enableassertions -Xmx1900m -Djava.security.egd=file:/dev/./urandom -Djava.net.preferIPv4Stack=true -jar <https://builds.apache.org/job/hbase-0.95-on-hadoop2/ws/0.95-on-hadoop2/hbase-server/target/surefire/surefirebooter1143744059548546688.jar> <https://builds.apache.org/job/hbase-0.95-on-hadoop2/ws/0.95-on-hadoop2/hbase-server/target/surefire/surefire6016511092105064644tmp> <https://builds.apache.org/job/hbase-0.95-on-hadoop2/ws/0.95-on-hadoop2/hbase-server/target/surefire/surefire_581684581729208883993tmp>
Running org.apache.hadoop.hbase.client.TestHTableUtil
Running org.apache.hadoop.hbase.client.TestHCM
Tests run: 2, Failures: 0, Errors: 0, Skipped: 0, Time elapsed: 379.035 sec
Forking command line: /bin/sh -c cd <https://builds.apache.org/job/hbase-0.95-on-hadoop2/ws/0.95-on-hadoop2/hbase-server> && /home/jenkins/tools/java/jdk1.6.0_27-32/jre/bin/java -enableassertions -Xmx1900m -Djava.security.egd=file:/dev/./urandom -Djava.net.preferIPv4Stack=true -jar <https://builds.apache.org/job/hbase-0.95-on-hadoop2/ws/0.95-on-hadoop2/hbase-server/target/surefire/surefirebooter7688452389994281755.jar> <https://builds.apache.org/job/hbase-0.95-on-hadoop2/ws/0.95-on-hadoop2/hbase-server/target/surefire/surefire4819261352571840532tmp> <https://builds.apache.org/job/hbase-0.95-on-hadoop2/ws/0.95-on-hadoop2/hbase-server/target/surefire/surefire_594651062243101616516tmp>
Forking command line: /bin/sh -c cd <https://builds.apache.org/job/hbase-0.95-on-hadoop2/ws/0.95-on-hadoop2/hbase-server> && /home/jenkins/tools/java/jdk1.6.0_27-32/jre/bin/java -enableassertions -Xmx1900m -Djava.security.egd=file:/dev/./urandom -Djava.net.preferIPv4Stack=true -jar <https://builds.apache.org/job/hbase-0.95-on-hadoop2/ws/0.95-on-hadoop2/hbase-server/target/surefire/surefirebooter1876821310778717531.jar> <https://builds.apache.org/job/hbase-0.95-on-hadoop2/ws/0.95-on-hadoop2/hbase-server/target/surefire/surefire1228667065105859627tmp> <https://builds.apache.org/job/hbase-0.95-on-hadoop2/ws/0.95-on-hadoop2/hbase-server/target/surefire/surefire_602558388977513493548tmp>
Tests run: 9, Failures: 0, Errors: 2, Skipped: 0, Time elapsed: 440.024 sec <<< FAILURE!
Forking command line: /bin/sh -c cd <https://builds.apache.org/job/hbase-0.95-on-hadoop2/ws/0.95-on-hadoop2/hbase-server> && /home/jenkins/tools/java/jdk1.6.0_27-32/jre/bin/java -enableassertions -Xmx1900m -Djava.security.egd=file:/dev/./urandom -Djava.net.preferIPv4Stack=true -jar <https://builds.apache.org/job/hbase-0.95-on-hadoop2/ws/0.95-on-hadoop2/hbase-server/target/surefire/surefirebooter4140535585505946209.jar> <https://builds.apache.org/job/hbase-0.95-on-hadoop2/ws/0.95-on-hadoop2/hbase-server/target/surefire/surefire5348345575732534932tmp> <https://builds.apache.org/job/hbase-0.95-on-hadoop2/ws/0.95-on-hadoop2/hbase-server/target/surefire/surefire_619114960205284121301tmp>
Forking command line: /bin/sh -c cd <https://builds.apache.org/job/hbase-0.95-on-hadoop2/ws/0.95-on-hadoop2/hbase-server> && /home/jenkins/tools/java/jdk1.6.0_27-32/jre/bin/java -enableassertions -Xmx1900m -Djava.security.egd=file:/dev/./urandom -Djava.net.preferIPv4Stack=true -jar <https://builds.apache.org/job/hbase-0.95-on-hadoop2/ws/0.95-on-hadoop2/hbase-server/target/surefire/surefirebooter4484915174865739817.jar> <https://builds.apache.org/job/hbase-0.95-on-hadoop2/ws/0.95-on-hadoop2/hbase-server/target/surefire/surefire2765611162413815127tmp> <https://builds.apache.org/job/hbase-0.95-on-hadoop2/ws/0.95-on-hadoop2/hbase-server/target/surefire/surefire_624260592780610640923tmp>
Running org.apache.hadoop.hbase.client.TestTimestampsFilter
Tests run: 3, Failures: 0, Errors: 0, Skipped: 0, Time elapsed: 481.826 sec
Running org.apache.hadoop.hbase.client.TestScannersFromClientSide
Forking command line: /bin/sh -c cd <https://builds.apache.org/job/hbase-0.95-on-hadoop2/ws/0.95-on-hadoop2/hbase-server> && /home/jenkins/tools/java/jdk1.6.0_27-32/jre/bin/java -enableassertions -Xmx1900m -Djava.security.egd=file:/dev/./urandom -Djava.net.preferIPv4Stack=true -jar <https://builds.apache.org/job/hbase-0.95-on-hadoop2/ws/0.95-on-hadoop2/hbase-server/target/surefire/surefirebooter3435596244529107541.jar> <https://builds.apache.org/job/hbase-0.95-on-hadoop2/ws/0.95-on-hadoop2/hbase-server/target/surefire/surefire6960370530177738383tmp> <https://builds.apache.org/job/hbase-0.95-on-hadoop2/ws/0.95-on-hadoop2/hbase-server/target/surefire/surefire_631677359289360800261tmp>
Tests run: 4, Failures: 0, Errors: 0, Skipped: 0, Time elapsed: 405.082 sec
Forking command line: /bin/sh -c cd <https://builds.apache.org/job/hbase-0.95-on-hadoop2/ws/0.95-on-hadoop2/hbase-server> && /home/jenkins/tools/java/jdk1.6.0_27-32/jre/bin/java -enableassertions -Xmx1900m -Djava.security.egd=file:/dev/./urandom -Djava.net.preferIPv4Stack=true -jar <https://builds.apache.org/job/hbase-0.95-on-hadoop2/ws/0.95-on-hadoop2/hbase-server/target/surefire/surefirebooter683769492987574196.jar> <https://builds.apache.org/job/hbase-0.95-on-hadoop2/ws/0.95-on-hadoop2/hbase-server/target/surefire/surefire5098345812901651870tmp> <https://builds.apache.org/job/hbase-0.95-on-hadoop2/ws/0.95-on-hadoop2/hbase-server/target/surefire/surefire_644295238123802683139tmp>
Forking command line: /bin/sh -c cd <https://builds.apache.org/job/hbase-0.95-on-hadoop2/ws/0.95-on-hadoop2/hbase-server> && /home/jenkins/tools/java/jdk1.6.0_27-32/jre/bin/java -enableassertions -Xmx1900m -Djava.security.egd=file:/dev/./urandom -Djava.net.preferIPv4Stack=true -jar <https://builds.apache.org/job/hbase-0.95-on-hadoop2/ws/0.95-on-hadoop2/hbase-server/target/surefire/surefirebooter7776205752064032222.jar> <https://builds.apache.org/job/hbase-0.95-on-hadoop2/ws/0.95-on-hadoop2/hbase-server/target/surefire/surefire7879879321102880811tmp> <https://builds.apache.org/job/hbase-0.95-on-hadoop2/ws/0.95-on-hadoop2/hbase-server/target/surefire/surefire_655926268314358935199tmp>
Forking command line: /bin/sh -c cd <https://builds.apache.org/job/hbase-0.95-on-hadoop2/ws/0.95-on-hadoop2/hbase-server> && /home/jenkins/tools/java/jdk1.6.0_27-32/jre/bin/java -enableassertions -Xmx1900m -Djava.security.egd=file:/dev/./urandom -Djava.net.preferIPv4Stack=true -jar <https://builds.apache.org/job/hbase-0.95-on-hadoop2/ws/0.95-on-hadoop2/hbase-server/target/surefire/surefirebooter2347770907290511779.jar> <https://builds.apache.org/job/hbase-0.95-on-hadoop2/ws/0.95-on-hadoop2/hbase-server/target/surefire/surefire7839913074459939172tmp> <https://builds.apache.org/job/hbase-0.95-on-hadoop2/ws/0.95-on-hadoop2/hbase-server/target/surefire/surefire_667909916765485351346tmp>
Running org.apache.hadoop.hbase.client.TestSnapshotMetadata
Tests run: 4, Failures: 0, Errors: 4, Skipped: 0, Time elapsed: 572.509 sec <<< FAILURE!
Forking command line: /bin/sh -c cd <https://builds.apache.org/job/hbase-0.95-on-hadoop2/ws/0.95-on-hadoop2/hbase-server> && /home/jenkins/tools/java/jdk1.6.0_27-32/jre/bin/java -enableassertions -Xmx1900m -Djava.security.egd=file:/dev/./urandom -Djava.net.preferIPv4Stack=true -jar <https://builds.apache.org/job/hbase-0.95-on-hadoop2/ws/0.95-on-hadoop2/hbase-server/target/surefire/surefirebooter4390965696738345908.jar> <https://builds.apache.org/job/hbase-0.95-on-hadoop2/ws/0.95-on-hadoop2/hbase-server/target/surefire/surefire9175884974978927046tmp> <https://builds.apache.org/job/hbase-0.95-on-hadoop2/ws/0.95-on-hadoop2/hbase-server/target/surefire/surefire_677570654427206116357tmp>
Forking command line: /bin/sh -c cd <https://builds.apache.org/job/hbase-0.95-on-hadoop2/ws/0.95-on-hadoop2/hbase-server> && /home/jenkins/tools/java/jdk1.6.0_27-32/jre/bin/java -enableassertions -Xmx1900m -Djava.security.egd=file:/dev/./urandom -Djava.net.preferIPv4Stack=true -jar <https://builds.apache.org/job/hbase-0.95-on-hadoop2/ws/0.95-on-hadoop2/hbase-server/target/surefire/surefirebooter6061758926540316139.jar> <https://builds.apache.org/job/hbase-0.95-on-hadoop2/ws/0.95-on-hadoop2/hbase-server/target/surefire/surefire4578679095907626892tmp> <https://builds.apache.org/job/hbase-0.95-on-hadoop2/ws/0.95-on-hadoop2/hbase-server/target/surefire/surefire_685652566241411825649tmp>
Forking command line: /bin/sh -c cd <https://builds.apache.org/job/hbase-0.95-on-hadoop2/ws/0.95-on-hadoop2/hbase-server> && /home/jenkins/tools/java/jdk1.6.0_27-32/jre/bin/java -enableassertions -Xmx1900m -Djava.security.egd=file:/dev/./urandom -Djava.net.preferIPv4Stack=true -jar <https://builds.apache.org/job/hbase-0.95-on-hadoop2/ws/0.95-on-hadoop2/hbase-server/target/surefire/surefirebooter1717301031389280225.jar> <https://builds.apache.org/job/hbase-0.95-on-hadoop2/ws/0.95-on-hadoop2/hbase-server/target/surefire/surefire2926578412535203929tmp> <https://builds.apache.org/job/hbase-0.95-on-hadoop2/ws/0.95-on-hadoop2/hbase-server/target/surefire/surefire_698608766267998419119tmp>
Running org.apache.hadoop.hbase.client.replication.TestReplicationAdmin
Running org.apache.hadoop.hbase.client.TestHTableMultiplexer
Tests run: 1, Failures: 0, Errors: 0, Skipped: 0, Time elapsed: 62.765 sec
Forking command line: /bin/sh -c cd <https://builds.apache.org/job/hbase-0.95-on-hadoop2/ws/0.95-on-hadoop2/hbase-server> && /home/jenkins/tools/java/jdk1.6.0_27-32/jre/bin/java -enableassertions -Xmx1900m -Djava.security.egd=file:/dev/./urandom -Djava.net.preferIPv4Stack=true -jar <https://builds.apache.org/job/hbase-0.95-on-hadoop2/ws/0.95-on-hadoop2/hbase-server/target/surefire/surefirebooter8289953370740954228.jar> <https://builds.apache.org/job/hbase-0.95-on-hadoop2/ws/0.95-on-hadoop2/hbase-server/target/surefire/surefire2808767939009484317tmp> <https://builds.apache.org/job/hbase-0.95-on-hadoop2/ws/0.95-on-hadoop2/hbase-server/target/surefire/surefire_702864939944239603437tmp>
Tests run: 1, Failures: 1, Errors: 0, Skipped: 0, Time elapsed: 566.372 sec <<< FAILURE!
Forking command line: /bin/sh -c cd <https://builds.apache.org/job/hbase-0.95-on-hadoop2/ws/0.95-on-hadoop2/hbase-server> && /home/jenkins/tools/java/jdk1.6.0_27-32/jre/bin/java -enableassertions -Xmx1900m -Djava.security.egd=file:/dev/./urandom -Djava.net.preferIPv4Stack=true -jar <https://builds.apache.org/job/hbase-0.95-on-hadoop2/ws/0.95-on-hadoop2/hbase-server/target/surefire/surefirebooter3130541645919489985.jar> <https://builds.apache.org/job/hbase-0.95-on-hadoop2/ws/0.95-on-hadoop2/hbase-server/target/surefire/surefire401066691696013161tmp> <https://builds.apache.org/job/hbase-0.95-on-hadoop2/ws/0.95-on-hadoop2/hbase-server/target/surefire/surefire_715251906342236581614tmp>
Forking command line: /bin/sh -c cd <https://builds.apache.org/job/hbase-0.95-on-hadoop2/ws/0.95-on-hadoop2/hbase-server> && /home/jenkins/tools/java/jdk1.6.0_27-32/jre/bin/java -enableassertions -Xmx1900m -Djava.security.egd=file:/dev/./urandom -Djava.net.preferIPv4Stack=true -jar <https://builds.apache.org/job/hbase-0.95-on-hadoop2/ws/0.95-on-hadoop2/hbase-server/target/surefire/surefirebooter3089417799527867397.jar> <https://builds.apache.org/job/hbase-0.95-on-hadoop2/ws/0.95-on-hadoop2/hbase-server/target/surefire/surefire5682805436768372997tmp> <https://builds.apache.org/job/hbase-0.95-on-hadoop2/ws/0.95-on-hadoop2/hbase-server/target/surefire/surefire_728918712134265297536tmp>
Running org.apache.hadoop.hbase.client.TestClientScannerRPCTimeout
Tests run: 1, Failures: 0, Errors: 0, Skipped: 0, Time elapsed: 478.372 sec
Running org.apache.hadoop.hbase.client.TestMultipleTimestamps
Forking command line: /bin/sh -c cd <https://builds.apache.org/job/hbase-0.95-on-hadoop2/ws/0.95-on-hadoop2/hbase-server> && /home/jenkins/tools/java/jdk1.6.0_27-32/jre/bin/java -enableassertions -Xmx1900m -Djava.security.egd=file:/dev/./urandom -Djava.net.preferIPv4Stack=true -jar <https://builds.apache.org/job/hbase-0.95-on-hadoop2/ws/0.95-on-hadoop2/hbase-server/target/surefire/surefirebooter9058689156608921146.jar> <https://builds.apache.org/job/hbase-0.95-on-hadoop2/ws/0.95-on-hadoop2/hbase-server/target/surefire/surefire6396503210208193056tmp> <https://builds.apache.org/job/hbase-0.95-on-hadoop2/ws/0.95-on-hadoop2/hbase-server/target/surefire/surefire_739110825694205585465tmp>
Tests run: 8, Failures: 0, Errors: 0, Skipped: 0, Time elapsed: 470.005 sec
Forking command line: /bin/sh -c cd <https://builds.apache.org/job/hbase-0.95-on-hadoop2/ws/0.95-on-hadoop2/hbase-server> && /home/jenkins/tools/java/jdk1.6.0_27-32/jre/bin/java -enableassertions -Xmx1900m -Djava.security.egd=file:/dev/./urandom -Djava.net.preferIPv4Stack=true -jar <https://builds.apache.org/job/hbase-0.95-on-hadoop2/ws/0.95-on-hadoop2/hbase-server/target/surefire/surefirebooter3768769133133033641.jar> <https://builds.apache.org/job/hbase-0.95-on-hadoop2/ws/0.95-on-hadoop2/hbase-server/target/surefire/surefire8895651504994317250tmp> <https://builds.apache.org/job/hbase-0.95-on-hadoop2/ws/0.95-on-hadoop2/hbase-server/target/surefire/surefire_747070232235327201609tmp>
Forking command line: /bin/sh -c cd <https://builds.apache.org/job/hbase-0.95-on-hadoop2/ws/0.95-on-hadoop2/hbase-server> && /home/jenkins/tools/java/jdk1.6.0_27-32/jre/bin/java -enableassertions -Xmx1900m -Djava.security.egd=file:/dev/./urandom -Djava.net.preferIPv4Stack=true -jar <https://builds.apache.org/job/hbase-0.95-on-hadoop2/ws/0.95-on-hadoop2/hbase-server/target/surefire/surefirebooter2462710170104889097.jar> <https://builds.apache.org/job/hbase-0.95-on-hadoop2/ws/0.95-on-hadoop2/hbase-server/target/surefire/surefire6766176963271464877tmp> <https://builds.apache.org/job/hbase-0.95-on-hadoop2/ws/0.95-on-hadoop2/hbase-server/target/surefire/surefire_757278827994006968517tmp>
Forking command line: /bin/sh -c cd <https://builds.apache.org/job/hbase-0.95-on-hadoop2/ws/0.95-on-hadoop2/hbase-server> && /home/jenkins/tools/java/jdk1.6.0_27-32/jre/bin/java -enableassertions -Xmx1900m -Djava.security.egd=file:/dev/./urandom -Djava.net.preferIPv4Stack=true -jar <https://builds.apache.org/job/hbase-0.95-on-hadoop2/ws/0.95-on-hadoop2/hbase-server/target/surefire/surefirebooter1183773468441186143.jar> <https://builds.apache.org/job/hbase-0.95-on-hadoop2/ws/0.95-on-hadoop2/hbase-server/target/surefire/surefire3055295280055614438tmp> <https://builds.apache.org/job/hbase-0.95-on-hadoop2/ws/0.95-on-hadoop2/hbase-server/target/surefire/surefire_761101880063971127935tmp>
Forking command line: /bin/sh -c cd <https://builds.apache.org/job/hbase-0.95-on-hadoop2/ws/0.95-on-hadoop2/hbase-server> && /home/jenkins/tools/java/jdk1.6.0_27-32/jre/bin/java -enableassertions -Xmx1900m -Djava.security.egd=file:/dev/./urandom -Djava.net.preferIPv4Stack=true -jar <https://builds.apache.org/job/hbase-0.95-on-hadoop2/ws/0.95-on-hadoop2/hbase-server/target/surefire/surefirebooter2121613755004196586.jar> <https://builds.apache.org/job/hbase-0.95-on-hadoop2/ws/0.95-on-hadoop2/hbase-server/target/surefire/surefire3618908415582200091tmp> <https://builds.apache.org/job/hbase-0.95-on-hadoop2/ws/0.95-on-hadoop2/hbase-server/target/surefire/surefire_777720414667039335289tmp>
Running org.apache.hadoop.hbase.io.encoding.TestLoadAndSwitchEncodeOnDisk
Running org.apache.hadoop.hbase.client.TestSnapshotFromClient
Tests run: 3, Failures: 0, Errors: 1, Skipped: 0, Time elapsed: 639.578 sec <<< FAILURE!
Tests run: 1, Failures: 0, Errors: 1, Skipped: 0, Time elapsed: 606.174 sec <<< FAILURE!
Forking command line: /bin/sh -c cd <https://builds.apache.org/job/hbase-0.95-on-hadoop2/ws/0.95-on-hadoop2/hbase-server> && /home/jenkins/tools/java/jdk1.6.0_27-32/jre/bin/java -enableassertions -Xmx1900m -Djava.security.egd=file:/dev/./urandom -Djava.net.preferIPv4Stack=true -jar <https://builds.apache.org/job/hbase-0.95-on-hadoop2/ws/0.95-on-hadoop2/hbase-server/target/surefire/surefirebooter3612980706193122813.jar> <https://builds.apache.org/job/hbase-0.95-on-hadoop2/ws/0.95-on-hadoop2/hbase-server/target/surefire/surefire1789335079461935529tmp> <https://builds.apache.org/job/hbase-0.95-on-hadoop2/ws/0.95-on-hadoop2/hbase-server/target/surefire/surefire_782169997739522017054tmp>
Forking command line: /bin/sh -c cd <https://builds.apache.org/job/hbase-0.95-on-hadoop2/ws/0.95-on-hadoop2/hbase-server> && /home/jenkins/tools/java/jdk1.6.0_27-32/jre/bin/java -enableassertions -Xmx1900m -Djava.security.egd=file:/dev/./urandom -Djava.net.preferIPv4Stack=true -jar <https://builds.apache.org/job/hbase-0.95-on-hadoop2/ws/0.95-on-hadoop2/hbase-server/target/surefire/surefirebooter3084923665044182785.jar> <https://builds.apache.org/job/hbase-0.95-on-hadoop2/ws/0.95-on-hadoop2/hbase-server/target/surefire/surefire8775954040317181518tmp> <https://builds.apache.org/job/hbase-0.95-on-hadoop2/ws/0.95-on-hadoop2/hbase-server/target/surefire/surefire_795418963472465081355tmp>
Running org.apache.hadoop.hbase.io.encoding.TestDataBlockEncoders
Tests run: 12, Failures: 0, Errors: 0, Skipped: 0, Time elapsed: 646.024 sec
Forking command line: /bin/sh -c cd <https://builds.apache.org/job/hbase-0.95-on-hadoop2/ws/0.95-on-hadoop2/hbase-server> && /home/jenkins/tools/java/jdk1.6.0_27-32/jre/bin/java -enableassertions -Xmx1900m -Djava.security.egd=file:/dev/./urandom -Djava.net.preferIPv4Stack=true -jar <https://builds.apache.org/job/hbase-0.95-on-hadoop2/ws/0.95-on-hadoop2/hbase-server/target/surefire/surefirebooter9001759488623816780.jar> <https://builds.apache.org/job/hbase-0.95-on-hadoop2/ws/0.95-on-hadoop2/hbase-server/target/surefire/surefire3836708075897822444tmp> <https://builds.apache.org/job/hbase-0.95-on-hadoop2/ws/0.95-on-hadoop2/hbase-server/target/surefire/surefire_803614850914214789068tmp>
Forking command line: /bin/sh -c cd <https://builds.apache.org/job/hbase-0.95-on-hadoop2/ws/0.95-on-hadoop2/hbase-server> && /home/jenkins/tools/java/jdk1.6.0_27-32/jre/bin/java -enableassertions -Xmx1900m -Djava.security.egd=file:/dev/./urandom -Djava.net.preferIPv4Stack=true -jar <https://builds.apache.org/job/hbase-0.95-on-hadoop2/ws/0.95-on-hadoop2/hbase-server/target/surefire/surefirebooter5759944083605364710.jar> <https://builds.apache.org/job/hbase-0.95-on-hadoop2/ws/0.95-on-hadoop2/hbase-server/target/surefire/surefire5977641029682189043tmp> <https://builds.apache.org/job/hbase-0.95-on-hadoop2/ws/0.95-on-hadoop2/hbase-server/target/surefire/surefire_813092249726195577043tmp>
Running org.apache.hadoop.hbase.io.encoding.TestBufferedDataBlockEncoder
Tests run: 1, Failures: 0, Errors: 0, Skipped: 0, Time elapsed: 28.927 sec
Forking command line: /bin/sh -c cd <https://builds.apache.org/job/hbase-0.95-on-hadoop2/ws/0.95-on-hadoop2/hbase-server> && /home/jenkins/tools/java/jdk1.6.0_27-32/jre/bin/java -enableassertions -Xmx1900m -Djava.security.egd=file:/dev/./urandom -Djava.net.preferIPv4Stack=true -jar <https://builds.apache.org/job/hbase-0.95-on-hadoop2/ws/0.95-on-hadoop2/hbase-server/target/surefire/surefirebooter4105340297483188204.jar> <https://builds.apache.org/job/hbase-0.95-on-hadoop2/ws/0.95-on-hadoop2/hbase-server/target/surefire/surefire8158073251063888720tmp> <https://builds.apache.org/job/hbase-0.95-on-hadoop2/ws/0.95-on-hadoop2/hbase-server/target/surefire/surefire_828299366210008520282tmp>
Forking command line: /bin/sh -c cd <https://builds.apache.org/job/hbase-0.95-on-hadoop2/ws/0.95-on-hadoop2/hbase-server> && /home/jenkins/tools/java/jdk1.6.0_27-32/jre/bin/java -enableassertions -Xmx1900m -Djava.security.egd=file:/dev/./urandom -Djava.net.preferIPv4Stack=true -jar <https://builds.apache.org/job/hbase-0.95-on-hadoop2/ws/0.95-on-hadoop2/hbase-server/target/surefire/surefirebooter7433491148147040754.jar> <https://builds.apache.org/job/hbase-0.95-on-hadoop2/ws/0.95-on-hadoop2/hbase-server/target/surefire/surefire4099590160087670564tmp> <https://builds.apache.org/job/hbase-0.95-on-hadoop2/ws/0.95-on-hadoop2/hbase-server/target/surefire/surefire_83204287928707616230tmp>
Running org.apache.hadoop.hbase.io.hfile.TestScannerSelectionUsingTTL
Tests run: 6, Failures: 3, Errors: 0, Skipped: 0, Time elapsed: 175.342 sec <<< FAILURE!
Forking command line: /bin/sh -c cd <https://builds.apache.org/job/hbase-0.95-on-hadoop2/ws/0.95-on-hadoop2/hbase-server> && /home/jenkins/tools/java/jdk1.6.0_27-32/jre/bin/java -enableassertions -Xmx1900m -Djava.security.egd=file:/dev/./urandom -Djava.net.preferIPv4Stack=true -jar <https://builds.apache.org/job/hbase-0.95-on-hadoop2/ws/0.95-on-hadoop2/hbase-server/target/surefire/surefirebooter459131508413935717.jar> <https://builds.apache.org/job/hbase-0.95-on-hadoop2/ws/0.95-on-hadoop2/hbase-server/target/surefire/surefire3233479008396905796tmp> <https://builds.apache.org/job/hbase-0.95-on-hadoop2/ws/0.95-on-hadoop2/hbase-server/target/surefire/surefire_84420674614168631696tmp>
Running org.apache.hadoop.hbase.io.hfile.TestHFileBlockIndex
Running org.apache.hadoop.hbase.io.hfile.TestForceCacheImportantBlocks
Tests run: 2, Failures: 0, Errors: 0, Skipped: 0, Time elapsed: 757.137 sec
Tests run: 10, Failures: 0, Errors: 0, Skipped: 0, Time elapsed: 562.242 sec
Running org.apache.hadoop.hbase.io.hfile.TestHFileBlock
Running org.apache.hadoop.hbase.io.hfile.TestHFilePerformance
Forking command line: /bin/sh -c cd <https://builds.apache.org/job/hbase-0.95-on-hadoop2/ws/0.95-on-hadoop2/hbase-server> && /home/jenkins/tools/java/jdk1.6.0_27-32/jre/bin/java -enableassertions -Xmx1900m -Djava.security.egd=file:/dev/./urandom -Djava.net.preferIPv4Stack=true -jar <https://builds.apache.org/job/hbase-0.95-on-hadoop2/ws/0.95-on-hadoop2/hbase-server/target/surefire/surefirebooter6858343887821467220.jar> <https://builds.apache.org/job/hbase-0.95-on-hadoop2/ws/0.95-on-hadoop2/hbase-server/target/surefire/surefire7742594147565254075tmp> <https://builds.apache.org/job/hbase-0.95-on-hadoop2/ws/0.95-on-hadoop2/hbase-server/target/surefire/surefire_85666583397807421692tmp>
Forking command line: /bin/sh -c cd <https://builds.apache.org/job/hbase-0.95-on-hadoop2/ws/0.95-on-hadoop2/hbase-server> && /home/jenkins/tools/java/jdk1.6.0_27-32/jre/bin/java -enableassertions -Xmx1900m -Djava.security.egd=file:/dev/./urandom -Djava.net.preferIPv4Stack=true -jar <https://builds.apache.org/job/hbase-0.95-on-hadoop2/ws/0.95-on-hadoop2/hbase-server/target/surefire/surefirebooter5311215802651551265.jar> <https://builds.apache.org/job/hbase-0.95-on-hadoop2/ws/0.95-on-hadoop2/hbase-server/target/surefire/surefire3715375992927368662tmp> <https://builds.apache.org/job/hbase-0.95-on-hadoop2/ws/0.95-on-hadoop2/hbase-server/target/surefire/surefire_866056188882566755466tmp>
Tests run: 1, Failures: 0, Errors: 0, Skipped: 0, Time elapsed: 70.08 sec
Tests run: 14, Failures: 0, Errors: 0, Skipped: 0, Time elapsed: 605.526 sec
Forking command line: /bin/sh -c cd <https://builds.apache.org/job/hbase-0.95-on-hadoop2/ws/0.95-on-hadoop2/hbase-server> && /home/jenkins/tools/java/jdk1.6.0_27-32/jre/bin/java -enableassertions -Xmx1900m -Djava.security.egd=file:/dev/./urandom -Djava.net.preferIPv4Stack=true -jar <https://builds.apache.org/job/hbase-0.95-on-hadoop2/ws/0.95-on-hadoop2/hbase-server/target/surefire/surefirebooter6523698846336263645.jar> <https://builds.apache.org/job/hbase-0.95-on-hadoop2/ws/0.95-on-hadoop2/hbase-server/target/surefire/surefire1111354121976266286tmp> <https://builds.apache.org/job/hbase-0.95-on-hadoop2/ws/0.95-on-hadoop2/hbase-server/target/surefire/surefire_873862312651995333341tmp>
Forking command line: /bin/sh -c cd <https://builds.apache.org/job/hbase-0.95-on-hadoop2/ws/0.95-on-hadoop2/hbase-server> && /home/jenkins/tools/java/jdk1.6.0_27-32/jre/bin/java -enableassertions -Xmx1900m -Djava.security.egd=file:/dev/./urandom -Djava.net.preferIPv4Stack=true -jar <https://builds.apache.org/job/hbase-0.95-on-hadoop2/ws/0.95-on-hadoop2/hbase-server/target/surefire/surefirebooter5299788517354161947.jar> <https://builds.apache.org/job/hbase-0.95-on-hadoop2/ws/0.95-on-hadoop2/hbase-server/target/surefire/surefire8835920523505006800tmp> <https://builds.apache.org/job/hbase-0.95-on-hadoop2/ws/0.95-on-hadoop2/hbase-server/target/surefire/surefire_892819611190181656452tmp>
Forking command line: /bin/sh -c cd <https://builds.apache.org/job/hbase-0.95-on-hadoop2/ws/0.95-on-hadoop2/hbase-server> && /home/jenkins/tools/java/jdk1.6.0_27-32/jre/bin/java -enableassertions -Xmx1900m -Djava.security.egd=file:/dev/./urandom -Djava.net.preferIPv4Stack=true -jar <https://builds.apache.org/job/hbase-0.95-on-hadoop2/ws/0.95-on-hadoop2/hbase-server/target/surefire/surefirebooter1763247982655111243.jar> <https://builds.apache.org/job/hbase-0.95-on-hadoop2/ws/0.95-on-hadoop2/hbase-server/target/surefire/surefire6336852250535086345tmp> <https://builds.apache.org/job/hbase-0.95-on-hadoop2/ws/0.95-on-hadoop2/hbase-server/target/surefire/surefire_882264840968279551071tmp>
Running org.apache.hadoop.hbase.io.hfile.TestHFileSeek
Tests run: 1, Failures: 0, Errors: 0, Skipped: 0, Time elapsed: 129.296 sec
Running org.apache.hadoop.hbase.io.hfile.slab.TestSlabCache
Tests run: 7, Failures: 0, Errors: 0, Skipped: 0, Time elapsed: 218.148 sec
Forking command line: /bin/sh -c cd <https://builds.apache.org/job/hbase-0.95-on-hadoop2/ws/0.95-on-hadoop2/hbase-server> && /home/jenkins/tools/java/jdk1.6.0_27-32/jre/bin/java -enableassertions -Xmx1900m -Djava.security.egd=file:/dev/./urandom -Djava.net.preferIPv4Stack=true -jar <https://builds.apache.org/job/hbase-0.95-on-hadoop2/ws/0.95-on-hadoop2/hbase-server/target/surefire/surefirebooter8211668693481256458.jar> <https://builds.apache.org/job/hbase-0.95-on-hadoop2/ws/0.95-on-hadoop2/hbase-server/target/surefire/surefire2374468438229511875tmp> <https://builds.apache.org/job/hbase-0.95-on-hadoop2/ws/0.95-on-hadoop2/hbase-server/target/surefire/surefire_903637214859614941844tmp>
Running org.apache.hadoop.hbase.io.hfile.slab.TestSingleSizeCache
Tests run: 5, Failures: 0, Errors: 0, Skipped: 0, Time elapsed: 236.921 sec
Forking command line: /bin/sh -c cd <https://builds.apache.org/job/hbase-0.95-on-hadoop2/ws/0.95-on-hadoop2/hbase-server> && /home/jenkins/tools/java/jdk1.6.0_27-32/jre/bin/java -enableassertions -Xmx1900m -Djava.security.egd=file:/dev/./urandom -Djava.net.preferIPv4Stack=true -jar <https://builds.apache.org/job/hbase-0.95-on-hadoop2/ws/0.95-on-hadoop2/hbase-server/target/surefire/surefirebooter8647056389556899409.jar> <https://builds.apache.org/job/hbase-0.95-on-hadoop2/ws/0.95-on-hadoop2/hbase-server/target/surefire/surefire5579562636937924209tmp> <https://builds.apache.org/job/hbase-0.95-on-hadoop2/ws/0.95-on-hadoop2/hbase-server/target/surefire/surefire_916993340583720676158tmp>
Forking command line: /bin/sh -c cd <https://builds.apache.org/job/hbase-0.95-on-hadoop2/ws/0.95-on-hadoop2/hbase-server> && /home/jenkins/tools/java/jdk1.6.0_27-32/jre/bin/java -enableassertions -Xmx1900m -Djava.security.egd=file:/dev/./urandom -Djava.net.preferIPv4Stack=true -jar <https://builds.apache.org/job/hbase-0.95-on-hadoop2/ws/0.95-on-hadoop2/hbase-server/target/surefire/surefirebooter8278683813792242516.jar> <https://builds.apache.org/job/hbase-0.95-on-hadoop2/ws/0.95-on-hadoop2/hbase-server/target/surefire/surefire3263964390946719146tmp> <https://builds.apache.org/job/hbase-0.95-on-hadoop2/ws/0.95-on-hadoop2/hbase-server/target/surefire/surefire_925916572610312092283tmp>
Running org.apache.hadoop.hbase.io.hfile.TestCacheOnWrite
Tests run: 36, Failures: 0, Errors: 0, Skipped: 0, Time elapsed: 269.634 sec
Running org.apache.hadoop.hbase.zookeeper.TestHQuorumPeer
Tests run: 3, Failures: 0, Errors: 0, Skipped: 0, Time elapsed: 35.244 sec
Forking command line: /bin/sh -c cd <https://builds.apache.org/job/hbase-0.95-on-hadoop2/ws/0.95-on-hadoop2/hbase-server> && /home/jenkins/tools/java/jdk1.6.0_27-32/jre/bin/java -enableassertions -Xmx1900m -Djava.security.egd=file:/dev/./urandom -Djava.net.preferIPv4Stack=true -jar <https://builds.apache.org/job/hbase-0.95-on-hadoop2/ws/0.95-on-hadoop2/hbase-server/target/surefire/surefirebooter5753045587040257650.jar> <https://builds.apache.org/job/hbase-0.95-on-hadoop2/ws/0.95-on-hadoop2/hbase-server/target/surefire/surefire6455647361018454756tmp> <https://builds.apache.org/job/hbase-0.95-on-hadoop2/ws/0.95-on-hadoop2/hbase-server/target/surefire/surefire_938271531629902663588tmp>
Forking command line: /bin/sh -c cd <https://builds.apache.org/job/hbase-0.95-on-hadoop2/ws/0.95-on-hadoop2/hbase-server> && /home/jenkins/tools/java/jdk1.6.0_27-32/jre/bin/java -enableassertions -Xmx1900m -Djava.security.egd=file:/dev/./urandom -Djava.net.preferIPv4Stack=true -jar <https://builds.apache.org/job/hbase-0.95-on-hadoop2/ws/0.95-on-hadoop2/hbase-server/target/surefire/surefirebooter7910080148215323986.jar> <https://builds.apache.org/job/hbase-0.95-on-hadoop2/ws/0.95-on-hadoop2/hbase-server/target/surefire/surefire2402360139570130208tmp> <https://builds.apache.org/job/hbase-0.95-on-hadoop2/ws/0.95-on-hadoop2/hbase-server/target/surefire/surefire_94970521503945682149tmp>
Running org.apache.hadoop.hbase.zookeeper.TestZKLeaderManager
Tests run: 1, Failures: 1, Errors: 0, Skipped: 0, Time elapsed: 11.414 sec <<< FAILURE!
Running org.apache.hadoop.hbase.zookeeper.TestZKTable
Tests run: 1, Failures: 0, Errors: 0, Skipped: 0, Time elapsed: 40.514 sec
Running org.apache.hadoop.hbase.zookeeper.TestRecoverableZooKeeper
Tests run: 1, Failures: 0, Errors: 0, Skipped: 0, Time elapsed: 63.578 sec
Forking command line: /bin/sh -c cd <https://builds.apache.org/job/hbase-0.95-on-hadoop2/ws/0.95-on-hadoop2/hbase-server> && /home/jenkins/tools/java/jdk1.6.0_27-32/jre/bin/java -enableassertions -Xmx1900m -Djava.security.egd=file:/dev/./urandom -Djava.net.preferIPv4Stack=true -jar <https://builds.apache.org/job/hbase-0.95-on-hadoop2/ws/0.95-on-hadoop2/hbase-server/target/surefire/surefirebooter386634733010298214.jar> <https://builds.apache.org/job/hbase-0.95-on-hadoop2/ws/0.95-on-hadoop2/hbase-server/target/surefire/surefire6412478679047259615tmp> <https://builds.apache.org/job/hbase-0.95-on-hadoop2/ws/0.95-on-hadoop2/hbase-server/target/surefire/surefire_957672262970348091573tmp>
Forking command line: /bin/sh -c cd <https://builds.apache.org/job/hbase-0.95-on-hadoop2/ws/0.95-on-hadoop2/hbase-server> && /home/jenkins/tools/java/jdk1.6.0_27-32/jre/bin/java -enableassertions -Xmx1900m -Djava.security.egd=file:/dev/./urandom -Djava.net.preferIPv4Stack=true -jar <https://builds.apache.org/job/hbase-0.95-on-hadoop2/ws/0.95-on-hadoop2/hbase-server/target/surefire/surefirebooter3145978756206843039.jar> <https://builds.apache.org/job/hbase-0.95-on-hadoop2/ws/0.95-on-hadoop2/hbase-server/target/surefire/surefire8885050308016102602tmp> <https://builds.apache.org/job/hbase-0.95-on-hadoop2/ws/0.95-on-hadoop2/hbase-server/target/surefire/surefire_973411249971009380883tmp>
Forking command line: /bin/sh -c cd <https://builds.apache.org/job/hbase-0.95-on-hadoop2/ws/0.95-on-hadoop2/hbase-server> && /home/jenkins/tools/java/jdk1.6.0_27-32/jre/bin/java -enableassertions -Xmx1900m -Djava.security.egd=file:/dev/./urandom -Djava.net.preferIPv4Stack=true -jar <https://builds.apache.org/job/hbase-0.95-on-hadoop2/ws/0.95-on-hadoop2/hbase-server/target/surefire/surefirebooter5581885861498105385.jar> <https://builds.apache.org/job/hbase-0.95-on-hadoop2/ws/0.95-on-hadoop2/hbase-server/target/surefire/surefire7251641274292515947tmp> <https://builds.apache.org/job/hbase-0.95-on-hadoop2/ws/0.95-on-hadoop2/hbase-server/target/surefire/surefire_964418301172336041016tmp>
Running org.apache.hadoop.hbase.zookeeper.TestZKMulti
Running org.apache.hadoop.hbase.zookeeper.TestZooKeeperNodeTracker
Tests run: 6, Failures: 0, Errors: 0, Skipped: 0, Time elapsed: 3.074 sec
Tests run: 3, Failures: 0, Errors: 0, Skipped: 0, Time elapsed: 4.155 sec
Running org.apache.hadoop.hbase.zookeeper.lock.TestZKInterProcessReadWriteLock
Tests run: 6, Failures: 0, Errors: 0, Skipped: 0, Time elapsed: 43.307 sec
Forking command line: /bin/sh -c cd <https://builds.apache.org/job/hbase-0.95-on-hadoop2/ws/0.95-on-hadoop2/hbase-server> && /home/jenkins/tools/java/jdk1.6.0_27-32/jre/bin/java -enableassertions -Xmx1900m -Djava.security.egd=file:/dev/./urandom -Djava.net.preferIPv4Stack=true -jar <https://builds.apache.org/job/hbase-0.95-on-hadoop2/ws/0.95-on-hadoop2/hbase-server/target/surefire/surefirebooter2197806278815321808.jar> <https://builds.apache.org/job/hbase-0.95-on-hadoop2/ws/0.95-on-hadoop2/hbase-server/target/surefire/surefire2044241406190974588tmp> <https://builds.apache.org/job/hbase-0.95-on-hadoop2/ws/0.95-on-hadoop2/hbase-server/target/surefire/surefire_100294331997957526756tmp>
Forking command line: /bin/sh -c cd <https://builds.apache.org/job/hbase-0.95-on-hadoop2/ws/0.95-on-hadoop2/hbase-server> && /home/jenkins/tools/java/jdk1.6.0_27-32/jre/bin/java -enableassertions -Xmx1900m -Djava.security.egd=file:/dev/./urandom -Djava.net.preferIPv4Stack=true -jar <https://builds.apache.org/job/hbase-0.95-on-hadoop2/ws/0.95-on-hadoop2/hbase-server/target/surefire/surefirebooter1219836538710268946.jar> <https://builds.apache.org/job/hbase-0.95-on-hadoop2/ws/0.95-on-hadoop2/hbase-server/target/surefire/surefire6691814027980628036tmp> <https://builds.apache.org/job/hbase-0.95-on-hadoop2/ws/0.95-on-hadoop2/hbase-server/target/surefire/surefire_991421307386459050040tmp>
Forking command line: /bin/sh -c cd <https://builds.apache.org/job/hbase-0.95-on-hadoop2/ws/0.95-on-hadoop2/hbase-server> && /home/jenkins/tools/java/jdk1.6.0_27-32/jre/bin/java -enableassertions -Xmx1900m -Djava.security.egd=file:/dev/./urandom -Djava.net.preferIPv4Stack=true -jar <https://builds.apache.org/job/hbase-0.95-on-hadoop2/ws/0.95-on-hadoop2/hbase-server/target/surefire/surefirebooter1851666165835089162.jar> <https://builds.apache.org/job/hbase-0.95-on-hadoop2/ws/0.95-on-hadoop2/hbase-server/target/surefire/surefire5713433277138223155tmp> <https://builds.apache.org/job/hbase-0.95-on-hadoop2/ws/0.95-on-hadoop2/hbase-server/target/surefire/surefire_98137958917540965854tmp>
Running org.apache.hadoop.hbase.zookeeper.TestZooKeeperACL
Tests run: 5, Failures: 0, Errors: 0, Skipped: 0, Time elapsed: 165.634 sec
Forking command line: /bin/sh -c cd <https://builds.apache.org/job/hbase-0.95-on-hadoop2/ws/0.95-on-hadoop2/hbase-server> && /home/jenkins/tools/java/jdk1.6.0_27-32/jre/bin/java -enableassertions -Xmx1900m -Djava.security.egd=file:/dev/./urandom -Djava.net.preferIPv4Stack=true -jar <https://builds.apache.org/job/hbase-0.95-on-hadoop2/ws/0.95-on-hadoop2/hbase-server/target/surefire/surefirebooter290585213361172795.jar> <https://builds.apache.org/job/hbase-0.95-on-hadoop2/ws/0.95-on-hadoop2/hbase-server/target/surefire/surefire4300526606893720633tmp> <https://builds.apache.org/job/hbase-0.95-on-hadoop2/ws/0.95-on-hadoop2/hbase-server/target/surefire/surefire_1018519569746165877356tmp>
Running org.apache.hadoop.hbase.io.TestFileLink
Tests run: 3, Failures: 0, Errors: 0, Skipped: 0, Time elapsed: 556.632 sec
Forking command line: /bin/sh -c cd <https://builds.apache.org/job/hbase-0.95-on-hadoop2/ws/0.95-on-hadoop2/hbase-server> && /home/jenkins/tools/java/jdk1.6.0_27-32/jre/bin/java -enableassertions -Xmx1900m -Djava.security.egd=file:/dev/./urandom -Djava.net.preferIPv4Stack=true -jar <https://builds.apache.org/job/hbase-0.95-on-hadoop2/ws/0.95-on-hadoop2/hbase-server/target/surefire/surefirebooter1419494060861990361.jar> <https://builds.apache.org/job/hbase-0.95-on-hadoop2/ws/0.95-on-hadoop2/hbase-server/target/surefire/surefire6347471788626489871tmp> <https://builds.apache.org/job/hbase-0.95-on-hadoop2/ws/0.95-on-hadoop2/hbase-server/target/surefire/surefire_1025850578228205575497tmp>
Running org.apache.hadoop.hbase.rest.client.TestRemoteTable
Running org.apache.hadoop.hbase.rest.TestRowResource
Running org.apache.hadoop.hbase.rest.TestGzipFilter
Running org.apache.hadoop.hbase.rest.TestMultiRowResource
Running org.apache.hadoop.hbase.rest.TestSchemaResource
Tests run: 2, Failures: 0, Errors: 0, Skipped: 0, Time elapsed: 203.036 sec
Tests run: 4, Failures: 0, Errors: 0, Skipped: 0, Time elapsed: 29.492 sec
Tests run: 3, Failures: 0, Errors: 0, Skipped: 0, Time elapsed: 68.6 sec
Tests run: 12, Failures: 0, Errors: 0, Skipped: 0, Time elapsed: 203.034 sec
Tests run: 2, Failures: 0, Errors: 0, Skipped: 0, Time elapsed: 204.543 sec
Forking command line: /bin/sh -c cd <https://builds.apache.org/job/hbase-0.95-on-hadoop2/ws/0.95-on-hadoop2/hbase-server> && /home/jenkins/tools/java/jdk1.6.0_27-32/jre/bin/java -enableassertions -Xmx1900m -Djava.security.egd=file:/dev/./urandom -Djava.net.preferIPv4Stack=true -jar <https://builds.apache.org/job/hbase-0.95-on-hadoop2/ws/0.95-on-hadoop2/hbase-server/target/surefire/surefirebooter1267745491289369370.jar> <https://builds.apache.org/job/hbase-0.95-on-hadoop2/ws/0.95-on-hadoop2/hbase-server/target/surefire/surefire1500993389221664633tmp> <https://builds.apache.org/job/hbase-0.95-on-hadoop2/ws/0.95-on-hadoop2/hbase-server/target/surefire/surefire_1038568498509322149364tmp>
Forking command line: /bin/sh -c cd <https://builds.apache.org/job/hbase-0.95-on-hadoop2/ws/0.95-on-hadoop2/hbase-server> && /home/jenkins/tools/java/jdk1.6.0_27-32/jre/bin/java -enableassertions -Xmx1900m -Djava.security.egd=file:/dev/./urandom -Djava.net.preferIPv4Stack=true -jar <https://builds.apache.org/job/hbase-0.95-on-hadoop2/ws/0.95-on-hadoop2/hbase-server/target/surefire/surefirebooter7143304052547566652.jar> <https://builds.apache.org/job/hbase-0.95-on-hadoop2/ws/0.95-on-hadoop2/hbase-server/target/surefire/surefire181932914919142400tmp> <https://builds.apache.org/job/hbase-0.95-on-hadoop2/ws/0.95-on-hadoop2/hbase-server/target/surefire/surefire_104900071656898212834tmp>
Forking command line: /bin/sh -c cd <https://builds.apache.org/job/hbase-0.95-on-hadoop2/ws/0.95-on-hadoop2/hbase-server> && /home/jenkins/tools/java/jdk1.6.0_27-32/jre/bin/java -enableassertions -Xmx1900m -Djava.security.egd=file:/dev/./urandom -Djava.net.preferIPv4Stack=true -jar <https://builds.apache.org/job/hbase-0.95-on-hadoop2/ws/0.95-on-hadoop2/hbase-server/target/surefire/surefirebooter3793169793739974463.jar> <https://builds.apache.org/job/hbase-0.95-on-hadoop2/ws/0.95-on-hadoop2/hbase-server/target/surefire/surefire3890066783824222215tmp> <https://builds.apache.org/job/hbase-0.95-on-hadoop2/ws/0.95-on-hadoop2/hbase-server/target/surefire/surefire_1063280675708638737644tmp>
Forking command line: /bin/sh -c cd <https://builds.apache.org/job/hbase-0.95-on-hadoop2/ws/0.95-on-hadoop2/hbase-server> && /home/jenkins/tools/java/jdk1.6.0_27-32/jre/bin/java -enableassertions -Xmx1900m -Djava.security.egd=file:/dev/./urandom -Djava.net.preferIPv4Stack=true -jar <https://builds.apache.org/job/hbase-0.95-on-hadoop2/ws/0.95-on-hadoop2/hbase-server/target/surefire/surefirebooter7014735351113209203.jar> <https://builds.apache.org/job/hbase-0.95-on-hadoop2/ws/0.95-on-hadoop2/hbase-server/target/surefire/surefire7577893280023728535tmp> <https://builds.apache.org/job/hbase-0.95-on-hadoop2/ws/0.95-on-hadoop2/hbase-server/target/surefire/surefire_1077800919155057411250tmp>
Forking command line: /bin/sh -c cd <https://builds.apache.org/job/hbase-0.95-on-hadoop2/ws/0.95-on-hadoop2/hbase-server> && /home/jenkins/tools/java/jdk1.6.0_27-32/jre/bin/java -enableassertions -Xmx1900m -Djava.security.egd=file:/dev/./urandom -Djava.net.preferIPv4Stack=true -jar <https://builds.apache.org/job/hbase-0.95-on-hadoop2/ws/0.95-on-hadoop2/hbase-server/target/surefire/surefirebooter719650576124321959.jar> <https://builds.apache.org/job/hbase-0.95-on-hadoop2/ws/0.95-on-hadoop2/hbase-server/target/surefire/surefire7464171286603605940tmp> <https://builds.apache.org/job/hbase-0.95-on-hadoop2/ws/0.95-on-hadoop2/hbase-server/target/surefire/surefire_1055283575071800397353tmp>
Running org.apache.hadoop.hbase.rest.TestStatusResource
Running org.apache.hadoop.hbase.rest.TestVersionResource
Running org.apache.hadoop.hbase.rest.client.TestRemoteAdmin
Tests run: 2, Failures: 0, Errors: 0, Skipped: 0, Time elapsed: 374.237 sec
Tests run: 7, Failures: 0, Errors: 0, Skipped: 0, Time elapsed: 367.615 sec
Tests run: 1, Failures: 0, Errors: 0, Skipped: 0, Time elapsed: 394.223 sec
Forking command line: /bin/sh -c cd <https://builds.apache.org/job/hbase-0.95-on-hadoop2/ws/0.95-on-hadoop2/hbase-server> && /home/jenkins/tools/java/jdk1.6.0_27-32/jre/bin/java -enableassertions -Xmx1900m -Djava.security.egd=file:/dev/./urandom -Djava.net.preferIPv4Stack=true -jar <https://builds.apache.org/job/hbase-0.95-on-hadoop2/ws/0.95-on-hadoop2/hbase-server/target/surefire/surefirebooter6456599294484171726.jar> <https://builds.apache.org/job/hbase-0.95-on-hadoop2/ws/0.95-on-hadoop2/hbase-server/target/surefire/surefire8117329777260403631tmp> <https://builds.apache.org/job/hbase-0.95-on-hadoop2/ws/0.95-on-hadoop2/hbase-server/target/surefire/surefire_108972843835025845796tmp>
Running org.apache.hadoop.hbase.rest.TestScannerResource
Tests run: 5, Failures: 0, Errors: 0, Skipped: 0, Time elapsed: 479.487 sec
Forking command line: /bin/sh -c cd <https://builds.apache.org/job/hbase-0.95-on-hadoop2/ws/0.95-on-hadoop2/hbase-server> && /home/jenkins/tools/java/jdk1.6.0_27-32/jre/bin/java -enableassertions -Xmx1900m -Djava.security.egd=file:/dev/./urandom -Djava.net.preferIPv4Stack=true -jar <https://builds.apache.org/job/hbase-0.95-on-hadoop2/ws/0.95-on-hadoop2/hbase-server/target/surefire/surefirebooter3904032477450696546.jar> <https://builds.apache.org/job/hbase-0.95-on-hadoop2/ws/0.95-on-hadoop2/hbase-server/target/surefire/surefire8695583740465281373tmp> <https://builds.apache.org/job/hbase-0.95-on-hadoop2/ws/0.95-on-hadoop2/hbase-server/target/surefire/surefire_1098497686918401875653tmp>
Forking command line: /bin/sh -c cd <https://builds.apache.org/job/hbase-0.95-on-hadoop2/ws/0.95-on-hadoop2/hbase-server> && /home/jenkins/tools/java/jdk1.6.0_27-32/jre/bin/java -enableassertions -Xmx1900m -Djava.security.egd=file:/dev/./urandom -Djava.net.preferIPv4Stack=true -jar <https://builds.apache.org/job/hbase-0.95-on-hadoop2/ws/0.95-on-hadoop2/hbase-server/target/surefire/surefirebooter6742464795205008330.jar> <https://builds.apache.org/job/hbase-0.95-on-hadoop2/ws/0.95-on-hadoop2/hbase-server/target/surefire/surefire5403770266501137783tmp> <https://builds.apache.org/job/hbase-0.95-on-hadoop2/ws/0.95-on-hadoop2/hbase-server/target/surefire/surefire_1103286605885651981675tmp>
Forking command line: /bin/sh -c cd <https://builds.apache.org/job/hbase-0.95-on-hadoop2/ws/0.95-on-hadoop2/hbase-server> && /home/jenkins/tools/java/jdk1.6.0_27-32/jre/bin/java -enableassertions -Xmx1900m -Djava.security.egd=file:/dev/./urandom -Djava.net.preferIPv4Stack=true -jar <https://builds.apache.org/job/hbase-0.95-on-hadoop2/ws/0.95-on-hadoop2/hbase-server/target/surefire/surefirebooter2717529949898123277.jar> <https://builds.apache.org/job/hbase-0.95-on-hadoop2/ws/0.95-on-hadoop2/hbase-server/target/surefire/surefire8541983517031915193tmp> <https://builds.apache.org/job/hbase-0.95-on-hadoop2/ws/0.95-on-hadoop2/hbase-server/target/surefire/surefire_1114131204964521824701tmp>
Running org.apache.hadoop.hbase.backup.example.TestZooKeeperTableArchiveClient
Tests run: 3, Failures: 0, Errors: 0, Skipped: 0, Time elapsed: 85.601 sec
Forking command line: /bin/sh -c cd <https://builds.apache.org/job/hbase-0.95-on-hadoop2/ws/0.95-on-hadoop2/hbase-server> && /home/jenkins/tools/java/jdk1.6.0_27-32/jre/bin/java -enableassertions -Xmx1900m -Djava.security.egd=file:/dev/./urandom -Djava.net.preferIPv4Stack=true -jar <https://builds.apache.org/job/hbase-0.95-on-hadoop2/ws/0.95-on-hadoop2/hbase-server/target/surefire/surefirebooter35977349769991008.jar> <https://builds.apache.org/job/hbase-0.95-on-hadoop2/ws/0.95-on-hadoop2/hbase-server/target/surefire/surefire1016320221596293184tmp> <https://builds.apache.org/job/hbase-0.95-on-hadoop2/ws/0.95-on-hadoop2/hbase-server/target/surefire/surefire_1129006758835781931158tmp>
Running org.apache.hadoop.hbase.TestInfoServers
Tests run: 3, Failures: 0, Errors: 0, Skipped: 0, Time elapsed: 129.301 sec
Forking command line: /bin/sh -c cd <https://builds.apache.org/job/hbase-0.95-on-hadoop2/ws/0.95-on-hadoop2/hbase-server> && /home/jenkins/tools/java/jdk1.6.0_27-32/jre/bin/java -enableassertions -Xmx1900m -Djava.security.egd=file:/dev/./urandom -Djava.net.preferIPv4Stack=true -jar <https://builds.apache.org/job/hbase-0.95-on-hadoop2/ws/0.95-on-hadoop2/hbase-server/target/surefire/surefirebooter274093830457327677.jar> <https://builds.apache.org/job/hbase-0.95-on-hadoop2/ws/0.95-on-hadoop2/hbase-server/target/surefire/surefire6045259818753043494tmp> <https://builds.apache.org/job/hbase-0.95-on-hadoop2/ws/0.95-on-hadoop2/hbase-server/target/surefire/surefire_1133588531154108232111tmp>
Running org.apache.hadoop.hbase.rest.TestScannersWithFilters
Tests run: 10, Failures: 0, Errors: 0, Skipped: 0, Time elapsed: 222.212 sec
Forking command line: /bin/sh -c cd <https://builds.apache.org/job/hbase-0.95-on-hadoop2/ws/0.95-on-hadoop2/hbase-server> && /home/jenkins/tools/java/jdk1.6.0_27-32/jre/bin/java -enableassertions -Xmx1900m -Djava.security.egd=file:/dev/./urandom -Djava.net.preferIPv4Stack=true -jar <https://builds.apache.org/job/hbase-0.95-on-hadoop2/ws/0.95-on-hadoop2/hbase-server/target/surefire/surefirebooter1883808201717352796.jar> <https://builds.apache.org/job/hbase-0.95-on-hadoop2/ws/0.95-on-hadoop2/hbase-server/target/surefire/surefire2054281405149817717tmp> <https://builds.apache.org/job/hbase-0.95-on-hadoop2/ws/0.95-on-hadoop2/hbase-server/target/surefire/surefire_114899814780812922519tmp>
Forking command line: /bin/sh -c cd <https://builds.apache.org/job/hbase-0.95-on-hadoop2/ws/0.95-on-hadoop2/hbase-server> && /home/jenkins/tools/java/jdk1.6.0_27-32/jre/bin/java -enableassertions -Xmx1900m -Djava.security.egd=file:/dev/./urandom -Djava.net.preferIPv4Stack=true -jar <https://builds.apache.org/job/hbase-0.95-on-hadoop2/ws/0.95-on-hadoop2/hbase-server/target/surefire/surefirebooter8810725261171650929.jar> <https://builds.apache.org/job/hbase-0.95-on-hadoop2/ws/0.95-on-hadoop2/hbase-server/target/surefire/surefire6326106687612314275tmp> <https://builds.apache.org/job/hbase-0.95-on-hadoop2/ws/0.95-on-hadoop2/hbase-server/target/surefire/surefire_1151939692653247919163tmp>
Running org.apache.hadoop.hbase.regionserver.TestServerCustomProtocol
Tests run: 7, Failures: 0, Errors: 0, Skipped: 0, Time elapsed: 267.945 sec
Forking command line: /bin/sh -c cd <https://builds.apache.org/job/hbase-0.95-on-hadoop2/ws/0.95-on-hadoop2/hbase-server> && /home/jenkins/tools/java/jdk1.6.0_27-32/jre/bin/java -enableassertions -Xmx1900m -Djava.security.egd=file:/dev/./urandom -Djava.net.preferIPv4Stack=true -jar <https://builds.apache.org/job/hbase-0.95-on-hadoop2/ws/0.95-on-hadoop2/hbase-server/target/surefire/surefirebooter1013693096399611782.jar> <https://builds.apache.org/job/hbase-0.95-on-hadoop2/ws/0.95-on-hadoop2/hbase-server/target/surefire/surefire6074449200275532715tmp> <https://builds.apache.org/job/hbase-0.95-on-hadoop2/ws/0.95-on-hadoop2/hbase-server/target/surefire/surefire_1166308926129010363511tmp>
Forking command line: /bin/sh -c cd <https://builds.apache.org/job/hbase-0.95-on-hadoop2/ws/0.95-on-hadoop2/hbase-server> && /home/jenkins/tools/java/jdk1.6.0_27-32/jre/bin/java -enableassertions -Xmx1900m -Djava.security.egd=file:/dev/./urandom -Djava.net.preferIPv4Stack=true -jar <https://builds.apache.org/job/hbase-0.95-on-hadoop2/ws/0.95-on-hadoop2/hbase-server/target/surefire/surefirebooter4191127210630529549.jar> <https://builds.apache.org/job/hbase-0.95-on-hadoop2/ws/0.95-on-hadoop2/hbase-server/target/surefire/surefire561948295572761860tmp> <https://builds.apache.org/job/hbase-0.95-on-hadoop2/ws/0.95-on-hadoop2/hbase-server/target/surefire/surefire_117981332171129563154tmp>
Forking command line: /bin/sh -c cd <https://builds.apache.org/job/hbase-0.95-on-hadoop2/ws/0.95-on-hadoop2/hbase-server> && /home/jenkins/tools/java/jdk1.6.0_27-32/jre/bin/java -enableassertions -Xmx1900m -Djava.security.egd=file:/dev/./urandom -Djava.net.preferIPv4Stack=true -jar <https://builds.apache.org/job/hbase-0.95-on-hadoop2/ws/0.95-on-hadoop2/hbase-server/target/surefire/surefirebooter7633386796094726079.jar> <https://builds.apache.org/job/hbase-0.95-on-hadoop2/ws/0.95-on-hadoop2/hbase-server/target/surefire/surefire6203362787594622704tmp> <https://builds.apache.org/job/hbase-0.95-on-hadoop2/ws/0.95-on-hadoop2/hbase-server/target/surefire/surefire_1183727313979325538122tmp>
Forking command line: /bin/sh -c cd <https://builds.apache.org/job/hbase-0.95-on-hadoop2/ws/0.95-on-hadoop2/hbase-server> && /home/jenkins/tools/java/jdk1.6.0_27-32/jre/bin/java -enableassertions -Xmx1900m -Djava.security.egd=file:/dev/./urandom -Djava.net.preferIPv4Stack=true -jar <https://builds.apache.org/job/hbase-0.95-on-hadoop2/ws/0.95-on-hadoop2/hbase-server/target/surefire/surefirebooter1982493046837928001.jar> <https://builds.apache.org/job/hbase-0.95-on-hadoop2/ws/0.95-on-hadoop2/hbase-server/target/surefire/surefire281543280921839344tmp> <https://builds.apache.org/job/hbase-0.95-on-hadoop2/ws/0.95-on-hadoop2/hbase-server/target/surefire/surefire_119776341876753353535tmp>
Forking command line: /bin/sh -c cd <https://builds.apache.org/job/hbase-0.95-on-hadoop2/ws/0.95-on-hadoop2/hbase-server> && /home/jenkins/tools/java/jdk1.6.0_27-32/jre/bin/java -enableassertions -Xmx1900m -Djava.security.egd=file:/dev/./urandom -Djava.net.preferIPv4Stack=true -jar <https://builds.apache.org/job/hbase-0.95-on-hadoop2/ws/0.95-on-hadoop2/hbase-server/target/surefire/surefirebooter8758599722942227239.jar> <https://builds.apache.org/job/hbase-0.95-on-hadoop2/ws/0.95-on-hadoop2/hbase-server/target/surefire/surefire4689746551482500126tmp> <https://builds.apache.org/job/hbase-0.95-on-hadoop2/ws/0.95-on-hadoop2/hbase-server/target/surefire/surefire_1208199094942100616175tmp>
Running org.apache.hadoop.hbase.regionserver.TestRegionServerNoMaster
Tests run: 7, Failures: 0, Errors: 0, Skipped: 0, Time elapsed: 780.023 sec
Forking command line: /bin/sh -c cd <https://builds.apache.org/job/hbase-0.95-on-hadoop2/ws/0.95-on-hadoop2/hbase-server> && /home/jenkins/tools/java/jdk1.6.0_27-32/jre/bin/java -enableassertions -Xmx1900m -Djava.security.egd=file:/dev/./urandom -Djava.net.preferIPv4Stack=true -jar <https://builds.apache.org/job/hbase-0.95-on-hadoop2/ws/0.95-on-hadoop2/hbase-server/target/surefire/surefirebooter139534945095121797.jar> <https://builds.apache.org/job/hbase-0.95-on-hadoop2/ws/0.95-on-hadoop2/hbase-server/target/surefire/surefire1454812508879566157tmp> <https://builds.apache.org/job/hbase-0.95-on-hadoop2/ws/0.95-on-hadoop2/hbase-server/target/surefire/surefire_1215797095574462121808tmp>
Forking command line: /bin/sh -c cd <https://builds.apache.org/job/hbase-0.95-on-hadoop2/ws/0.95-on-hadoop2/hbase-server> && /home/jenkins/tools/java/jdk1.6.0_27-32/jre/bin/java -enableassertions -Xmx1900m -Djava.security.egd=file:/dev/./urandom -Djava.net.preferIPv4Stack=true -jar <https://builds.apache.org/job/hbase-0.95-on-hadoop2/ws/0.95-on-hadoop2/hbase-server/target/surefire/surefirebooter3958244155594610122.jar> <https://builds.apache.org/job/hbase-0.95-on-hadoop2/ws/0.95-on-hadoop2/hbase-server/target/surefire/surefire6799508439786637651tmp> <https://builds.apache.org/job/hbase-0.95-on-hadoop2/ws/0.95-on-hadoop2/hbase-server/target/surefire/surefire_1227352470327554376058tmp>
Build timed out (after 191 minutes). Marking the build as failed.
Running org.apache.hadoop.hbase.regionserver.TestEndToEndSplitTransaction
org.apache.maven.surefire.booter.SurefireBooterForkException: Error occurred in starting fork, check output in log
	at org.apache.maven.plugin.surefire.booterclient.ForkStarter.fork(ForkStarter.java:238)
	at org.apache.maven.plugin.surefire.booterclient.ForkStarter.access$000(ForkStarter.java:64)
	at org.apache.maven.plugin.surefire.booterclient.ForkStarter$ParallelFork.call(ForkStarter.java:303)
	at org.apache.maven.plugin.surefire.booterclient.ForkStarter$ParallelFork.call(ForkStarter.java:285)
	at java.util.concurrent.FutureTask$Sync.innerRun(FutureTask.java:303)
	at java.util.concurrent.FutureTask.run(FutureTask.java:138)
	at java.util.concurrent.ThreadPoolExecutor$Worker.runTask(ThreadPoolExecutor.java:886)
	at java.util.concurrent.ThreadPoolExecutor$Worker.run(ThreadPoolExecutor.java:908)
	at java.lang.Thread.run(Thread.java:662)
Archiving artifacts
Recording test results
Updating HBASE-8058

Mime
View raw message