hbase-dev mailing list archives

Site index · List index
Message view « Date » · « Thread »
Top « Date » · « Thread »
From Apache Jenkins Server <jenk...@builds.apache.org>
Subject Build failed in Jenkins: hbase-0.95-on-hadoop2 #23
Date Wed, 13 Mar 2013 01:37:05 GMT
See <https://builds.apache.org/job/hbase-0.95-on-hadoop2/23/changes>

Changes:

[stack] HBASE-HBASE-8054 HBASE-7797 Use consistent package name dregs

[anoopsamjohn] HBASE-8057 RegionLoad needs a toString implementation(jmspaggiari)

------------------------------------------
[...truncated 22913 lines...]
Forking command line: /bin/sh -c cd <https://builds.apache.org/job/hbase-0.95-on-hadoop2/ws/0.95-on-hadoop2/hbase-server>
&& /home/jenkins/tools/java/jdk1.6.0_27-32/jre/bin/java -enableassertions -Xmx1900m
-Djava.security.egd=file:/dev/./urandom -Djava.net.preferIPv4Stack=true -jar <https://builds.apache.org/job/hbase-0.95-on-hadoop2/ws/0.95-on-hadoop2/hbase-server/target/surefire/surefirebooter7249993666753743722.jar>
<https://builds.apache.org/job/hbase-0.95-on-hadoop2/ws/0.95-on-hadoop2/hbase-server/target/surefire/surefire1351021194359512851tmp>
<https://builds.apache.org/job/hbase-0.95-on-hadoop2/ws/0.95-on-hadoop2/hbase-server/target/surefire/surefire_1929140182805365512110tmp>
Running org.apache.hadoop.hbase.regionserver.TestSeekOptimizations
Tests run: 6, Failures: 0, Errors: 0, Skipped: 0, Time elapsed: 19.876 sec
Forking command line: /bin/sh -c cd <https://builds.apache.org/job/hbase-0.95-on-hadoop2/ws/0.95-on-hadoop2/hbase-server>
&& /home/jenkins/tools/java/jdk1.6.0_27-32/jre/bin/java -enableassertions -Xmx1900m
-Djava.security.egd=file:/dev/./urandom -Djava.net.preferIPv4Stack=true -jar <https://builds.apache.org/job/hbase-0.95-on-hadoop2/ws/0.95-on-hadoop2/hbase-server/target/surefire/surefirebooter5418075710278572265.jar>
<https://builds.apache.org/job/hbase-0.95-on-hadoop2/ws/0.95-on-hadoop2/hbase-server/target/surefire/surefire2574284889792418802tmp>
<https://builds.apache.org/job/hbase-0.95-on-hadoop2/ws/0.95-on-hadoop2/hbase-server/target/surefire/surefire_1938852005710250411567tmp>
Running org.apache.hadoop.hbase.regionserver.handler.TestCloseRegionHandler
Tests run: 3, Failures: 0, Errors: 0, Skipped: 0, Time elapsed: 11.436 sec
Forking command line: /bin/sh -c cd <https://builds.apache.org/job/hbase-0.95-on-hadoop2/ws/0.95-on-hadoop2/hbase-server>
&& /home/jenkins/tools/java/jdk1.6.0_27-32/jre/bin/java -enableassertions -Xmx1900m
-Djava.security.egd=file:/dev/./urandom -Djava.net.preferIPv4Stack=true -jar <https://builds.apache.org/job/hbase-0.95-on-hadoop2/ws/0.95-on-hadoop2/hbase-server/target/surefire/surefirebooter1023215697999561403.jar>
<https://builds.apache.org/job/hbase-0.95-on-hadoop2/ws/0.95-on-hadoop2/hbase-server/target/surefire/surefire8055171903365650396tmp>
<https://builds.apache.org/job/hbase-0.95-on-hadoop2/ws/0.95-on-hadoop2/hbase-server/target/surefire/surefire_1941266008986735780049tmp>
Running org.apache.hadoop.hbase.regionserver.handler.TestOpenRegionHandler
Tests run: 5, Failures: 0, Errors: 0, Skipped: 0, Time elapsed: 7.706 sec
Forking command line: /bin/sh -c cd <https://builds.apache.org/job/hbase-0.95-on-hadoop2/ws/0.95-on-hadoop2/hbase-server>
&& /home/jenkins/tools/java/jdk1.6.0_27-32/jre/bin/java -enableassertions -Xmx1900m
-Djava.security.egd=file:/dev/./urandom -Djava.net.preferIPv4Stack=true -jar <https://builds.apache.org/job/hbase-0.95-on-hadoop2/ws/0.95-on-hadoop2/hbase-server/target/surefire/surefirebooter5542757719903567199.jar>
<https://builds.apache.org/job/hbase-0.95-on-hadoop2/ws/0.95-on-hadoop2/hbase-server/target/surefire/surefire5325301903648423613tmp>
<https://builds.apache.org/job/hbase-0.95-on-hadoop2/ws/0.95-on-hadoop2/hbase-server/target/surefire/surefire_1952325961237498744287tmp>
Running org.apache.hadoop.hbase.regionserver.TestCompactionState
Tests run: 5, Failures: 0, Errors: 0, Skipped: 0, Time elapsed: 156.299 sec
Forking command line: /bin/sh -c cd <https://builds.apache.org/job/hbase-0.95-on-hadoop2/ws/0.95-on-hadoop2/hbase-server>
&& /home/jenkins/tools/java/jdk1.6.0_27-32/jre/bin/java -enableassertions -Xmx1900m
-Djava.security.egd=file:/dev/./urandom -Djava.net.preferIPv4Stack=true -jar <https://builds.apache.org/job/hbase-0.95-on-hadoop2/ws/0.95-on-hadoop2/hbase-server/target/surefire/surefirebooter2816563242043095249.jar>
<https://builds.apache.org/job/hbase-0.95-on-hadoop2/ws/0.95-on-hadoop2/hbase-server/target/surefire/surefire2988038558524161961tmp>
<https://builds.apache.org/job/hbase-0.95-on-hadoop2/ws/0.95-on-hadoop2/hbase-server/target/surefire/surefire_196941767125980111717tmp>
Running org.apache.hadoop.hbase.regionserver.TestHRegionServerBulkLoad
Tests run: 1, Failures: 0, Errors: 0, Skipped: 0, Time elapsed: 63.394 sec
Forking command line: /bin/sh -c cd <https://builds.apache.org/job/hbase-0.95-on-hadoop2/ws/0.95-on-hadoop2/hbase-server>
&& /home/jenkins/tools/java/jdk1.6.0_27-32/jre/bin/java -enableassertions -Xmx1900m
-Djava.security.egd=file:/dev/./urandom -Djava.net.preferIPv4Stack=true -jar <https://builds.apache.org/job/hbase-0.95-on-hadoop2/ws/0.95-on-hadoop2/hbase-server/target/surefire/surefirebooter8650300557782549999.jar>
<https://builds.apache.org/job/hbase-0.95-on-hadoop2/ws/0.95-on-hadoop2/hbase-server/target/surefire/surefire8041294622539532871tmp>
<https://builds.apache.org/job/hbase-0.95-on-hadoop2/ws/0.95-on-hadoop2/hbase-server/target/surefire/surefire_1978087602449665051533tmp>
Running org.apache.hadoop.hbase.regionserver.TestGetClosestAtOrBefore
Tests run: 3, Failures: 0, Errors: 0, Skipped: 0, Time elapsed: 5.884 sec
Forking command line: /bin/sh -c cd <https://builds.apache.org/job/hbase-0.95-on-hadoop2/ws/0.95-on-hadoop2/hbase-server>
&& /home/jenkins/tools/java/jdk1.6.0_27-32/jre/bin/java -enableassertions -Xmx1900m
-Djava.security.egd=file:/dev/./urandom -Djava.net.preferIPv4Stack=true -jar <https://builds.apache.org/job/hbase-0.95-on-hadoop2/ws/0.95-on-hadoop2/hbase-server/target/surefire/surefirebooter2181783696650640151.jar>
<https://builds.apache.org/job/hbase-0.95-on-hadoop2/ws/0.95-on-hadoop2/hbase-server/target/surefire/surefire8664647249278502057tmp>
<https://builds.apache.org/job/hbase-0.95-on-hadoop2/ws/0.95-on-hadoop2/hbase-server/target/surefire/surefire_1982652676450033651852tmp>
Running org.apache.hadoop.hbase.regionserver.TestCacheOnWriteInSchema
Tests run: 3, Failures: 0, Errors: 0, Skipped: 0, Time elapsed: 14.336 sec
Forking command line: /bin/sh -c cd <https://builds.apache.org/job/hbase-0.95-on-hadoop2/ws/0.95-on-hadoop2/hbase-server>
&& /home/jenkins/tools/java/jdk1.6.0_27-32/jre/bin/java -enableassertions -Xmx1900m
-Djava.security.egd=file:/dev/./urandom -Djava.net.preferIPv4Stack=true -jar <https://builds.apache.org/job/hbase-0.95-on-hadoop2/ws/0.95-on-hadoop2/hbase-server/target/surefire/surefirebooter4716743180320393506.jar>
<https://builds.apache.org/job/hbase-0.95-on-hadoop2/ws/0.95-on-hadoop2/hbase-server/target/surefire/surefire3776156281270442867tmp>
<https://builds.apache.org/job/hbase-0.95-on-hadoop2/ws/0.95-on-hadoop2/hbase-server/target/surefire/surefire_1996239303014953657727tmp>
Running org.apache.hadoop.hbase.regionserver.TestParallelPut
Tests run: 2, Failures: 0, Errors: 0, Skipped: 0, Time elapsed: 22.551 sec
Forking command line: /bin/sh -c cd <https://builds.apache.org/job/hbase-0.95-on-hadoop2/ws/0.95-on-hadoop2/hbase-server>
&& /home/jenkins/tools/java/jdk1.6.0_27-32/jre/bin/java -enableassertions -Xmx1900m
-Djava.security.egd=file:/dev/./urandom -Djava.net.preferIPv4Stack=true -jar <https://builds.apache.org/job/hbase-0.95-on-hadoop2/ws/0.95-on-hadoop2/hbase-server/target/surefire/surefirebooter202650047352942638.jar>
<https://builds.apache.org/job/hbase-0.95-on-hadoop2/ws/0.95-on-hadoop2/hbase-server/target/surefire/surefire4561407812209807768tmp>
<https://builds.apache.org/job/hbase-0.95-on-hadoop2/ws/0.95-on-hadoop2/hbase-server/target/surefire/surefire_2006912255898025650702tmp>
Running org.apache.hadoop.hbase.regionserver.TestPriorityRpc
Tests run: 3, Failures: 0, Errors: 0, Skipped: 0, Time elapsed: 4.147 sec
Forking command line: /bin/sh -c cd <https://builds.apache.org/job/hbase-0.95-on-hadoop2/ws/0.95-on-hadoop2/hbase-server>
&& /home/jenkins/tools/java/jdk1.6.0_27-32/jre/bin/java -enableassertions -Xmx1900m
-Djava.security.egd=file:/dev/./urandom -Djava.net.preferIPv4Stack=true -jar <https://builds.apache.org/job/hbase-0.95-on-hadoop2/ws/0.95-on-hadoop2/hbase-server/target/surefire/surefirebooter6786879697523036531.jar>
<https://builds.apache.org/job/hbase-0.95-on-hadoop2/ws/0.95-on-hadoop2/hbase-server/target/surefire/surefire5429231924144342721tmp>
<https://builds.apache.org/job/hbase-0.95-on-hadoop2/ws/0.95-on-hadoop2/hbase-server/target/surefire/surefire_2014365728450538393541tmp>
Running org.apache.hadoop.hbase.regionserver.TestRSKilledWhenMasterInitializing
Tests run: 1, Failures: 0, Errors: 1, Skipped: 0, Time elapsed: 156.397 sec <<< FAILURE!
Forking command line: /bin/sh -c cd <https://builds.apache.org/job/hbase-0.95-on-hadoop2/ws/0.95-on-hadoop2/hbase-server>
&& /home/jenkins/tools/java/jdk1.6.0_27-32/jre/bin/java -enableassertions -Xmx1900m
-Djava.security.egd=file:/dev/./urandom -Djava.net.preferIPv4Stack=true -jar <https://builds.apache.org/job/hbase-0.95-on-hadoop2/ws/0.95-on-hadoop2/hbase-server/target/surefire/surefirebooter6890036413061735052.jar>
<https://builds.apache.org/job/hbase-0.95-on-hadoop2/ws/0.95-on-hadoop2/hbase-server/target/surefire/surefire6321131296825214863tmp>
<https://builds.apache.org/job/hbase-0.95-on-hadoop2/ws/0.95-on-hadoop2/hbase-server/target/surefire/surefire_2023858356649467259058tmp>
Running org.apache.hadoop.hbase.regionserver.TestSplitTransactionOnCluster
Tests run: 9, Failures: 0, Errors: 0, Skipped: 0, Time elapsed: 126.224 sec
Forking command line: /bin/sh -c cd <https://builds.apache.org/job/hbase-0.95-on-hadoop2/ws/0.95-on-hadoop2/hbase-server>
&& /home/jenkins/tools/java/jdk1.6.0_27-32/jre/bin/java -enableassertions -Xmx1900m
-Djava.security.egd=file:/dev/./urandom -Djava.net.preferIPv4Stack=true -jar <https://builds.apache.org/job/hbase-0.95-on-hadoop2/ws/0.95-on-hadoop2/hbase-server/target/surefire/surefirebooter3038693928469292482.jar>
<https://builds.apache.org/job/hbase-0.95-on-hadoop2/ws/0.95-on-hadoop2/hbase-server/target/surefire/surefire1449918095686415628tmp>
<https://builds.apache.org/job/hbase-0.95-on-hadoop2/ws/0.95-on-hadoop2/hbase-server/target/surefire/surefire_203471657472102608239tmp>
Running org.apache.hadoop.hbase.regionserver.wal.TestLogRollAbort
Tests run: 1, Failures: 0, Errors: 0, Skipped: 0, Time elapsed: 34.367 sec
Forking command line: /bin/sh -c cd <https://builds.apache.org/job/hbase-0.95-on-hadoop2/ws/0.95-on-hadoop2/hbase-server>
&& /home/jenkins/tools/java/jdk1.6.0_27-32/jre/bin/java -enableassertions -Xmx1900m
-Djava.security.egd=file:/dev/./urandom -Djava.net.preferIPv4Stack=true -jar <https://builds.apache.org/job/hbase-0.95-on-hadoop2/ws/0.95-on-hadoop2/hbase-server/target/surefire/surefirebooter2254590393840052080.jar>
<https://builds.apache.org/job/hbase-0.95-on-hadoop2/ws/0.95-on-hadoop2/hbase-server/target/surefire/surefire7460167192161085138tmp>
<https://builds.apache.org/job/hbase-0.95-on-hadoop2/ws/0.95-on-hadoop2/hbase-server/target/surefire/surefire_2041717849872640816921tmp>
Running org.apache.hadoop.hbase.regionserver.wal.TestHLog
Tests run: 11, Failures: 0, Errors: 0, Skipped: 0, Time elapsed: 64.798 sec
Forking command line: /bin/sh -c cd <https://builds.apache.org/job/hbase-0.95-on-hadoop2/ws/0.95-on-hadoop2/hbase-server>
&& /home/jenkins/tools/java/jdk1.6.0_27-32/jre/bin/java -enableassertions -Xmx1900m
-Djava.security.egd=file:/dev/./urandom -Djava.net.preferIPv4Stack=true -jar <https://builds.apache.org/job/hbase-0.95-on-hadoop2/ws/0.95-on-hadoop2/hbase-server/target/surefire/surefirebooter7702698004792854998.jar>
<https://builds.apache.org/job/hbase-0.95-on-hadoop2/ws/0.95-on-hadoop2/hbase-server/target/surefire/surefire3201597317251898309tmp>
<https://builds.apache.org/job/hbase-0.95-on-hadoop2/ws/0.95-on-hadoop2/hbase-server/target/surefire/surefire_2059087546056560131267tmp>
Running org.apache.hadoop.hbase.regionserver.wal.TestHLogSplit
Tests run: 32, Failures: 0, Errors: 0, Skipped: 1, Time elapsed: 329.13 sec
Forking command line: /bin/sh -c cd <https://builds.apache.org/job/hbase-0.95-on-hadoop2/ws/0.95-on-hadoop2/hbase-server>
&& /home/jenkins/tools/java/jdk1.6.0_27-32/jre/bin/java -enableassertions -Xmx1900m
-Djava.security.egd=file:/dev/./urandom -Djava.net.preferIPv4Stack=true -jar <https://builds.apache.org/job/hbase-0.95-on-hadoop2/ws/0.95-on-hadoop2/hbase-server/target/surefire/surefirebooter1438546029064577701.jar>
<https://builds.apache.org/job/hbase-0.95-on-hadoop2/ws/0.95-on-hadoop2/hbase-server/target/surefire/surefire369291693183101481tmp>
<https://builds.apache.org/job/hbase-0.95-on-hadoop2/ws/0.95-on-hadoop2/hbase-server/target/surefire/surefire_206520051312002451187tmp>
Running org.apache.hadoop.hbase.regionserver.wal.TestHLogSplitCompressed
Tests run: 32, Failures: 0, Errors: 0, Skipped: 1, Time elapsed: 337.386 sec
Forking command line: /bin/sh -c cd <https://builds.apache.org/job/hbase-0.95-on-hadoop2/ws/0.95-on-hadoop2/hbase-server>
&& /home/jenkins/tools/java/jdk1.6.0_27-32/jre/bin/java -enableassertions -Xmx1900m
-Djava.security.egd=file:/dev/./urandom -Djava.net.preferIPv4Stack=true -jar <https://builds.apache.org/job/hbase-0.95-on-hadoop2/ws/0.95-on-hadoop2/hbase-server/target/surefire/surefirebooter8218951784783040662.jar>
<https://builds.apache.org/job/hbase-0.95-on-hadoop2/ws/0.95-on-hadoop2/hbase-server/target/surefire/surefire5710401467840961281tmp>
<https://builds.apache.org/job/hbase-0.95-on-hadoop2/ws/0.95-on-hadoop2/hbase-server/target/surefire/surefire_2072304147342494479184tmp>
Running org.apache.hadoop.hbase.regionserver.wal.TestWALReplay
Tests run: 8, Failures: 0, Errors: 0, Skipped: 0, Time elapsed: 317.913 sec
Forking command line: /bin/sh -c cd <https://builds.apache.org/job/hbase-0.95-on-hadoop2/ws/0.95-on-hadoop2/hbase-server>
&& /home/jenkins/tools/java/jdk1.6.0_27-32/jre/bin/java -enableassertions -Xmx1900m
-Djava.security.egd=file:/dev/./urandom -Djava.net.preferIPv4Stack=true -jar <https://builds.apache.org/job/hbase-0.95-on-hadoop2/ws/0.95-on-hadoop2/hbase-server/target/surefire/surefirebooter4915850460813275962.jar>
<https://builds.apache.org/job/hbase-0.95-on-hadoop2/ws/0.95-on-hadoop2/hbase-server/target/surefire/surefire4571400556348395985tmp>
<https://builds.apache.org/job/hbase-0.95-on-hadoop2/ws/0.95-on-hadoop2/hbase-server/target/surefire/surefire_2086272670570495140831tmp>
Running org.apache.hadoop.hbase.regionserver.TestStoreScanner
Tests run: 16, Failures: 0, Errors: 0, Skipped: 0, Time elapsed: 0.445 sec
Forking command line: /bin/sh -c cd <https://builds.apache.org/job/hbase-0.95-on-hadoop2/ws/0.95-on-hadoop2/hbase-server>
&& /home/jenkins/tools/java/jdk1.6.0_27-32/jre/bin/java -enableassertions -Xmx1900m
-Djava.security.egd=file:/dev/./urandom -Djava.net.preferIPv4Stack=true -jar <https://builds.apache.org/job/hbase-0.95-on-hadoop2/ws/0.95-on-hadoop2/hbase-server/target/surefire/surefirebooter4124740874448980348.jar>
<https://builds.apache.org/job/hbase-0.95-on-hadoop2/ws/0.95-on-hadoop2/hbase-server/target/surefire/surefire7045437638164672911tmp>
<https://builds.apache.org/job/hbase-0.95-on-hadoop2/ws/0.95-on-hadoop2/hbase-server/target/surefire/surefire_2092528100954864046445tmp>
Running org.apache.hadoop.hbase.regionserver.wal.TestHLogFiltering
Tests run: 1, Failures: 0, Errors: 0, Skipped: 0, Time elapsed: 77.099 sec
Forking command line: /bin/sh -c cd <https://builds.apache.org/job/hbase-0.95-on-hadoop2/ws/0.95-on-hadoop2/hbase-server>
&& /home/jenkins/tools/java/jdk1.6.0_27-32/jre/bin/java -enableassertions -Xmx1900m
-Djava.security.egd=file:/dev/./urandom -Djava.net.preferIPv4Stack=true -jar <https://builds.apache.org/job/hbase-0.95-on-hadoop2/ws/0.95-on-hadoop2/hbase-server/target/surefire/surefirebooter5674774087938070022.jar>
<https://builds.apache.org/job/hbase-0.95-on-hadoop2/ws/0.95-on-hadoop2/hbase-server/target/surefire/surefire4135864417634203663tmp>
<https://builds.apache.org/job/hbase-0.95-on-hadoop2/ws/0.95-on-hadoop2/hbase-server/target/surefire/surefire_2107131350545099508168tmp>
Running org.apache.hadoop.hbase.regionserver.TestEndToEndSplitTransaction
Tests run: 2, Failures: 0, Errors: 0, Skipped: 0, Time elapsed: 49.213 sec
Forking command line: /bin/sh -c cd <https://builds.apache.org/job/hbase-0.95-on-hadoop2/ws/0.95-on-hadoop2/hbase-server>
&& /home/jenkins/tools/java/jdk1.6.0_27-32/jre/bin/java -enableassertions -Xmx1900m
-Djava.security.egd=file:/dev/./urandom -Djava.net.preferIPv4Stack=true -jar <https://builds.apache.org/job/hbase-0.95-on-hadoop2/ws/0.95-on-hadoop2/hbase-server/target/surefire/surefirebooter7239621654378400579.jar>
<https://builds.apache.org/job/hbase-0.95-on-hadoop2/ws/0.95-on-hadoop2/hbase-server/target/surefire/surefire1664928800102659776tmp>
<https://builds.apache.org/job/hbase-0.95-on-hadoop2/ws/0.95-on-hadoop2/hbase-server/target/surefire/surefire_2114810828012558648911tmp>
Running org.apache.hadoop.hbase.regionserver.TestCompaction
Tests run: 17, Failures: 0, Errors: 0, Skipped: 0, Time elapsed: 91.648 sec
Forking command line: /bin/sh -c cd <https://builds.apache.org/job/hbase-0.95-on-hadoop2/ws/0.95-on-hadoop2/hbase-server>
&& /home/jenkins/tools/java/jdk1.6.0_27-32/jre/bin/java -enableassertions -Xmx1900m
-Djava.security.egd=file:/dev/./urandom -Djava.net.preferIPv4Stack=true -jar <https://builds.apache.org/job/hbase-0.95-on-hadoop2/ws/0.95-on-hadoop2/hbase-server/target/surefire/surefirebooter6416938413192500402.jar>
<https://builds.apache.org/job/hbase-0.95-on-hadoop2/ws/0.95-on-hadoop2/hbase-server/target/surefire/surefire551602230435183151tmp>
<https://builds.apache.org/job/hbase-0.95-on-hadoop2/ws/0.95-on-hadoop2/hbase-server/target/surefire/surefire_2126375877344438926431tmp>
Running org.apache.hadoop.hbase.regionserver.wal.TestWALReplayCompressed
Tests run: 8, Failures: 0, Errors: 0, Skipped: 0, Time elapsed: 191.504 sec
Forking command line: /bin/sh -c cd <https://builds.apache.org/job/hbase-0.95-on-hadoop2/ws/0.95-on-hadoop2/hbase-server>
&& /home/jenkins/tools/java/jdk1.6.0_27-32/jre/bin/java -enableassertions -Xmx1900m
-Djava.security.egd=file:/dev/./urandom -Djava.net.preferIPv4Stack=true -jar <https://builds.apache.org/job/hbase-0.95-on-hadoop2/ws/0.95-on-hadoop2/hbase-server/target/surefire/surefirebooter3680129865713197862.jar>
<https://builds.apache.org/job/hbase-0.95-on-hadoop2/ws/0.95-on-hadoop2/hbase-server/target/surefire/surefire7666352024558657832tmp>
<https://builds.apache.org/job/hbase-0.95-on-hadoop2/ws/0.95-on-hadoop2/hbase-server/target/surefire/surefire_2137097523396480000267tmp>
Running org.apache.hadoop.hbase.mapred.TestTableInputFormat
Tests run: 10, Failures: 0, Errors: 0, Skipped: 0, Time elapsed: 39.387 sec
Forking command line: /bin/sh -c cd <https://builds.apache.org/job/hbase-0.95-on-hadoop2/ws/0.95-on-hadoop2/hbase-server>
&& /home/jenkins/tools/java/jdk1.6.0_27-32/jre/bin/java -enableassertions -Xmx1900m
-Djava.security.egd=file:/dev/./urandom -Djava.net.preferIPv4Stack=true -jar <https://builds.apache.org/job/hbase-0.95-on-hadoop2/ws/0.95-on-hadoop2/hbase-server/target/surefire/surefirebooter3613710925899820100.jar>
<https://builds.apache.org/job/hbase-0.95-on-hadoop2/ws/0.95-on-hadoop2/hbase-server/target/surefire/surefire1204529446836799709tmp>
<https://builds.apache.org/job/hbase-0.95-on-hadoop2/ws/0.95-on-hadoop2/hbase-server/target/surefire/surefire_2142210711859145326387tmp>
Running org.apache.hadoop.hbase.regionserver.TestMultiColumnScanner
Tests run: 12, Failures: 0, Errors: 0, Skipped: 0, Time elapsed: 137.321 sec
Forking command line: /bin/sh -c cd <https://builds.apache.org/job/hbase-0.95-on-hadoop2/ws/0.95-on-hadoop2/hbase-server>
&& /home/jenkins/tools/java/jdk1.6.0_27-32/jre/bin/java -enableassertions -Xmx1900m
-Djava.security.egd=file:/dev/./urandom -Djava.net.preferIPv4Stack=true -jar <https://builds.apache.org/job/hbase-0.95-on-hadoop2/ws/0.95-on-hadoop2/hbase-server/target/surefire/surefirebooter7920811251620632401.jar>
<https://builds.apache.org/job/hbase-0.95-on-hadoop2/ws/0.95-on-hadoop2/hbase-server/target/surefire/surefire3885260579726095722tmp>
<https://builds.apache.org/job/hbase-0.95-on-hadoop2/ws/0.95-on-hadoop2/hbase-server/target/surefire/surefire_2151329406219251341941tmp>
Running org.apache.hadoop.hbase.fs.TestBlockReorder
Tests run: 3, Failures: 0, Errors: 0, Skipped: 0, Time elapsed: 66.774 sec
Forking command line: /bin/sh -c cd <https://builds.apache.org/job/hbase-0.95-on-hadoop2/ws/0.95-on-hadoop2/hbase-server>
&& /home/jenkins/tools/java/jdk1.6.0_27-32/jre/bin/java -enableassertions -Xmx1900m
-Djava.security.egd=file:/dev/./urandom -Djava.net.preferIPv4Stack=true -jar <https://builds.apache.org/job/hbase-0.95-on-hadoop2/ws/0.95-on-hadoop2/hbase-server/target/surefire/surefirebooter3692449715567356265.jar>
<https://builds.apache.org/job/hbase-0.95-on-hadoop2/ws/0.95-on-hadoop2/hbase-server/target/surefire/surefire6237664844642349934tmp>
<https://builds.apache.org/job/hbase-0.95-on-hadoop2/ws/0.95-on-hadoop2/hbase-server/target/surefire/surefire_2168732793297197150952tmp>
Running org.apache.hadoop.hbase.mapred.TestTableMapReduce
Tests run: 1, Failures: 0, Errors: 0, Skipped: 0, Time elapsed: 113.838 sec
Forking command line: /bin/sh -c cd <https://builds.apache.org/job/hbase-0.95-on-hadoop2/ws/0.95-on-hadoop2/hbase-server>
&& /home/jenkins/tools/java/jdk1.6.0_27-32/jre/bin/java -enableassertions -Xmx1900m
-Djava.security.egd=file:/dev/./urandom -Djava.net.preferIPv4Stack=true -jar <https://builds.apache.org/job/hbase-0.95-on-hadoop2/ws/0.95-on-hadoop2/hbase-server/target/surefire/surefirebooter6748162510794232339.jar>
<https://builds.apache.org/job/hbase-0.95-on-hadoop2/ws/0.95-on-hadoop2/hbase-server/target/surefire/surefire2768798245794338906tmp>
<https://builds.apache.org/job/hbase-0.95-on-hadoop2/ws/0.95-on-hadoop2/hbase-server/target/surefire/surefire_2176785136910966655829tmp>
Running org.apache.hadoop.hbase.backup.example.TestZooKeeperTableArchiveClient
Tests run: 3, Failures: 0, Errors: 0, Skipped: 0, Time elapsed: 12.537 sec
Forking command line: /bin/sh -c cd <https://builds.apache.org/job/hbase-0.95-on-hadoop2/ws/0.95-on-hadoop2/hbase-server>
&& /home/jenkins/tools/java/jdk1.6.0_27-32/jre/bin/java -enableassertions -Xmx1900m
-Djava.security.egd=file:/dev/./urandom -Djava.net.preferIPv4Stack=true -jar <https://builds.apache.org/job/hbase-0.95-on-hadoop2/ws/0.95-on-hadoop2/hbase-server/target/surefire/surefirebooter737954245808833618.jar>
<https://builds.apache.org/job/hbase-0.95-on-hadoop2/ws/0.95-on-hadoop2/hbase-server/target/surefire/surefire400994573678996620tmp>
<https://builds.apache.org/job/hbase-0.95-on-hadoop2/ws/0.95-on-hadoop2/hbase-server/target/surefire/surefire_2185933314737710765795tmp>
Running org.apache.hadoop.hbase.TestClusterBootOrder
Tests run: 2, Failures: 0, Errors: 0, Skipped: 0, Time elapsed: 42.177 sec
Forking command line: /bin/sh -c cd <https://builds.apache.org/job/hbase-0.95-on-hadoop2/ws/0.95-on-hadoop2/hbase-server>
&& /home/jenkins/tools/java/jdk1.6.0_27-32/jre/bin/java -enableassertions -Xmx1900m
-Djava.security.egd=file:/dev/./urandom -Djava.net.preferIPv4Stack=true -jar <https://builds.apache.org/job/hbase-0.95-on-hadoop2/ws/0.95-on-hadoop2/hbase-server/target/surefire/surefirebooter8001828973762105727.jar>
<https://builds.apache.org/job/hbase-0.95-on-hadoop2/ws/0.95-on-hadoop2/hbase-server/target/surefire/surefire2343924568717268338tmp>
<https://builds.apache.org/job/hbase-0.95-on-hadoop2/ws/0.95-on-hadoop2/hbase-server/target/surefire/surefire_2192803133865233120044tmp>
Running org.apache.hadoop.hbase.TestDrainingServer
Tests run: 2, Failures: 0, Errors: 0, Skipped: 0, Time elapsed: 34.845 sec
Forking command line: /bin/sh -c cd <https://builds.apache.org/job/hbase-0.95-on-hadoop2/ws/0.95-on-hadoop2/hbase-server>
&& /home/jenkins/tools/java/jdk1.6.0_27-32/jre/bin/java -enableassertions -Xmx1900m
-Djava.security.egd=file:/dev/./urandom -Djava.net.preferIPv4Stack=true -jar <https://builds.apache.org/job/hbase-0.95-on-hadoop2/ws/0.95-on-hadoop2/hbase-server/target/surefire/surefirebooter4478977138254946878.jar>
<https://builds.apache.org/job/hbase-0.95-on-hadoop2/ws/0.95-on-hadoop2/hbase-server/target/surefire/surefire5587343965100340474tmp>
<https://builds.apache.org/job/hbase-0.95-on-hadoop2/ws/0.95-on-hadoop2/hbase-server/target/surefire/surefire_2203147942603785389159tmp>
Running org.apache.hadoop.hbase.backup.TestHFileArchiving
Tests run: 5, Failures: 0, Errors: 0, Skipped: 0, Time elapsed: 153.852 sec
Forking command line: /bin/sh -c cd <https://builds.apache.org/job/hbase-0.95-on-hadoop2/ws/0.95-on-hadoop2/hbase-server>
&& /home/jenkins/tools/java/jdk1.6.0_27-32/jre/bin/java -enableassertions -Xmx1900m
-Djava.security.egd=file:/dev/./urandom -Djava.net.preferIPv4Stack=true -jar <https://builds.apache.org/job/hbase-0.95-on-hadoop2/ws/0.95-on-hadoop2/hbase-server/target/surefire/surefirebooter2539914425278127239.jar>
<https://builds.apache.org/job/hbase-0.95-on-hadoop2/ws/0.95-on-hadoop2/hbase-server/target/surefire/surefire5943808740986145155tmp>
<https://builds.apache.org/job/hbase-0.95-on-hadoop2/ws/0.95-on-hadoop2/hbase-server/target/surefire/surefire_2213449094215738445147tmp>
Forking command line: /bin/sh -c cd <https://builds.apache.org/job/hbase-0.95-on-hadoop2/ws/0.95-on-hadoop2/hbase-server>
&& /home/jenkins/tools/java/jdk1.6.0_27-32/jre/bin/java -enableassertions -Xmx1900m
-Djava.security.egd=file:/dev/./urandom -Djava.net.preferIPv4Stack=true -jar <https://builds.apache.org/job/hbase-0.95-on-hadoop2/ws/0.95-on-hadoop2/hbase-server/target/surefire/surefirebooter8841062590249641465.jar>
<https://builds.apache.org/job/hbase-0.95-on-hadoop2/ws/0.95-on-hadoop2/hbase-server/target/surefire/surefire2220547885227693646tmp>
<https://builds.apache.org/job/hbase-0.95-on-hadoop2/ws/0.95-on-hadoop2/hbase-server/target/surefire/surefire_2228629851128332234521tmp>
Running org.apache.hadoop.hbase.mapreduce.TestTimeRangeMapRed
Tests run: 1, Failures: 0, Errors: 0, Skipped: 0, Time elapsed: 66.675 sec
Forking command line: /bin/sh -c cd <https://builds.apache.org/job/hbase-0.95-on-hadoop2/ws/0.95-on-hadoop2/hbase-server>
&& /home/jenkins/tools/java/jdk1.6.0_27-32/jre/bin/java -enableassertions -Xmx1900m
-Djava.security.egd=file:/dev/./urandom -Djava.net.preferIPv4Stack=true -jar <https://builds.apache.org/job/hbase-0.95-on-hadoop2/ws/0.95-on-hadoop2/hbase-server/target/surefire/surefirebooter2228287609720030788.jar>
<https://builds.apache.org/job/hbase-0.95-on-hadoop2/ws/0.95-on-hadoop2/hbase-server/target/surefire/surefire7057374907659467958tmp>
<https://builds.apache.org/job/hbase-0.95-on-hadoop2/ws/0.95-on-hadoop2/hbase-server/target/surefire/surefire_2234467945315000420784tmp>
Forking command line: /bin/sh -c cd <https://builds.apache.org/job/hbase-0.95-on-hadoop2/ws/0.95-on-hadoop2/hbase-server>
&& /home/jenkins/tools/java/jdk1.6.0_27-32/jre/bin/java -enableassertions -Xmx1900m
-Djava.security.egd=file:/dev/./urandom -Djava.net.preferIPv4Stack=true -jar <https://builds.apache.org/job/hbase-0.95-on-hadoop2/ws/0.95-on-hadoop2/hbase-server/target/surefire/surefirebooter6961187163405754120.jar>
<https://builds.apache.org/job/hbase-0.95-on-hadoop2/ws/0.95-on-hadoop2/hbase-server/target/surefire/surefire788000179498040006tmp>
<https://builds.apache.org/job/hbase-0.95-on-hadoop2/ws/0.95-on-hadoop2/hbase-server/target/surefire/surefire_2245184301507236788952tmp>
Running org.apache.hadoop.hbase.mapreduce.TestRowCounter
Tests run: 3, Failures: 0, Errors: 0, Skipped: 0, Time elapsed: 180.898 sec
Forking command line: /bin/sh -c cd <https://builds.apache.org/job/hbase-0.95-on-hadoop2/ws/0.95-on-hadoop2/hbase-server>
&& /home/jenkins/tools/java/jdk1.6.0_27-32/jre/bin/java -enableassertions -Xmx1900m
-Djava.security.egd=file:/dev/./urandom -Djava.net.preferIPv4Stack=true -jar <https://builds.apache.org/job/hbase-0.95-on-hadoop2/ws/0.95-on-hadoop2/hbase-server/target/surefire/surefirebooter5097504617154325908.jar>
<https://builds.apache.org/job/hbase-0.95-on-hadoop2/ws/0.95-on-hadoop2/hbase-server/target/surefire/surefire7204004065141699781tmp>
<https://builds.apache.org/job/hbase-0.95-on-hadoop2/ws/0.95-on-hadoop2/hbase-server/target/surefire/surefire_2253170703661658206858tmp>
org.apache.maven.surefire.booter.SurefireBooterForkException: Error occurred in starting fork,
check output in log
	at org.apache.maven.plugin.surefire.booterclient.ForkStarter.fork(ForkStarter.java:238)
	at org.apache.maven.plugin.surefire.booterclient.ForkStarter.access$000(ForkStarter.java:64)
	at org.apache.maven.plugin.surefire.booterclient.ForkStarter$ParallelFork.call(ForkStarter.java:303)
	at org.apache.maven.plugin.surefire.booterclient.ForkStarter$ParallelFork.call(ForkStarter.java:285)
	at java.util.concurrent.FutureTask$Sync.innerRun(FutureTask.java:303)
	at java.util.concurrent.FutureTask.run(FutureTask.java:138)
	at java.util.concurrent.ThreadPoolExecutor$Worker.runTask(ThreadPoolExecutor.java:886)
	at java.util.concurrent.ThreadPoolExecutor$Worker.run(ThreadPoolExecutor.java:908)
	at java.lang.Thread.run(Thread.java:662)
No results for java.util.concurrent.FutureTask@ee6d79
Forking command line: /bin/sh -c cd <https://builds.apache.org/job/hbase-0.95-on-hadoop2/ws/0.95-on-hadoop2/hbase-server>
&& /home/jenkins/tools/java/jdk1.6.0_27-32/jre/bin/java -enableassertions -Xmx1900m
-Djava.security.egd=file:/dev/./urandom -Djava.net.preferIPv4Stack=true -jar <https://builds.apache.org/job/hbase-0.95-on-hadoop2/ws/0.95-on-hadoop2/hbase-server/target/surefire/surefirebooter7166849641383139415.jar>
<https://builds.apache.org/job/hbase-0.95-on-hadoop2/ws/0.95-on-hadoop2/hbase-server/target/surefire/surefire3315270045651100783tmp>
<https://builds.apache.org/job/hbase-0.95-on-hadoop2/ws/0.95-on-hadoop2/hbase-server/target/surefire/surefire_2264964496904809559181tmp>
org.apache.maven.surefire.booter.SurefireBooterForkException: Error occurred in starting fork,
check output in log
	at org.apache.maven.plugin.surefire.booterclient.ForkStarter.fork(ForkStarter.java:238)
	at org.apache.maven.plugin.surefire.booterclient.ForkStarter.access$000(ForkStarter.java:64)
	at org.apache.maven.plugin.surefire.booterclient.ForkStarter$ParallelFork.call(ForkStarter.java:303)
	at org.apache.maven.plugin.surefire.booterclient.ForkStarter$ParallelFork.call(ForkStarter.java:285)
	at java.util.concurrent.FutureTask$Sync.innerRun(FutureTask.java:303)
	at java.util.concurrent.FutureTask.run(FutureTask.java:138)
	at java.util.concurrent.ThreadPoolExecutor$Worker.runTask(ThreadPoolExecutor.java:886)
	at java.util.concurrent.ThreadPoolExecutor$Worker.run(ThreadPoolExecutor.java:908)
	at java.lang.Thread.run(Thread.java:662)
No results for java.util.concurrent.FutureTask@141be6c
Forking command line: /bin/sh -c cd <https://builds.apache.org/job/hbase-0.95-on-hadoop2/ws/0.95-on-hadoop2/hbase-server>
&& /home/jenkins/tools/java/jdk1.6.0_27-32/jre/bin/java -enableassertions -Xmx1900m
-Djava.security.egd=file:/dev/./urandom -Djava.net.preferIPv4Stack=true -jar <https://builds.apache.org/job/hbase-0.95-on-hadoop2/ws/0.95-on-hadoop2/hbase-server/target/surefire/surefirebooter3057929461064252636.jar>
<https://builds.apache.org/job/hbase-0.95-on-hadoop2/ws/0.95-on-hadoop2/hbase-server/target/surefire/surefire1309266119124200906tmp>
<https://builds.apache.org/job/hbase-0.95-on-hadoop2/ws/0.95-on-hadoop2/hbase-server/target/surefire/surefire_227904889752995190061tmp>
Running org.apache.hadoop.hbase.mapreduce.TestWALPlayer
Tests run: 1, Failures: 0, Errors: 0, Skipped: 0, Time elapsed: 118.121 sec
Forking command line: /bin/sh -c cd <https://builds.apache.org/job/hbase-0.95-on-hadoop2/ws/0.95-on-hadoop2/hbase-server>
&& /home/jenkins/tools/java/jdk1.6.0_27-32/jre/bin/java -enableassertions -Xmx1900m
-Djava.security.egd=file:/dev/./urandom -Djava.net.preferIPv4Stack=true -jar <https://builds.apache.org/job/hbase-0.95-on-hadoop2/ws/0.95-on-hadoop2/hbase-server/target/surefire/surefirebooter291885894185121925.jar>
<https://builds.apache.org/job/hbase-0.95-on-hadoop2/ws/0.95-on-hadoop2/hbase-server/target/surefire/surefire1702557247888131647tmp>
<https://builds.apache.org/job/hbase-0.95-on-hadoop2/ws/0.95-on-hadoop2/hbase-server/target/surefire/surefire_2281468757837412489434tmp>
org.apache.maven.surefire.booter.SurefireBooterForkException: Error occurred in starting fork,
check output in log
	at org.apache.maven.plugin.surefire.booterclient.ForkStarter.fork(ForkStarter.java:238)
	at org.apache.maven.plugin.surefire.booterclient.ForkStarter.access$000(ForkStarter.java:64)
	at org.apache.maven.plugin.surefire.booterclient.ForkStarter$ParallelFork.call(ForkStarter.java:303)
	at org.apache.maven.plugin.surefire.booterclient.ForkStarter$ParallelFork.call(ForkStarter.java:285)
	at java.util.concurrent.FutureTask$Sync.innerRun(FutureTask.java:303)
	at java.util.concurrent.FutureTask.run(FutureTask.java:138)
	at java.util.concurrent.ThreadPoolExecutor$Worker.runTask(ThreadPoolExecutor.java:886)
	at java.util.concurrent.ThreadPoolExecutor$Worker.run(ThreadPoolExecutor.java:908)
	at java.lang.Thread.run(Thread.java:662)
Forking command line: /bin/sh -c cd <https://builds.apache.org/job/hbase-0.95-on-hadoop2/ws/0.95-on-hadoop2/hbase-server>
&& /home/jenkins/tools/java/jdk1.6.0_27-32/jre/bin/java -enableassertions -Xmx1900m
-Djava.security.egd=file:/dev/./urandom -Djava.net.preferIPv4Stack=true -jar <https://builds.apache.org/job/hbase-0.95-on-hadoop2/ws/0.95-on-hadoop2/hbase-server/target/surefire/surefirebooter6716454824072060618.jar>
<https://builds.apache.org/job/hbase-0.95-on-hadoop2/ws/0.95-on-hadoop2/hbase-server/target/surefire/surefire1040218299998723355tmp>
<https://builds.apache.org/job/hbase-0.95-on-hadoop2/ws/0.95-on-hadoop2/hbase-server/target/surefire/surefire_229249923052223689967tmp>
Running org.apache.hadoop.hbase.mapreduce.TestLoadIncrementalHFilesSplitRecovery
Tests run: 4, Failures: 0, Errors: 0, Skipped: 0, Time elapsed: 147.651 sec
Forking command line: /bin/sh -c cd <https://builds.apache.org/job/hbase-0.95-on-hadoop2/ws/0.95-on-hadoop2/hbase-server>
&& /home/jenkins/tools/java/jdk1.6.0_27-32/jre/bin/java -enableassertions -Xmx1900m
-Djava.security.egd=file:/dev/./urandom -Djava.net.preferIPv4Stack=true -jar <https://builds.apache.org/job/hbase-0.95-on-hadoop2/ws/0.95-on-hadoop2/hbase-server/target/surefire/surefirebooter7364681734549561394.jar>
<https://builds.apache.org/job/hbase-0.95-on-hadoop2/ws/0.95-on-hadoop2/hbase-server/target/surefire/surefire2492422911743226634tmp>
<https://builds.apache.org/job/hbase-0.95-on-hadoop2/ws/0.95-on-hadoop2/hbase-server/target/surefire/surefire_2306415637303563624685tmp>
Running org.apache.hadoop.hbase.mapreduce.TestImportExport
Tests run: 5, Failures: 1, Errors: 2, Skipped: 0, Time elapsed: 344.921 sec <<< FAILURE!
Forking command line: /bin/sh -c cd <https://builds.apache.org/job/hbase-0.95-on-hadoop2/ws/0.95-on-hadoop2/hbase-server>
&& /home/jenkins/tools/java/jdk1.6.0_27-32/jre/bin/java -enableassertions -Xmx1900m
-Djava.security.egd=file:/dev/./urandom -Djava.net.preferIPv4Stack=true -jar <https://builds.apache.org/job/hbase-0.95-on-hadoop2/ws/0.95-on-hadoop2/hbase-server/target/surefire/surefirebooter2004128169706456835.jar>
<https://builds.apache.org/job/hbase-0.95-on-hadoop2/ws/0.95-on-hadoop2/hbase-server/target/surefire/surefire8571311516818304779tmp>
<https://builds.apache.org/job/hbase-0.95-on-hadoop2/ws/0.95-on-hadoop2/hbase-server/target/surefire/surefire_2311136941510145986920tmp>
Running org.apache.hadoop.hbase.mapreduce.TestMultithreadedTableMapper
Tests run: 1, Failures: 0, Errors: 0, Skipped: 0, Time elapsed: 238.257 sec
Forking command line: /bin/sh -c cd <https://builds.apache.org/job/hbase-0.95-on-hadoop2/ws/0.95-on-hadoop2/hbase-server>
&& /home/jenkins/tools/java/jdk1.6.0_27-32/jre/bin/java -enableassertions -Xmx1900m
-Djava.security.egd=file:/dev/./urandom -Djava.net.preferIPv4Stack=true -jar <https://builds.apache.org/job/hbase-0.95-on-hadoop2/ws/0.95-on-hadoop2/hbase-server/target/surefire/surefirebooter7321037328528516233.jar>
<https://builds.apache.org/job/hbase-0.95-on-hadoop2/ws/0.95-on-hadoop2/hbase-server/target/surefire/surefire3631033753014923469tmp>
<https://builds.apache.org/job/hbase-0.95-on-hadoop2/ws/0.95-on-hadoop2/hbase-server/target/surefire/surefire_2327392505429659049150tmp>
Running org.apache.hadoop.hbase.mapreduce.TestLoadIncrementalHFiles
Tests run: 6, Failures: 0, Errors: 0, Skipped: 0, Time elapsed: 53.018 sec
Forking command line: /bin/sh -c cd <https://builds.apache.org/job/hbase-0.95-on-hadoop2/ws/0.95-on-hadoop2/hbase-server>
&& /home/jenkins/tools/java/jdk1.6.0_27-32/jre/bin/java -enableassertions -Xmx1900m
-Djava.security.egd=file:/dev/./urandom -Djava.net.preferIPv4Stack=true -jar <https://builds.apache.org/job/hbase-0.95-on-hadoop2/ws/0.95-on-hadoop2/hbase-server/target/surefire/surefirebooter6912118782638278956.jar>
<https://builds.apache.org/job/hbase-0.95-on-hadoop2/ws/0.95-on-hadoop2/hbase-server/target/surefire/surefire6078863996401712486tmp>
<https://builds.apache.org/job/hbase-0.95-on-hadoop2/ws/0.95-on-hadoop2/hbase-server/target/surefire/surefire_2339011405498587555208tmp>
Running org.apache.hadoop.hbase.mapreduce.TestHLogRecordReader
Tests run: 2, Failures: 0, Errors: 0, Skipped: 0, Time elapsed: 22.52 sec
org.apache.maven.surefire.booter.SurefireBooterForkException: Error occurred in starting fork,
check output in log
	at org.apache.maven.plugin.surefire.booterclient.ForkStarter.fork(ForkStarter.java:238)
	at org.apache.maven.plugin.surefire.booterclient.ForkStarter.access$000(ForkStarter.java:64)
	at org.apache.maven.plugin.surefire.booterclient.ForkStarter$ParallelFork.call(ForkStarter.java:303)
	at org.apache.maven.plugin.surefire.booterclient.ForkStarter$ParallelFork.call(ForkStarter.java:285)
	at java.util.concurrent.FutureTask$Sync.innerRun(FutureTask.java:303)
	at java.util.concurrent.FutureTask.run(FutureTask.java:138)
	at java.util.concurrent.ThreadPoolExecutor$Worker.runTask(ThreadPoolExecutor.java:886)
	at java.util.concurrent.ThreadPoolExecutor$Worker.run(ThreadPoolExecutor.java:908)
	at java.lang.Thread.run(Thread.java:662)
No results for java.util.concurrent.FutureTask@c10c14
No results for java.util.concurrent.FutureTask@2084
Running org.apache.hadoop.hbase.mapreduce.TestTableMapReduce
Tests run: 2, Failures: 0, Errors: 0, Skipped: 0, Time elapsed: 317.354 sec

Results :

Failed tests:   testRegionShouldNotBeDeployed(org.apache.hadoop.hbase.util.TestHBaseFsck):
expected:<[SHOULD_NOT_BE_DEPLOYED]> but was:<[]>
  testThreeRSAbort(org.apache.hadoop.hbase.master.TestDistributedLogSplitting): Timedout
  testSimpleCase(org.apache.hadoop.hbase.mapreduce.TestImportExport)

Tests in error: 
  loadTest[0](org.apache.hadoop.hbase.util.TestMiniClusterLoadParallel): test timed out after
180000 milliseconds
  loadTest[1](org.apache.hadoop.hbase.util.TestMiniClusterLoadParallel): test timed out after
180000 milliseconds
  loadTest[0](org.apache.hadoop.hbase.util.TestMiniClusterLoadSequential): test timed out
after 180000 milliseconds
  loadTest[1](org.apache.hadoop.hbase.util.TestMiniClusterLoadSequential): test timed out
after 180000 milliseconds
  testSimpleZKCohortMemberController(org.apache.hadoop.hbase.procedure.TestZKProcedureControllers):
test timed out after 15000 milliseconds
  org.apache.hadoop.hbase.regionserver.TestRSKilledWhenMasterInitializing
  testExportScannerBatching(org.apache.hadoop.hbase.mapreduce.TestImportExport)
  testWithFilter(org.apache.hadoop.hbase.mapreduce.TestImportExport)

Tests run: 1407, Failures: 3, Errors: 8, Skipped: 13

[INFO]                                                                         
[INFO] ------------------------------------------------------------------------
[INFO] Skipping HBase
[INFO] This project has been banned from the build due to previous failures.
[INFO] ------------------------------------------------------------------------
[INFO] ------------------------------------------------------------------------
[INFO] Reactor Summary:
[INFO] 
[INFO] HBase ............................................. SUCCESS [11.883s]
[INFO] HBase - Common .................................... SUCCESS [33.454s]
[INFO] HBase - Protocol .................................. SUCCESS [23.862s]
[INFO] HBase - Client .................................... SUCCESS [11.508s]
[INFO] HBase - Prefix Tree ............................... SUCCESS [6.948s]
[INFO] HBase - Hadoop Compatibility ...................... SUCCESS [1.272s]
[INFO] HBase - Hadoop Two Compatibility .................. SUCCESS [6.508s]
[INFO] HBase - Server .................................... FAILURE [1:36:45.289s]
[INFO] HBase - Integration Tests ......................... SKIPPED
[INFO] HBase - Examples .................................. SKIPPED
[INFO] ------------------------------------------------------------------------
[INFO] BUILD FAILURE
[INFO] ------------------------------------------------------------------------
[INFO] Total time: 1:38:27.466s
[INFO] Finished at: Wed Mar 13 01:34:26 UTC 2013
[INFO] Final Memory: 105M/1099M
[INFO] ------------------------------------------------------------------------
[ERROR] Failed to execute goal org.apache.maven.plugins:maven-surefire-plugin:2.12-TRUNK-HBASE-2:test
(secondPartTestsExecution) on project hbase-server: Failure or timeout -> [Help 1]
org.apache.maven.lifecycle.LifecycleExecutionException: Failed to execute goal org.apache.maven.plugins:maven-surefire-plugin:2.12-TRUNK-HBASE-2:test
(secondPartTestsExecution) on project hbase-server: Failure or timeout
	at org.apache.maven.lifecycle.internal.MojoExecutor.execute(MojoExecutor.java:217)
	at org.apache.maven.lifecycle.internal.MojoExecutor.execute(MojoExecutor.java:153)
	at org.apache.maven.lifecycle.internal.MojoExecutor.execute(MojoExecutor.java:145)
	at org.apache.maven.lifecycle.internal.LifecycleModuleBuilder.buildProject(LifecycleModuleBuilder.java:84)
	at org.apache.maven.lifecycle.internal.LifecycleModuleBuilder.buildProject(LifecycleModuleBuilder.java:59)
	at org.apache.maven.lifecycle.internal.LifecycleStarter.singleThreadedBuild(LifecycleStarter.java:183)
	at org.apache.maven.lifecycle.internal.LifecycleStarter.execute(LifecycleStarter.java:161)
	at org.apache.maven.DefaultMaven.doExecute(DefaultMaven.java:320)
	at org.apache.maven.DefaultMaven.execute(DefaultMaven.java:156)
	at org.apache.maven.cli.MavenCli.execute(MavenCli.java:537)
	at org.apache.maven.cli.MavenCli.doMain(MavenCli.java:196)
	at org.apache.maven.cli.MavenCli.main(MavenCli.java:141)
	at sun.reflect.NativeMethodAccessorImpl.invoke0(Native Method)
	at sun.reflect.NativeMethodAccessorImpl.invoke(NativeMethodAccessorImpl.java:39)
	at sun.reflect.DelegatingMethodAccessorImpl.invoke(DelegatingMethodAccessorImpl.java:25)
	at java.lang.reflect.Method.invoke(Method.java:597)
	at org.codehaus.plexus.classworlds.launcher.Launcher.launchEnhanced(Launcher.java:290)
	at org.codehaus.plexus.classworlds.launcher.Launcher.launch(Launcher.java:230)
	at org.codehaus.plexus.classworlds.launcher.Launcher.mainWithExitCode(Launcher.java:409)
	at org.codehaus.plexus.classworlds.launcher.Launcher.main(Launcher.java:352)
Caused by: org.apache.maven.plugin.MojoExecutionException: Failure or timeout
	at org.apache.maven.plugin.surefire.SurefirePlugin.assertNoFailureOrTimeout(SurefirePlugin.java:643)
	at org.apache.maven.plugin.surefire.SurefirePlugin.handleSummary(SurefirePlugin.java:624)
	at org.apache.maven.plugin.surefire.AbstractSurefireMojo.executeAfterPreconditionsChecked(AbstractSurefireMojo.java:137)
	at org.apache.maven.plugin.surefire.AbstractSurefireMojo.execute(AbstractSurefireMojo.java:98)
	at org.apache.maven.plugin.DefaultBuildPluginManager.executeMojo(DefaultBuildPluginManager.java:101)
	at org.apache.maven.lifecycle.internal.MojoExecutor.execute(MojoExecutor.java:209)
	... 19 more
[ERROR] 
[ERROR] 
[ERROR] For more information about the errors and possible solutions, please read the following
articles:
[ERROR] [Help 1] http://cwiki.apache.org/confluence/display/MAVEN/MojoExecutionException
[ERROR] 
[ERROR] After correcting the problems, you can resume the build with the command
[ERROR]   mvn <goals> -rf :hbase-server
Build step 'Invoke top-level Maven targets' marked build as failure
Archiving artifacts
Recording test results
Updating HBASE-7797
Updating HBASE-8057
Updating HBASE-8054

Mime
View raw message