hbase-dev mailing list archives

Site index · List index
Message view « Date » · « Thread »
Top « Date » · « Thread »
From Apache Jenkins Server <jenk...@builds.apache.org>
Subject Build failed in Jenkins: HBase-TRUNK-on-Hadoop-2.0.0 #391
Date Tue, 05 Feb 2013 04:08:29 GMT
See <https://builds.apache.org/job/HBase-TRUNK-on-Hadoop-2.0.0/391/changes>

Changes:

[enis] HBASE-7748. Add DelimitedKeyPrefixRegionSplitPolicy

[stack] HBASE-7760 tiny issue in ChaosMonkey - kills meta server instead of root

[stack] HBASE-7758 Update book to include documentation of CellCounter utility

------------------------------------------
[...truncated 18858 lines...]
Forking command line: /bin/sh -c cd <https://builds.apache.org/job/HBase-TRUNK-on-Hadoop-2.0.0/ws/trunk/hbase-server>
&& /home/jenkins/tools/java/jdk1.6.0_27-32/jre/bin/java -enableassertions -Xmx1900m
-Djava.security.egd=file:/dev/./urandom -Djava.net.preferIPv4Stack=true -jar <https://builds.apache.org/job/HBase-TRUNK-on-Hadoop-2.0.0/ws/trunk/hbase-server/target/surefire/surefirebooter4891102561468629557.jar>
<https://builds.apache.org/job/HBase-TRUNK-on-Hadoop-2.0.0/ws/trunk/hbase-server/target/surefire/surefire6284223576517801728tmp>
<https://builds.apache.org/job/HBase-TRUNK-on-Hadoop-2.0.0/ws/trunk/hbase-server/target/surefire/surefire_1757524119582849193921tmp>
Running org.apache.hadoop.hbase.regionserver.handler.TestOpenRegionHandler
Tests run: 3, Failures: 0, Errors: 0, Skipped: 0, Time elapsed: 9.788 sec
Forking command line: /bin/sh -c cd <https://builds.apache.org/job/HBase-TRUNK-on-Hadoop-2.0.0/ws/trunk/hbase-server>
&& /home/jenkins/tools/java/jdk1.6.0_27-32/jre/bin/java -enableassertions -Xmx1900m
-Djava.security.egd=file:/dev/./urandom -Djava.net.preferIPv4Stack=true -jar <https://builds.apache.org/job/HBase-TRUNK-on-Hadoop-2.0.0/ws/trunk/hbase-server/target/surefire/surefirebooter4884315737822972474.jar>
<https://builds.apache.org/job/HBase-TRUNK-on-Hadoop-2.0.0/ws/trunk/hbase-server/target/surefire/surefire5111600066647218738tmp>
<https://builds.apache.org/job/HBase-TRUNK-on-Hadoop-2.0.0/ws/trunk/hbase-server/target/surefire/surefire_1761202340392213967745tmp>
Running org.apache.hadoop.hbase.regionserver.handler.TestCloseRegionHandler
Tests run: 3, Failures: 0, Errors: 0, Skipped: 0, Time elapsed: 11.448 sec
Forking command line: /bin/sh -c cd <https://builds.apache.org/job/HBase-TRUNK-on-Hadoop-2.0.0/ws/trunk/hbase-server>
&& /home/jenkins/tools/java/jdk1.6.0_27-32/jre/bin/java -enableassertions -Xmx1900m
-Djava.security.egd=file:/dev/./urandom -Djava.net.preferIPv4Stack=true -jar <https://builds.apache.org/job/HBase-TRUNK-on-Hadoop-2.0.0/ws/trunk/hbase-server/target/surefire/surefirebooter6427402098242853973.jar>
<https://builds.apache.org/job/HBase-TRUNK-on-Hadoop-2.0.0/ws/trunk/hbase-server/target/surefire/surefire8950073493980123402tmp>
<https://builds.apache.org/job/HBase-TRUNK-on-Hadoop-2.0.0/ws/trunk/hbase-server/target/surefire/surefire_1774471651800921710670tmp>
Running org.apache.hadoop.hbase.regionserver.TestSeekOptimizations
Tests run: 6, Failures: 0, Errors: 0, Skipped: 0, Time elapsed: 20.98 sec
Forking command line: /bin/sh -c cd <https://builds.apache.org/job/HBase-TRUNK-on-Hadoop-2.0.0/ws/trunk/hbase-server>
&& /home/jenkins/tools/java/jdk1.6.0_27-32/jre/bin/java -enableassertions -Xmx1900m
-Djava.security.egd=file:/dev/./urandom -Djava.net.preferIPv4Stack=true -jar <https://builds.apache.org/job/HBase-TRUNK-on-Hadoop-2.0.0/ws/trunk/hbase-server/target/surefire/surefirebooter1231492613105829312.jar>
<https://builds.apache.org/job/HBase-TRUNK-on-Hadoop-2.0.0/ws/trunk/hbase-server/target/surefire/surefire7841492108226698212tmp>
<https://builds.apache.org/job/HBase-TRUNK-on-Hadoop-2.0.0/ws/trunk/hbase-server/target/surefire/surefire_1788450380568130961952tmp>
Running org.apache.hadoop.hbase.regionserver.TestGetClosestAtOrBefore
Tests run: 3, Failures: 0, Errors: 0, Skipped: 0, Time elapsed: 8.822 sec
Forking command line: /bin/sh -c cd <https://builds.apache.org/job/HBase-TRUNK-on-Hadoop-2.0.0/ws/trunk/hbase-server>
&& /home/jenkins/tools/java/jdk1.6.0_27-32/jre/bin/java -enableassertions -Xmx1900m
-Djava.security.egd=file:/dev/./urandom -Djava.net.preferIPv4Stack=true -jar <https://builds.apache.org/job/HBase-TRUNK-on-Hadoop-2.0.0/ws/trunk/hbase-server/target/surefire/surefirebooter5411588071081721863.jar>
<https://builds.apache.org/job/HBase-TRUNK-on-Hadoop-2.0.0/ws/trunk/hbase-server/target/surefire/surefire3838767663712922293tmp>
<https://builds.apache.org/job/HBase-TRUNK-on-Hadoop-2.0.0/ws/trunk/hbase-server/target/surefire/surefire_1795219748029677794247tmp>
Running org.apache.hadoop.hbase.regionserver.TestCompactionState
Tests run: 5, Failures: 0, Errors: 0, Skipped: 0, Time elapsed: 145.571 sec
Forking command line: /bin/sh -c cd <https://builds.apache.org/job/HBase-TRUNK-on-Hadoop-2.0.0/ws/trunk/hbase-server>
&& /home/jenkins/tools/java/jdk1.6.0_27-32/jre/bin/java -enableassertions -Xmx1900m
-Djava.security.egd=file:/dev/./urandom -Djava.net.preferIPv4Stack=true -jar <https://builds.apache.org/job/HBase-TRUNK-on-Hadoop-2.0.0/ws/trunk/hbase-server/target/surefire/surefirebooter7497059586273944093.jar>
<https://builds.apache.org/job/HBase-TRUNK-on-Hadoop-2.0.0/ws/trunk/hbase-server/target/surefire/surefire7986935917661627830tmp>
<https://builds.apache.org/job/HBase-TRUNK-on-Hadoop-2.0.0/ws/trunk/hbase-server/target/surefire/surefire_1802347042818767367514tmp>
Running org.apache.hadoop.hbase.regionserver.TestParallelPut
Tests run: 2, Failures: 0, Errors: 0, Skipped: 0, Time elapsed: 32.816 sec
Forking command line: /bin/sh -c cd <https://builds.apache.org/job/HBase-TRUNK-on-Hadoop-2.0.0/ws/trunk/hbase-server>
&& /home/jenkins/tools/java/jdk1.6.0_27-32/jre/bin/java -enableassertions -Xmx1900m
-Djava.security.egd=file:/dev/./urandom -Djava.net.preferIPv4Stack=true -jar <https://builds.apache.org/job/HBase-TRUNK-on-Hadoop-2.0.0/ws/trunk/hbase-server/target/surefire/surefirebooter6382443456132932476.jar>
<https://builds.apache.org/job/HBase-TRUNK-on-Hadoop-2.0.0/ws/trunk/hbase-server/target/surefire/surefire2965279270592535973tmp>
<https://builds.apache.org/job/HBase-TRUNK-on-Hadoop-2.0.0/ws/trunk/hbase-server/target/surefire/surefire_1813526716775742568026tmp>
Running org.apache.hadoop.hbase.regionserver.TestCacheOnWriteInSchema
Tests run: 3, Failures: 0, Errors: 0, Skipped: 0, Time elapsed: 23.505 sec
Forking command line: /bin/sh -c cd <https://builds.apache.org/job/HBase-TRUNK-on-Hadoop-2.0.0/ws/trunk/hbase-server>
&& /home/jenkins/tools/java/jdk1.6.0_27-32/jre/bin/java -enableassertions -Xmx1900m
-Djava.security.egd=file:/dev/./urandom -Djava.net.preferIPv4Stack=true -jar <https://builds.apache.org/job/HBase-TRUNK-on-Hadoop-2.0.0/ws/trunk/hbase-server/target/surefire/surefirebooter4930942501017109691.jar>
<https://builds.apache.org/job/HBase-TRUNK-on-Hadoop-2.0.0/ws/trunk/hbase-server/target/surefire/surefire8151269842728931760tmp>
<https://builds.apache.org/job/HBase-TRUNK-on-Hadoop-2.0.0/ws/trunk/hbase-server/target/surefire/surefire_1827528554086624316146tmp>
Running org.apache.hadoop.hbase.regionserver.TestPriorityRpc
Tests run: 3, Failures: 0, Errors: 0, Skipped: 0, Time elapsed: 13.044 sec
Forking command line: /bin/sh -c cd <https://builds.apache.org/job/HBase-TRUNK-on-Hadoop-2.0.0/ws/trunk/hbase-server>
&& /home/jenkins/tools/java/jdk1.6.0_27-32/jre/bin/java -enableassertions -Xmx1900m
-Djava.security.egd=file:/dev/./urandom -Djava.net.preferIPv4Stack=true -jar <https://builds.apache.org/job/HBase-TRUNK-on-Hadoop-2.0.0/ws/trunk/hbase-server/target/surefire/surefirebooter8546492252532843943.jar>
<https://builds.apache.org/job/HBase-TRUNK-on-Hadoop-2.0.0/ws/trunk/hbase-server/target/surefire/surefire1981083293160187295tmp>
<https://builds.apache.org/job/HBase-TRUNK-on-Hadoop-2.0.0/ws/trunk/hbase-server/target/surefire/surefire_1833870208471142037346tmp>
Running org.apache.hadoop.hbase.regionserver.TestHRegionServerBulkLoad
Tests run: 1, Failures: 0, Errors: 0, Skipped: 0, Time elapsed: 93.171 sec
Forking command line: /bin/sh -c cd <https://builds.apache.org/job/HBase-TRUNK-on-Hadoop-2.0.0/ws/trunk/hbase-server>
&& /home/jenkins/tools/java/jdk1.6.0_27-32/jre/bin/java -enableassertions -Xmx1900m
-Djava.security.egd=file:/dev/./urandom -Djava.net.preferIPv4Stack=true -jar <https://builds.apache.org/job/HBase-TRUNK-on-Hadoop-2.0.0/ws/trunk/hbase-server/target/surefire/surefirebooter7977458140400330312.jar>
<https://builds.apache.org/job/HBase-TRUNK-on-Hadoop-2.0.0/ws/trunk/hbase-server/target/surefire/surefire7275611163182279617tmp>
<https://builds.apache.org/job/HBase-TRUNK-on-Hadoop-2.0.0/ws/trunk/hbase-server/target/surefire/surefire_1846530787405891568188tmp>
Running org.apache.hadoop.hbase.regionserver.wal.TestHLog
Tests run: 11, Failures: 0, Errors: 0, Skipped: 0, Time elapsed: 75.695 sec
Forking command line: /bin/sh -c cd <https://builds.apache.org/job/HBase-TRUNK-on-Hadoop-2.0.0/ws/trunk/hbase-server>
&& /home/jenkins/tools/java/jdk1.6.0_27-32/jre/bin/java -enableassertions -Xmx1900m
-Djava.security.egd=file:/dev/./urandom -Djava.net.preferIPv4Stack=true -jar <https://builds.apache.org/job/HBase-TRUNK-on-Hadoop-2.0.0/ws/trunk/hbase-server/target/surefire/surefirebooter6194452516443084995.jar>
<https://builds.apache.org/job/HBase-TRUNK-on-Hadoop-2.0.0/ws/trunk/hbase-server/target/surefire/surefire4313991408362160971tmp>
<https://builds.apache.org/job/HBase-TRUNK-on-Hadoop-2.0.0/ws/trunk/hbase-server/target/surefire/surefire_1857248887172790058761tmp>
Running org.apache.hadoop.hbase.regionserver.TestSplitTransactionOnCluster
Tests run: 10, Failures: 0, Errors: 0, Skipped: 0, Time elapsed: 198.553 sec
Forking command line: /bin/sh -c cd <https://builds.apache.org/job/HBase-TRUNK-on-Hadoop-2.0.0/ws/trunk/hbase-server>
&& /home/jenkins/tools/java/jdk1.6.0_27-32/jre/bin/java -enableassertions -Xmx1900m
-Djava.security.egd=file:/dev/./urandom -Djava.net.preferIPv4Stack=true -jar <https://builds.apache.org/job/HBase-TRUNK-on-Hadoop-2.0.0/ws/trunk/hbase-server/target/surefire/surefirebooter9106131093130141952.jar>
<https://builds.apache.org/job/HBase-TRUNK-on-Hadoop-2.0.0/ws/trunk/hbase-server/target/surefire/surefire1796764738709431687tmp>
<https://builds.apache.org/job/HBase-TRUNK-on-Hadoop-2.0.0/ws/trunk/hbase-server/target/surefire/surefire_1865780790870492539603tmp>
Running org.apache.hadoop.hbase.regionserver.TestJoinedScanners
Tests run: 1, Failures: 0, Errors: 1, Skipped: 0, Time elapsed: 362.804 sec <<< FAILURE!
Forking command line: /bin/sh -c cd <https://builds.apache.org/job/HBase-TRUNK-on-Hadoop-2.0.0/ws/trunk/hbase-server>
&& /home/jenkins/tools/java/jdk1.6.0_27-32/jre/bin/java -enableassertions -Xmx1900m
-Djava.security.egd=file:/dev/./urandom -Djava.net.preferIPv4Stack=true -jar <https://builds.apache.org/job/HBase-TRUNK-on-Hadoop-2.0.0/ws/trunk/hbase-server/target/surefire/surefirebooter1226198704376357443.jar>
<https://builds.apache.org/job/HBase-TRUNK-on-Hadoop-2.0.0/ws/trunk/hbase-server/target/surefire/surefire8195701976025255244tmp>
<https://builds.apache.org/job/HBase-TRUNK-on-Hadoop-2.0.0/ws/trunk/hbase-server/target/surefire/surefire_1878212929544054266684tmp>
Running org.apache.hadoop.hbase.regionserver.wal.TestHLogSplit
Tests run: 32, Failures: 0, Errors: 0, Skipped: 1, Time elapsed: 298.042 sec
Forking command line: /bin/sh -c cd <https://builds.apache.org/job/HBase-TRUNK-on-Hadoop-2.0.0/ws/trunk/hbase-server>
&& /home/jenkins/tools/java/jdk1.6.0_27-32/jre/bin/java -enableassertions -Xmx1900m
-Djava.security.egd=file:/dev/./urandom -Djava.net.preferIPv4Stack=true -jar <https://builds.apache.org/job/HBase-TRUNK-on-Hadoop-2.0.0/ws/trunk/hbase-server/target/surefire/surefirebooter7985984141074410503.jar>
<https://builds.apache.org/job/HBase-TRUNK-on-Hadoop-2.0.0/ws/trunk/hbase-server/target/surefire/surefire7737817303208971895tmp>
<https://builds.apache.org/job/HBase-TRUNK-on-Hadoop-2.0.0/ws/trunk/hbase-server/target/surefire/surefire_188567885080358862250tmp>
Running org.apache.hadoop.hbase.regionserver.wal.TestHLogSplitCompressed
Tests run: 32, Failures: 0, Errors: 0, Skipped: 1, Time elapsed: 316.842 sec
Forking command line: /bin/sh -c cd <https://builds.apache.org/job/HBase-TRUNK-on-Hadoop-2.0.0/ws/trunk/hbase-server>
&& /home/jenkins/tools/java/jdk1.6.0_27-32/jre/bin/java -enableassertions -Xmx1900m
-Djava.security.egd=file:/dev/./urandom -Djava.net.preferIPv4Stack=true -jar <https://builds.apache.org/job/HBase-TRUNK-on-Hadoop-2.0.0/ws/trunk/hbase-server/target/surefire/surefirebooter5051297721346095402.jar>
<https://builds.apache.org/job/HBase-TRUNK-on-Hadoop-2.0.0/ws/trunk/hbase-server/target/surefire/surefire8912748922624309400tmp>
<https://builds.apache.org/job/HBase-TRUNK-on-Hadoop-2.0.0/ws/trunk/hbase-server/target/surefire/surefire_1891751226603042957948tmp>
Running org.apache.hadoop.hbase.regionserver.wal.TestLogRollAbort
Tests run: 1, Failures: 0, Errors: 0, Skipped: 0, Time elapsed: 463.122 sec
Forking command line: /bin/sh -c cd <https://builds.apache.org/job/HBase-TRUNK-on-Hadoop-2.0.0/ws/trunk/hbase-server>
&& /home/jenkins/tools/java/jdk1.6.0_27-32/jre/bin/java -enableassertions -Xmx1900m
-Djava.security.egd=file:/dev/./urandom -Djava.net.preferIPv4Stack=true -jar <https://builds.apache.org/job/HBase-TRUNK-on-Hadoop-2.0.0/ws/trunk/hbase-server/target/surefire/surefirebooter7959997614303737280.jar>
<https://builds.apache.org/job/HBase-TRUNK-on-Hadoop-2.0.0/ws/trunk/hbase-server/target/surefire/surefire2176459142617655390tmp>
<https://builds.apache.org/job/HBase-TRUNK-on-Hadoop-2.0.0/ws/trunk/hbase-server/target/surefire/surefire_1904227519301121888110tmp>
Running org.apache.hadoop.hbase.regionserver.TestStoreScanner
Tests run: 16, Failures: 0, Errors: 0, Skipped: 0, Time elapsed: 0.714 sec
Forking command line: /bin/sh -c cd <https://builds.apache.org/job/HBase-TRUNK-on-Hadoop-2.0.0/ws/trunk/hbase-server>
&& /home/jenkins/tools/java/jdk1.6.0_27-32/jre/bin/java -enableassertions -Xmx1900m
-Djava.security.egd=file:/dev/./urandom -Djava.net.preferIPv4Stack=true -jar <https://builds.apache.org/job/HBase-TRUNK-on-Hadoop-2.0.0/ws/trunk/hbase-server/target/surefire/surefirebooter7784148171108670814.jar>
<https://builds.apache.org/job/HBase-TRUNK-on-Hadoop-2.0.0/ws/trunk/hbase-server/target/surefire/surefire4046075669570150279tmp>
<https://builds.apache.org/job/HBase-TRUNK-on-Hadoop-2.0.0/ws/trunk/hbase-server/target/surefire/surefire_1916604440935637323171tmp>
Running org.apache.hadoop.hbase.regionserver.wal.TestHLogFiltering
Tests run: 1, Failures: 0, Errors: 0, Skipped: 0, Time elapsed: 86.472 sec
Forking command line: /bin/sh -c cd <https://builds.apache.org/job/HBase-TRUNK-on-Hadoop-2.0.0/ws/trunk/hbase-server>
&& /home/jenkins/tools/java/jdk1.6.0_27-32/jre/bin/java -enableassertions -Xmx1900m
-Djava.security.egd=file:/dev/./urandom -Djava.net.preferIPv4Stack=true -jar <https://builds.apache.org/job/HBase-TRUNK-on-Hadoop-2.0.0/ws/trunk/hbase-server/target/surefire/surefirebooter897325009311325800.jar>
<https://builds.apache.org/job/HBase-TRUNK-on-Hadoop-2.0.0/ws/trunk/hbase-server/target/surefire/surefire4268535818512667203tmp>
<https://builds.apache.org/job/HBase-TRUNK-on-Hadoop-2.0.0/ws/trunk/hbase-server/target/surefire/surefire_1921399265751642167816tmp>
Running org.apache.hadoop.hbase.regionserver.TestEndToEndSplitTransaction
Tests run: 2, Failures: 0, Errors: 0, Skipped: 0, Time elapsed: 91.555 sec
Forking command line: /bin/sh -c cd <https://builds.apache.org/job/HBase-TRUNK-on-Hadoop-2.0.0/ws/trunk/hbase-server>
&& /home/jenkins/tools/java/jdk1.6.0_27-32/jre/bin/java -enableassertions -Xmx1900m
-Djava.security.egd=file:/dev/./urandom -Djava.net.preferIPv4Stack=true -jar <https://builds.apache.org/job/HBase-TRUNK-on-Hadoop-2.0.0/ws/trunk/hbase-server/target/surefire/surefirebooter115208682388525855.jar>
<https://builds.apache.org/job/HBase-TRUNK-on-Hadoop-2.0.0/ws/trunk/hbase-server/target/surefire/surefire7655031189416290482tmp>
<https://builds.apache.org/job/HBase-TRUNK-on-Hadoop-2.0.0/ws/trunk/hbase-server/target/surefire/surefire_1934384721314995437962tmp>
Running org.apache.hadoop.hbase.regionserver.wal.TestWALReplay
Tests run: 7, Failures: 0, Errors: 0, Skipped: 0, Time elapsed: 302.399 sec
Forking command line: /bin/sh -c cd <https://builds.apache.org/job/HBase-TRUNK-on-Hadoop-2.0.0/ws/trunk/hbase-server>
&& /home/jenkins/tools/java/jdk1.6.0_27-32/jre/bin/java -enableassertions -Xmx1900m
-Djava.security.egd=file:/dev/./urandom -Djava.net.preferIPv4Stack=true -jar <https://builds.apache.org/job/HBase-TRUNK-on-Hadoop-2.0.0/ws/trunk/hbase-server/target/surefire/surefirebooter6595419496627744980.jar>
<https://builds.apache.org/job/HBase-TRUNK-on-Hadoop-2.0.0/ws/trunk/hbase-server/target/surefire/surefire4487688777543052249tmp>
<https://builds.apache.org/job/HBase-TRUNK-on-Hadoop-2.0.0/ws/trunk/hbase-server/target/surefire/surefire_194413808223652787922tmp>
Running org.apache.hadoop.hbase.regionserver.wal.TestWALReplayCompressed
Tests run: 7, Failures: 0, Errors: 0, Skipped: 0, Time elapsed: 208.525 sec
Forking command line: /bin/sh -c cd <https://builds.apache.org/job/HBase-TRUNK-on-Hadoop-2.0.0/ws/trunk/hbase-server>
&& /home/jenkins/tools/java/jdk1.6.0_27-32/jre/bin/java -enableassertions -Xmx1900m
-Djava.security.egd=file:/dev/./urandom -Djava.net.preferIPv4Stack=true -jar <https://builds.apache.org/job/HBase-TRUNK-on-Hadoop-2.0.0/ws/trunk/hbase-server/target/surefire/surefirebooter6902464731987306439.jar>
<https://builds.apache.org/job/HBase-TRUNK-on-Hadoop-2.0.0/ws/trunk/hbase-server/target/surefire/surefire7740522445830781162tmp>
<https://builds.apache.org/job/HBase-TRUNK-on-Hadoop-2.0.0/ws/trunk/hbase-server/target/surefire/surefire_1951409203914371494335tmp>
Running org.apache.hadoop.hbase.regionserver.TestCompaction
Tests run: 15, Failures: 0, Errors: 0, Skipped: 0, Time elapsed: 111.149 sec
Forking command line: /bin/sh -c cd <https://builds.apache.org/job/HBase-TRUNK-on-Hadoop-2.0.0/ws/trunk/hbase-server>
&& /home/jenkins/tools/java/jdk1.6.0_27-32/jre/bin/java -enableassertions -Xmx1900m
-Djava.security.egd=file:/dev/./urandom -Djava.net.preferIPv4Stack=true -jar <https://builds.apache.org/job/HBase-TRUNK-on-Hadoop-2.0.0/ws/trunk/hbase-server/target/surefire/surefirebooter5658523784389366670.jar>
<https://builds.apache.org/job/HBase-TRUNK-on-Hadoop-2.0.0/ws/trunk/hbase-server/target/surefire/surefire896374954467527566tmp>
<https://builds.apache.org/job/HBase-TRUNK-on-Hadoop-2.0.0/ws/trunk/hbase-server/target/surefire/surefire_1968125869008328918589tmp>
Running org.apache.hadoop.hbase.mapred.TestTableInputFormat
Tests run: 10, Failures: 0, Errors: 0, Skipped: 0, Time elapsed: 60.272 sec
Forking command line: /bin/sh -c cd <https://builds.apache.org/job/HBase-TRUNK-on-Hadoop-2.0.0/ws/trunk/hbase-server>
&& /home/jenkins/tools/java/jdk1.6.0_27-32/jre/bin/java -enableassertions -Xmx1900m
-Djava.security.egd=file:/dev/./urandom -Djava.net.preferIPv4Stack=true -jar <https://builds.apache.org/job/HBase-TRUNK-on-Hadoop-2.0.0/ws/trunk/hbase-server/target/surefire/surefirebooter5341579562335046904.jar>
<https://builds.apache.org/job/HBase-TRUNK-on-Hadoop-2.0.0/ws/trunk/hbase-server/target/surefire/surefire58913916941504655tmp>
<https://builds.apache.org/job/HBase-TRUNK-on-Hadoop-2.0.0/ws/trunk/hbase-server/target/surefire/surefire_1976244267460610493463tmp>
Running org.apache.hadoop.hbase.regionserver.TestMultiColumnScanner
Tests run: 12, Failures: 0, Errors: 0, Skipped: 0, Time elapsed: 171.857 sec
Forking command line: /bin/sh -c cd <https://builds.apache.org/job/HBase-TRUNK-on-Hadoop-2.0.0/ws/trunk/hbase-server>
&& /home/jenkins/tools/java/jdk1.6.0_27-32/jre/bin/java -enableassertions -Xmx1900m
-Djava.security.egd=file:/dev/./urandom -Djava.net.preferIPv4Stack=true -jar <https://builds.apache.org/job/HBase-TRUNK-on-Hadoop-2.0.0/ws/trunk/hbase-server/target/surefire/surefirebooter7492377321597851306.jar>
<https://builds.apache.org/job/HBase-TRUNK-on-Hadoop-2.0.0/ws/trunk/hbase-server/target/surefire/surefire2669716750173328826tmp>
<https://builds.apache.org/job/HBase-TRUNK-on-Hadoop-2.0.0/ws/trunk/hbase-server/target/surefire/surefire_1988050610482627588100tmp>
Running org.apache.hadoop.hbase.fs.TestBlockReorder
Tests run: 3, Failures: 0, Errors: 0, Skipped: 0, Time elapsed: 73.879 sec
Forking command line: /bin/sh -c cd <https://builds.apache.org/job/HBase-TRUNK-on-Hadoop-2.0.0/ws/trunk/hbase-server>
&& /home/jenkins/tools/java/jdk1.6.0_27-32/jre/bin/java -enableassertions -Xmx1900m
-Djava.security.egd=file:/dev/./urandom -Djava.net.preferIPv4Stack=true -jar <https://builds.apache.org/job/HBase-TRUNK-on-Hadoop-2.0.0/ws/trunk/hbase-server/target/surefire/surefirebooter4071170887879049946.jar>
<https://builds.apache.org/job/HBase-TRUNK-on-Hadoop-2.0.0/ws/trunk/hbase-server/target/surefire/surefire4242646313187230333tmp>
<https://builds.apache.org/job/HBase-TRUNK-on-Hadoop-2.0.0/ws/trunk/hbase-server/target/surefire/surefire_1992959528637769203438tmp>
Running org.apache.hadoop.hbase.mapred.TestTableMapReduce
Tests run: 1, Failures: 0, Errors: 0, Skipped: 0, Time elapsed: 171.947 sec
Forking command line: /bin/sh -c cd <https://builds.apache.org/job/HBase-TRUNK-on-Hadoop-2.0.0/ws/trunk/hbase-server>
&& /home/jenkins/tools/java/jdk1.6.0_27-32/jre/bin/java -enableassertions -Xmx1900m
-Djava.security.egd=file:/dev/./urandom -Djava.net.preferIPv4Stack=true -jar <https://builds.apache.org/job/HBase-TRUNK-on-Hadoop-2.0.0/ws/trunk/hbase-server/target/surefire/surefirebooter8682909420111216280.jar>
<https://builds.apache.org/job/HBase-TRUNK-on-Hadoop-2.0.0/ws/trunk/hbase-server/target/surefire/surefire8406260112810747769tmp>
<https://builds.apache.org/job/HBase-TRUNK-on-Hadoop-2.0.0/ws/trunk/hbase-server/target/surefire/surefire_2006622660296416788006tmp>
Running org.apache.hadoop.hbase.backup.example.TestZooKeeperTableArchiveClient
Tests run: 3, Failures: 0, Errors: 0, Skipped: 0, Time elapsed: 15.899 sec
Forking command line: /bin/sh -c cd <https://builds.apache.org/job/HBase-TRUNK-on-Hadoop-2.0.0/ws/trunk/hbase-server>
&& /home/jenkins/tools/java/jdk1.6.0_27-32/jre/bin/java -enableassertions -Xmx1900m
-Djava.security.egd=file:/dev/./urandom -Djava.net.preferIPv4Stack=true -jar <https://builds.apache.org/job/HBase-TRUNK-on-Hadoop-2.0.0/ws/trunk/hbase-server/target/surefire/surefirebooter5924063482178934504.jar>
<https://builds.apache.org/job/HBase-TRUNK-on-Hadoop-2.0.0/ws/trunk/hbase-server/target/surefire/surefire8216334565031702571tmp>
<https://builds.apache.org/job/HBase-TRUNK-on-Hadoop-2.0.0/ws/trunk/hbase-server/target/surefire/surefire_2016025563521888859238tmp>
Running org.apache.hadoop.hbase.TestClusterBootOrder
Tests run: 2, Failures: 0, Errors: 0, Skipped: 0, Time elapsed: 72.513 sec
Forking command line: /bin/sh -c cd <https://builds.apache.org/job/HBase-TRUNK-on-Hadoop-2.0.0/ws/trunk/hbase-server>
&& /home/jenkins/tools/java/jdk1.6.0_27-32/jre/bin/java -enableassertions -Xmx1900m
-Djava.security.egd=file:/dev/./urandom -Djava.net.preferIPv4Stack=true -jar <https://builds.apache.org/job/HBase-TRUNK-on-Hadoop-2.0.0/ws/trunk/hbase-server/target/surefire/surefirebooter9169393312214582825.jar>
<https://builds.apache.org/job/HBase-TRUNK-on-Hadoop-2.0.0/ws/trunk/hbase-server/target/surefire/surefire5414173266715806193tmp>
<https://builds.apache.org/job/HBase-TRUNK-on-Hadoop-2.0.0/ws/trunk/hbase-server/target/surefire/surefire_2021552899537021858271tmp>
Running org.apache.hadoop.hbase.TestDrainingServer
Tests run: 2, Failures: 0, Errors: 0, Skipped: 0, Time elapsed: 73.842 sec
Forking command line: /bin/sh -c cd <https://builds.apache.org/job/HBase-TRUNK-on-Hadoop-2.0.0/ws/trunk/hbase-server>
&& /home/jenkins/tools/java/jdk1.6.0_27-32/jre/bin/java -enableassertions -Xmx1900m
-Djava.security.egd=file:/dev/./urandom -Djava.net.preferIPv4Stack=true -jar <https://builds.apache.org/job/HBase-TRUNK-on-Hadoop-2.0.0/ws/trunk/hbase-server/target/surefire/surefirebooter1919439431031569975.jar>
<https://builds.apache.org/job/HBase-TRUNK-on-Hadoop-2.0.0/ws/trunk/hbase-server/target/surefire/surefire7770866058094959623tmp>
<https://builds.apache.org/job/HBase-TRUNK-on-Hadoop-2.0.0/ws/trunk/hbase-server/target/surefire/surefire_2033674280417745485851tmp>
Running org.apache.hadoop.hbase.backup.TestHFileArchiving
Tests run: 5, Failures: 0, Errors: 0, Skipped: 0, Time elapsed: 212.19 sec
Forking command line: /bin/sh -c cd <https://builds.apache.org/job/HBase-TRUNK-on-Hadoop-2.0.0/ws/trunk/hbase-server>
&& /home/jenkins/tools/java/jdk1.6.0_27-32/jre/bin/java -enableassertions -Xmx1900m
-Djava.security.egd=file:/dev/./urandom -Djava.net.preferIPv4Stack=true -jar <https://builds.apache.org/job/HBase-TRUNK-on-Hadoop-2.0.0/ws/trunk/hbase-server/target/surefire/surefirebooter1383426931171579888.jar>
<https://builds.apache.org/job/HBase-TRUNK-on-Hadoop-2.0.0/ws/trunk/hbase-server/target/surefire/surefire6507730131686232811tmp>
<https://builds.apache.org/job/HBase-TRUNK-on-Hadoop-2.0.0/ws/trunk/hbase-server/target/surefire/surefire_2042983117158879221427tmp>
Running org.apache.hadoop.hbase.mapreduce.TestTimeRangeMapRed
Tests run: 1, Failures: 0, Errors: 0, Skipped: 0, Time elapsed: 93.482 sec
Forking command line: /bin/sh -c cd <https://builds.apache.org/job/HBase-TRUNK-on-Hadoop-2.0.0/ws/trunk/hbase-server>
&& /home/jenkins/tools/java/jdk1.6.0_27-32/jre/bin/java -enableassertions -Xmx1900m
-Djava.security.egd=file:/dev/./urandom -Djava.net.preferIPv4Stack=true -jar <https://builds.apache.org/job/HBase-TRUNK-on-Hadoop-2.0.0/ws/trunk/hbase-server/target/surefire/surefirebooter6051787847671386166.jar>
<https://builds.apache.org/job/HBase-TRUNK-on-Hadoop-2.0.0/ws/trunk/hbase-server/target/surefire/surefire7033042613149980024tmp>
<https://builds.apache.org/job/HBase-TRUNK-on-Hadoop-2.0.0/ws/trunk/hbase-server/target/surefire/surefire_2053999455437988020983tmp>
Forking command line: /bin/sh -c cd <https://builds.apache.org/job/HBase-TRUNK-on-Hadoop-2.0.0/ws/trunk/hbase-server>
&& /home/jenkins/tools/java/jdk1.6.0_27-32/jre/bin/java -enableassertions -Xmx1900m
-Djava.security.egd=file:/dev/./urandom -Djava.net.preferIPv4Stack=true -jar <https://builds.apache.org/job/HBase-TRUNK-on-Hadoop-2.0.0/ws/trunk/hbase-server/target/surefire/surefirebooter4625406339685558090.jar>
<https://builds.apache.org/job/HBase-TRUNK-on-Hadoop-2.0.0/ws/trunk/hbase-server/target/surefire/surefire747830357446840813tmp>
<https://builds.apache.org/job/HBase-TRUNK-on-Hadoop-2.0.0/ws/trunk/hbase-server/target/surefire/surefire_2061141953972666812407tmp>
Running org.apache.hadoop.hbase.mapreduce.TestRowCounter
Tests run: 3, Failures: 1, Errors: 0, Skipped: 0, Time elapsed: 186.829 sec <<< FAILURE!
Forking command line: /bin/sh -c cd <https://builds.apache.org/job/HBase-TRUNK-on-Hadoop-2.0.0/ws/trunk/hbase-server>
&& /home/jenkins/tools/java/jdk1.6.0_27-32/jre/bin/java -enableassertions -Xmx1900m
-Djava.security.egd=file:/dev/./urandom -Djava.net.preferIPv4Stack=true -jar <https://builds.apache.org/job/HBase-TRUNK-on-Hadoop-2.0.0/ws/trunk/hbase-server/target/surefire/surefirebooter1509854693265722004.jar>
<https://builds.apache.org/job/HBase-TRUNK-on-Hadoop-2.0.0/ws/trunk/hbase-server/target/surefire/surefire6899581222496976488tmp>
<https://builds.apache.org/job/HBase-TRUNK-on-Hadoop-2.0.0/ws/trunk/hbase-server/target/surefire/surefire_2073400565792986013363tmp>
org.apache.maven.surefire.booter.SurefireBooterForkException: Error occurred in starting fork,
check output in log
	at org.apache.maven.plugin.surefire.booterclient.ForkStarter.fork(ForkStarter.java:238)
	at org.apache.maven.plugin.surefire.booterclient.ForkStarter.access$000(ForkStarter.java:64)
	at org.apache.maven.plugin.surefire.booterclient.ForkStarter$ParallelFork.call(ForkStarter.java:303)
	at org.apache.maven.plugin.surefire.booterclient.ForkStarter$ParallelFork.call(ForkStarter.java:285)
	at java.util.concurrent.FutureTask$Sync.innerRun(FutureTask.java:303)
	at java.util.concurrent.FutureTask.run(FutureTask.java:138)
	at java.util.concurrent.ThreadPoolExecutor$Worker.runTask(ThreadPoolExecutor.java:886)
	at java.util.concurrent.ThreadPoolExecutor$Worker.run(ThreadPoolExecutor.java:908)
	at java.lang.Thread.run(Thread.java:662)
No results for java.util.concurrent.FutureTask@16e6125
Forking command line: /bin/sh -c cd <https://builds.apache.org/job/HBase-TRUNK-on-Hadoop-2.0.0/ws/trunk/hbase-server>
&& /home/jenkins/tools/java/jdk1.6.0_27-32/jre/bin/java -enableassertions -Xmx1900m
-Djava.security.egd=file:/dev/./urandom -Djava.net.preferIPv4Stack=true -jar <https://builds.apache.org/job/HBase-TRUNK-on-Hadoop-2.0.0/ws/trunk/hbase-server/target/surefire/surefirebooter6419218963452661100.jar>
<https://builds.apache.org/job/HBase-TRUNK-on-Hadoop-2.0.0/ws/trunk/hbase-server/target/surefire/surefire2030488502088522742tmp>
<https://builds.apache.org/job/HBase-TRUNK-on-Hadoop-2.0.0/ws/trunk/hbase-server/target/surefire/surefire_2081206542173695898805tmp>
org.apache.maven.surefire.booter.SurefireBooterForkException: Error occurred in starting fork,
check output in log
	at org.apache.maven.plugin.surefire.booterclient.ForkStarter.fork(ForkStarter.java:238)
	at org.apache.maven.plugin.surefire.booterclient.ForkStarter.access$000(ForkStarter.java:64)
	at org.apache.maven.plugin.surefire.booterclient.ForkStarter$ParallelFork.call(ForkStarter.java:303)
	at org.apache.maven.plugin.surefire.booterclient.ForkStarter$ParallelFork.call(ForkStarter.java:285)
	at java.util.concurrent.FutureTask$Sync.innerRun(FutureTask.java:303)
	at java.util.concurrent.FutureTask.run(FutureTask.java:138)
	at java.util.concurrent.ThreadPoolExecutor$Worker.runTask(ThreadPoolExecutor.java:886)
	at java.util.concurrent.ThreadPoolExecutor$Worker.run(ThreadPoolExecutor.java:908)
	at java.lang.Thread.run(Thread.java:662)
Forking command line: /bin/sh -c cd <https://builds.apache.org/job/HBase-TRUNK-on-Hadoop-2.0.0/ws/trunk/hbase-server>
&& /home/jenkins/tools/java/jdk1.6.0_27-32/jre/bin/java -enableassertions -Xmx1900m
-Djava.security.egd=file:/dev/./urandom -Djava.net.preferIPv4Stack=true -jar <https://builds.apache.org/job/HBase-TRUNK-on-Hadoop-2.0.0/ws/trunk/hbase-server/target/surefire/surefirebooter5115321199178731253.jar>
<https://builds.apache.org/job/HBase-TRUNK-on-Hadoop-2.0.0/ws/trunk/hbase-server/target/surefire/surefire8083936033598107357tmp>
<https://builds.apache.org/job/HBase-TRUNK-on-Hadoop-2.0.0/ws/trunk/hbase-server/target/surefire/surefire_2094041269970865465359tmp>
org.apache.maven.surefire.booter.SurefireBooterForkException: Error occurred in starting fork,
check output in log
	at org.apache.maven.plugin.surefire.booterclient.ForkStarter.fork(ForkStarter.java:238)
	at org.apache.maven.plugin.surefire.booterclient.ForkStarter.access$000(ForkStarter.java:64)
	at org.apache.maven.plugin.surefire.booterclient.ForkStarter$ParallelFork.call(ForkStarter.java:303)
	at org.apache.maven.plugin.surefire.booterclient.ForkStarter$ParallelFork.call(ForkStarter.java:285)
	at java.util.concurrent.FutureTask$Sync.innerRun(FutureTask.java:303)
	at java.util.concurrent.FutureTask.run(FutureTask.java:138)
	at java.util.concurrent.ThreadPoolExecutor$Worker.runTask(ThreadPoolExecutor.java:886)
	at java.util.concurrent.ThreadPoolExecutor$Worker.run(ThreadPoolExecutor.java:908)
	at java.lang.Thread.run(Thread.java:662)
Forking command line: /bin/sh -c cd <https://builds.apache.org/job/HBase-TRUNK-on-Hadoop-2.0.0/ws/trunk/hbase-server>
&& /home/jenkins/tools/java/jdk1.6.0_27-32/jre/bin/java -enableassertions -Xmx1900m
-Djava.security.egd=file:/dev/./urandom -Djava.net.preferIPv4Stack=true -jar <https://builds.apache.org/job/HBase-TRUNK-on-Hadoop-2.0.0/ws/trunk/hbase-server/target/surefire/surefirebooter1619642760655565202.jar>
<https://builds.apache.org/job/HBase-TRUNK-on-Hadoop-2.0.0/ws/trunk/hbase-server/target/surefire/surefire3334435944517677615tmp>
<https://builds.apache.org/job/HBase-TRUNK-on-Hadoop-2.0.0/ws/trunk/hbase-server/target/surefire/surefire_2107681784817762500037tmp>
Running org.apache.hadoop.hbase.mapreduce.TestImportTsv
Tests run: 13, Failures: 1, Errors: 0, Skipped: 0, Time elapsed: 420.998 sec <<<
FAILURE!
Forking command line: /bin/sh -c cd <https://builds.apache.org/job/HBase-TRUNK-on-Hadoop-2.0.0/ws/trunk/hbase-server>
&& /home/jenkins/tools/java/jdk1.6.0_27-32/jre/bin/java -enableassertions -Xmx1900m
-Djava.security.egd=file:/dev/./urandom -Djava.net.preferIPv4Stack=true -jar <https://builds.apache.org/job/HBase-TRUNK-on-Hadoop-2.0.0/ws/trunk/hbase-server/target/surefire/surefirebooter6354643300186858892.jar>
<https://builds.apache.org/job/HBase-TRUNK-on-Hadoop-2.0.0/ws/trunk/hbase-server/target/surefire/surefire2327162039975264683tmp>
<https://builds.apache.org/job/HBase-TRUNK-on-Hadoop-2.0.0/ws/trunk/hbase-server/target/surefire/surefire_2116029124475893783138tmp>
Running org.apache.hadoop.hbase.mapreduce.TestWALPlayer
Tests run: 1, Failures: 0, Errors: 0, Skipped: 0, Time elapsed: 143.016 sec
Forking command line: /bin/sh -c cd <https://builds.apache.org/job/HBase-TRUNK-on-Hadoop-2.0.0/ws/trunk/hbase-server>
&& /home/jenkins/tools/java/jdk1.6.0_27-32/jre/bin/java -enableassertions -Xmx1900m
-Djava.security.egd=file:/dev/./urandom -Djava.net.preferIPv4Stack=true -jar <https://builds.apache.org/job/HBase-TRUNK-on-Hadoop-2.0.0/ws/trunk/hbase-server/target/surefire/surefirebooter5446632255771743818.jar>
<https://builds.apache.org/job/HBase-TRUNK-on-Hadoop-2.0.0/ws/trunk/hbase-server/target/surefire/surefire4247407116392564138tmp>
<https://builds.apache.org/job/HBase-TRUNK-on-Hadoop-2.0.0/ws/trunk/hbase-server/target/surefire/surefire_2124133986871478057638tmp>
Running org.apache.hadoop.hbase.mapreduce.TestHFileOutputFormat
Tests run: 10, Failures: 4, Errors: 0, Skipped: 0, Time elapsed: 504.54 sec <<< FAILURE!
Forking command line: /bin/sh -c cd <https://builds.apache.org/job/HBase-TRUNK-on-Hadoop-2.0.0/ws/trunk/hbase-server>
&& /home/jenkins/tools/java/jdk1.6.0_27-32/jre/bin/java -enableassertions -Xmx1900m
-Djava.security.egd=file:/dev/./urandom -Djava.net.preferIPv4Stack=true -jar <https://builds.apache.org/job/HBase-TRUNK-on-Hadoop-2.0.0/ws/trunk/hbase-server/target/surefire/surefirebooter4559138954551831464.jar>
<https://builds.apache.org/job/HBase-TRUNK-on-Hadoop-2.0.0/ws/trunk/hbase-server/target/surefire/surefire1060897397864481338tmp>
<https://builds.apache.org/job/HBase-TRUNK-on-Hadoop-2.0.0/ws/trunk/hbase-server/target/surefire/surefire_2132064012060080945543tmp>
org.apache.maven.surefire.booter.SurefireBooterForkException: Error occurred in starting fork,
check output in log
	at org.apache.maven.plugin.surefire.booterclient.ForkStarter.fork(ForkStarter.java:238)
	at org.apache.maven.plugin.surefire.booterclient.ForkStarter.access$000(ForkStarter.java:64)
	at org.apache.maven.plugin.surefire.booterclient.ForkStarter$ParallelFork.call(ForkStarter.java:303)
	at org.apache.maven.plugin.surefire.booterclient.ForkStarter$ParallelFork.call(ForkStarter.java:285)
	at java.util.concurrent.FutureTask$Sync.innerRun(FutureTask.java:303)
	at java.util.concurrent.FutureTask.run(FutureTask.java:138)
	at java.util.concurrent.ThreadPoolExecutor$Worker.runTask(ThreadPoolExecutor.java:886)
	at java.util.concurrent.ThreadPoolExecutor$Worker.run(ThreadPoolExecutor.java:908)
	at java.lang.Thread.run(Thread.java:662)
Forking command line: /bin/sh -c cd <https://builds.apache.org/job/HBase-TRUNK-on-Hadoop-2.0.0/ws/trunk/hbase-server>
&& /home/jenkins/tools/java/jdk1.6.0_27-32/jre/bin/java -enableassertions -Xmx1900m
-Djava.security.egd=file:/dev/./urandom -Djava.net.preferIPv4Stack=true -jar <https://builds.apache.org/job/HBase-TRUNK-on-Hadoop-2.0.0/ws/trunk/hbase-server/target/surefire/surefirebooter1451692417364843208.jar>
<https://builds.apache.org/job/HBase-TRUNK-on-Hadoop-2.0.0/ws/trunk/hbase-server/target/surefire/surefire2778647147116610711tmp>
<https://builds.apache.org/job/HBase-TRUNK-on-Hadoop-2.0.0/ws/trunk/hbase-server/target/surefire/surefire_2147902706852830552910tmp>
Running org.apache.hadoop.hbase.mapreduce.TestLoadIncrementalHFilesSplitRecovery
Tests run: 4, Failures: 0, Errors: 0, Skipped: 0, Time elapsed: 141.431 sec
Forking command line: /bin/sh -c cd <https://builds.apache.org/job/HBase-TRUNK-on-Hadoop-2.0.0/ws/trunk/hbase-server>
&& /home/jenkins/tools/java/jdk1.6.0_27-32/jre/bin/java -enableassertions -Xmx1900m
-Djava.security.egd=file:/dev/./urandom -Djava.net.preferIPv4Stack=true -jar <https://builds.apache.org/job/HBase-TRUNK-on-Hadoop-2.0.0/ws/trunk/hbase-server/target/surefire/surefirebooter3354920411157690806.jar>
<https://builds.apache.org/job/HBase-TRUNK-on-Hadoop-2.0.0/ws/trunk/hbase-server/target/surefire/surefire8130096165641571379tmp>
<https://builds.apache.org/job/HBase-TRUNK-on-Hadoop-2.0.0/ws/trunk/hbase-server/target/surefire/surefire_2152714934529638223151tmp>
Running org.apache.hadoop.hbase.mapreduce.TestHLogRecordReader
Tests run: 2, Failures: 0, Errors: 0, Skipped: 0, Time elapsed: 18.342 sec
Running org.apache.hadoop.hbase.mapreduce.TestLoadIncrementalHFiles
Tests run: 6, Failures: 0, Errors: 0, Skipped: 0, Time elapsed: 55.892 sec
Running org.apache.hadoop.hbase.mapreduce.TestTableMapReduce
Tests run: 1, Failures: 0, Errors: 0, Skipped: 0, Time elapsed: 191.229 sec
No results for java.util.concurrent.FutureTask@15a23be
No results for java.util.concurrent.FutureTask@e0a73b
No results for java.util.concurrent.FutureTask@10336d7

Results :

Failed tests:   testRegionShouldNotBeDeployed(org.apache.hadoop.hbase.util.TestHBaseFsck):
expected:<[SHOULD_NOT_BE_DEPLOYED]> but was:<[]>
  testRowCounterHiddenColumn(org.apache.hadoop.hbase.mapreduce.TestRowCounter)
  testBulkOutputWithoutAnExistingTable(org.apache.hadoop.hbase.mapreduce.TestImportTsv)
  testExcludeAllFromMinorCompaction(org.apache.hadoop.hbase.mapreduce.TestHFileOutputFormat)
  testExcludeMinorCompaction(org.apache.hadoop.hbase.mapreduce.TestHFileOutputFormat)
  testMRIncrementalLoad(org.apache.hadoop.hbase.mapreduce.TestHFileOutputFormat)
  testMRIncrementalLoadWithSplit(org.apache.hadoop.hbase.mapreduce.TestHFileOutputFormat)

Tests in error: 
  loadTest[0](org.apache.hadoop.hbase.util.TestMiniClusterLoadParallel): test timed out after
180000 milliseconds
  loadTest[1](org.apache.hadoop.hbase.util.TestMiniClusterLoadParallel): test timed out after
180000 milliseconds
  loadTest[3](org.apache.hadoop.hbase.util.TestMiniClusterLoadParallel): Cannot remove data
directory: <https://builds.apache.org/job/HBase-TRUNK-on-Hadoop-2.0.0/ws/trunk/hbase-server/target/test-data/5b7d2a51-87cb-4615-9007-61e5292e5c4a/dfscluster_eb37273c-1641-4036-9e38-373c27d56989/dfs/data>
  loadTest[0](org.apache.hadoop.hbase.util.TestMiniClusterLoadSequential): test timed out
after 180000 milliseconds
  loadTest[1](org.apache.hadoop.hbase.util.TestMiniClusterLoadSequential): test timed out
after 180000 milliseconds
  testJoinedScanners(org.apache.hadoop.hbase.regionserver.TestJoinedScanners): This server
is in the failed servers list: juno.apache.org/67.195.138.61:40938

Tests run: 1305, Failures: 7, Errors: 6, Skipped: 13

[INFO]                                                                         
[INFO] ------------------------------------------------------------------------
[INFO] Skipping HBase
[INFO] This project has been banned from the build due to previous failures.
[INFO] ------------------------------------------------------------------------
[INFO] ------------------------------------------------------------------------
[INFO] Reactor Summary:
[INFO] 
[INFO] HBase ............................................. SUCCESS [12.789s]
[INFO] HBase - Common .................................... SUCCESS [31.440s]
[INFO] HBase - Protocol .................................. SUCCESS [27.699s]
[INFO] HBase - Client .................................... SUCCESS [1.843s]
[INFO] HBase - Hadoop Compatibility ...................... SUCCESS [1.430s]
[INFO] HBase - Hadoop Two Compatibility .................. SUCCESS [7.910s]
[INFO] HBase - Server .................................... FAILURE [1:33:31.421s]
[INFO] HBase - Integration Tests ......................... SKIPPED
[INFO] HBase - Examples .................................. SKIPPED
[INFO] ------------------------------------------------------------------------
[INFO] BUILD FAILURE
[INFO] ------------------------------------------------------------------------
[INFO] Total time: 1:35:01.224s
[INFO] Finished at: Tue Feb 05 04:07:03 UTC 2013
[INFO] Final Memory: 105M/998M
[INFO] ------------------------------------------------------------------------
[ERROR] Failed to execute goal org.apache.maven.plugins:maven-surefire-plugin:2.12-TRUNK-HBASE-2:test
(secondPartTestsExecution) on project hbase-server: Failure or timeout -> [Help 1]
org.apache.maven.lifecycle.LifecycleExecutionException: Failed to execute goal org.apache.maven.plugins:maven-surefire-plugin:2.12-TRUNK-HBASE-2:test
(secondPartTestsExecution) on project hbase-server: Failure or timeout
	at org.apache.maven.lifecycle.internal.MojoExecutor.execute(MojoExecutor.java:217)
	at org.apache.maven.lifecycle.internal.MojoExecutor.execute(MojoExecutor.java:153)
	at org.apache.maven.lifecycle.internal.MojoExecutor.execute(MojoExecutor.java:145)
	at org.apache.maven.lifecycle.internal.LifecycleModuleBuilder.buildProject(LifecycleModuleBuilder.java:84)
	at org.apache.maven.lifecycle.internal.LifecycleModuleBuilder.buildProject(LifecycleModuleBuilder.java:59)
	at org.apache.maven.lifecycle.internal.LifecycleStarter.singleThreadedBuild(LifecycleStarter.java:183)
	at org.apache.maven.lifecycle.internal.LifecycleStarter.execute(LifecycleStarter.java:161)
	at org.apache.maven.DefaultMaven.doExecute(DefaultMaven.java:320)
	at org.apache.maven.DefaultMaven.execute(DefaultMaven.java:156)
	at org.apache.maven.cli.MavenCli.execute(MavenCli.java:537)
	at org.apache.maven.cli.MavenCli.doMain(MavenCli.java:196)
	at org.apache.maven.cli.MavenCli.main(MavenCli.java:141)
	at sun.reflect.NativeMethodAccessorImpl.invoke0(Native Method)
	at sun.reflect.NativeMethodAccessorImpl.invoke(NativeMethodAccessorImpl.java:39)
	at sun.reflect.DelegatingMethodAccessorImpl.invoke(DelegatingMethodAccessorImpl.java:25)
	at java.lang.reflect.Method.invoke(Method.java:597)
	at org.codehaus.plexus.classworlds.launcher.Launcher.launchEnhanced(Launcher.java:290)
	at org.codehaus.plexus.classworlds.launcher.Launcher.launch(Launcher.java:230)
	at org.codehaus.plexus.classworlds.launcher.Launcher.mainWithExitCode(Launcher.java:409)
	at org.codehaus.plexus.classworlds.launcher.Launcher.main(Launcher.java:352)
Caused by: org.apache.maven.plugin.MojoExecutionException: Failure or timeout
	at org.apache.maven.plugin.surefire.SurefirePlugin.assertNoFailureOrTimeout(SurefirePlugin.java:643)
	at org.apache.maven.plugin.surefire.SurefirePlugin.handleSummary(SurefirePlugin.java:624)
	at org.apache.maven.plugin.surefire.AbstractSurefireMojo.executeAfterPreconditionsChecked(AbstractSurefireMojo.java:137)
	at org.apache.maven.plugin.surefire.AbstractSurefireMojo.execute(AbstractSurefireMojo.java:98)
	at org.apache.maven.plugin.DefaultBuildPluginManager.executeMojo(DefaultBuildPluginManager.java:101)
	at org.apache.maven.lifecycle.internal.MojoExecutor.execute(MojoExecutor.java:209)
	... 19 more
[ERROR] 
[ERROR] 
[ERROR] For more information about the errors and possible solutions, please read the following
articles:
[ERROR] [Help 1] http://cwiki.apache.org/confluence/display/MAVEN/MojoExecutionException
[ERROR] 
[ERROR] After correcting the problems, you can resume the build with the command
[ERROR]   mvn <goals> -rf :hbase-server
Build step 'Invoke top-level Maven targets' marked build as failure
Archiving artifacts
Recording test results
Updating HBASE-7758
Updating HBASE-7748
Updating HBASE-7760

Mime
View raw message