hbase-dev mailing list archives

Site index · List index
Message view « Date » · « Thread »
Top « Date » · « Thread »
From Apache Jenkins Server <jenk...@builds.apache.org>
Subject Build failed in Jenkins: HBase-0.94-security #113
Date Thu, 28 Feb 2013 07:32:21 GMT
See <https://builds.apache.org/job/HBase-0.94-security/113/changes>

Changes:

[tedyu] HBASE-7944 Replication leaks file reader resource & not reset currentNbOperations
(Jeffrey Zhong)

[stack] HBASE-7929 Reapply hbase-7507 "Make memstore flush be able to retry after exception"
to 0.94 branch.

[tedyu] HBASE-7878 revert due to TestHLogSplit test failure

[jyates] HBASE-7725: Add ability to create custom compaction request

[enis] HBASE-7777 HBCK check for lingering split parents should check for child regions

[tedyu] HBASE-7878 Addendum for trying fs.append in case recoverLease throws exception

[tedyu] HBASE-7878 add debug log for recoverLease timeout

[tedyu] HBASE-7878 recoverFileLease does not check return value of recoverLease (Ted Yu)

[enis] HBASE-4210 Allow coprocessor to interact with batches per region sent from a client
(Anoop). ADDENDUM patch for fixing line endings

[larsh] HBASE-7945 Remove flaky TestCatalogTrackerOnCluster

[tedyu] HBASE-4210 Allow coprocessor to interact with batches per region sent from a client
(Anoop)

[larsh] HBASE-7883 Update memstore size when removing the entries in append operation (Himanshu
Vashishtha)

------------------------------------------
[...truncated 8508 lines...]
Tests run: 4, Failures: 0, Errors: 0, Skipped: 0, Time elapsed: 1.025 sec
Forking command line: /bin/sh -c cd /x1/jenkins/jenkins-slave/workspace/HBase-0.94-security/trunk
&& /x1/jenkins/tools/java/jdk1.6.0_32-32/jre/bin/java -enableassertions -Xmx1900m
-Djava.security.egd=file:/dev/./urandom -jar /x1/jenkins/jenkins-slave/workspace/HBase-0.94-security/trunk/target/surefire/surefirebooter953984710561726988.jar
/x1/jenkins/jenkins-slave/workspace/HBase-0.94-security/trunk/target/surefire/surefire3185135448579416444tmp
/x1/jenkins/jenkins-slave/workspace/HBase-0.94-security/trunk/target/surefire/surefire_844140591623589932198tmp
Running org.apache.hadoop.hbase.regionserver.TestSplitLogWorker
Tests run: 5, Failures: 0, Errors: 0, Skipped: 0, Time elapsed: 2.945 sec
Forking command line: /bin/sh -c cd /x1/jenkins/jenkins-slave/workspace/HBase-0.94-security/trunk
&& /x1/jenkins/tools/java/jdk1.6.0_32-32/jre/bin/java -enableassertions -Xmx1900m
-Djava.security.egd=file:/dev/./urandom -jar /x1/jenkins/jenkins-slave/workspace/HBase-0.94-security/trunk/target/surefire/surefirebooter1654217402160632454.jar
/x1/jenkins/jenkins-slave/workspace/HBase-0.94-security/trunk/target/surefire/surefire280991459203462695tmp
/x1/jenkins/jenkins-slave/workspace/HBase-0.94-security/trunk/target/surefire/surefire_854290795504381042457tmp
Running org.apache.hadoop.hbase.regionserver.TestStoreScanner
Tests run: 16, Failures: 0, Errors: 0, Skipped: 0, Time elapsed: 0.04 sec
Forking command line: /bin/sh -c cd /x1/jenkins/jenkins-slave/workspace/HBase-0.94-security/trunk
&& /x1/jenkins/tools/java/jdk1.6.0_32-32/jre/bin/java -enableassertions -Xmx1900m
-Djava.security.egd=file:/dev/./urandom -jar /x1/jenkins/jenkins-slave/workspace/HBase-0.94-security/trunk/target/surefire/surefirebooter8170097661646525217.jar
/x1/jenkins/jenkins-slave/workspace/HBase-0.94-security/trunk/target/surefire/surefire8399971021806809813tmp
/x1/jenkins/jenkins-slave/workspace/HBase-0.94-security/trunk/target/surefire/surefire_868283060133646085620tmp
Running org.apache.hadoop.hbase.regionserver.handler.TestOpenRegionHandler
Tests run: 4, Failures: 0, Errors: 0, Skipped: 0, Time elapsed: 12.407 sec
Forking command line: /bin/sh -c cd /x1/jenkins/jenkins-slave/workspace/HBase-0.94-security/trunk
&& /x1/jenkins/tools/java/jdk1.6.0_32-32/jre/bin/java -enableassertions -Xmx1900m
-Djava.security.egd=file:/dev/./urandom -jar /x1/jenkins/jenkins-slave/workspace/HBase-0.94-security/trunk/target/surefire/surefirebooter8723199977190502240.jar
/x1/jenkins/jenkins-slave/workspace/HBase-0.94-security/trunk/target/surefire/surefire6901405073710800327tmp
/x1/jenkins/jenkins-slave/workspace/HBase-0.94-security/trunk/target/surefire/surefire_871567642335121383074tmp
Running org.apache.hadoop.hbase.regionserver.metrics.TestSchemaMetrics
Tests run: 6, Failures: 0, Errors: 0, Skipped: 0, Time elapsed: 12.275 sec
Forking command line: /bin/sh -c cd /x1/jenkins/jenkins-slave/workspace/HBase-0.94-security/trunk
&& /x1/jenkins/tools/java/jdk1.6.0_32-32/jre/bin/java -enableassertions -Xmx1900m
-Djava.security.egd=file:/dev/./urandom -jar /x1/jenkins/jenkins-slave/workspace/HBase-0.94-security/trunk/target/surefire/surefirebooter1005323090689912061.jar
/x1/jenkins/jenkins-slave/workspace/HBase-0.94-security/trunk/target/surefire/surefire5166195008495422388tmp
/x1/jenkins/jenkins-slave/workspace/HBase-0.94-security/trunk/target/surefire/surefire_882527837166619699154tmp
Running org.apache.hadoop.hbase.regionserver.TestStoreFileBlockCacheSummary
Tests run: 1, Failures: 0, Errors: 0, Skipped: 0, Time elapsed: 13.435 sec
Forking command line: /bin/sh -c cd /x1/jenkins/jenkins-slave/workspace/HBase-0.94-security/trunk
&& /x1/jenkins/tools/java/jdk1.6.0_32-32/jre/bin/java -enableassertions -Xmx1900m
-Djava.security.egd=file:/dev/./urandom -jar /x1/jenkins/jenkins-slave/workspace/HBase-0.94-security/trunk/target/surefire/surefirebooter7880289336179423875.jar
/x1/jenkins/jenkins-slave/workspace/HBase-0.94-security/trunk/target/surefire/surefire8795741475940053017tmp
/x1/jenkins/jenkins-slave/workspace/HBase-0.94-security/trunk/target/surefire/surefire_897937681042896421709tmp
Running org.apache.hadoop.hbase.regionserver.TestMasterAddressManager
Tests run: 1, Failures: 0, Errors: 0, Skipped: 0, Time elapsed: 0.587 sec
Forking command line: /bin/sh -c cd /x1/jenkins/jenkins-slave/workspace/HBase-0.94-security/trunk
&& /x1/jenkins/tools/java/jdk1.6.0_32-32/jre/bin/java -enableassertions -Xmx1900m
-Djava.security.egd=file:/dev/./urandom -jar /x1/jenkins/jenkins-slave/workspace/HBase-0.94-security/trunk/target/surefire/surefirebooter2184296002979741404.jar
/x1/jenkins/jenkins-slave/workspace/HBase-0.94-security/trunk/target/surefire/surefire8018722257798329811tmp
/x1/jenkins/jenkins-slave/workspace/HBase-0.94-security/trunk/target/surefire/surefire_903106143205679302333tmp
Running org.apache.hadoop.hbase.regionserver.TestMultiColumnScanner
Tests run: 12, Failures: 0, Errors: 0, Skipped: 0, Time elapsed: 30.501 sec
Forking command line: /bin/sh -c cd /x1/jenkins/jenkins-slave/workspace/HBase-0.94-security/trunk
&& /x1/jenkins/tools/java/jdk1.6.0_32-32/jre/bin/java -enableassertions -Xmx1900m
-Djava.security.egd=file:/dev/./urandom -jar /x1/jenkins/jenkins-slave/workspace/HBase-0.94-security/trunk/target/surefire/surefirebooter3988595739297862223.jar
/x1/jenkins/jenkins-slave/workspace/HBase-0.94-security/trunk/target/surefire/surefire8258859685435365795tmp
/x1/jenkins/jenkins-slave/workspace/HBase-0.94-security/trunk/target/surefire/surefire_915137700917488811872tmp
Running org.apache.hadoop.hbase.regionserver.TestHRegion
Tests run: 73, Failures: 0, Errors: 0, Skipped: 0, Time elapsed: 41.438 sec
Forking command line: /bin/sh -c cd /x1/jenkins/jenkins-slave/workspace/HBase-0.94-security/trunk
&& /x1/jenkins/tools/java/jdk1.6.0_32-32/jre/bin/java -enableassertions -Xmx1900m
-Djava.security.egd=file:/dev/./urandom -jar /x1/jenkins/jenkins-slave/workspace/HBase-0.94-security/trunk/target/surefire/surefirebooter6080022239546396245.jar
/x1/jenkins/jenkins-slave/workspace/HBase-0.94-security/trunk/target/surefire/surefire1231905958766797659tmp
/x1/jenkins/jenkins-slave/workspace/HBase-0.94-security/trunk/target/surefire/surefire_92589065195753880993tmp
Running org.apache.hadoop.hbase.TestLocalHBaseCluster
Tests run: 1, Failures: 0, Errors: 0, Skipped: 0, Time elapsed: 8.882 sec
Forking command line: /bin/sh -c cd /x1/jenkins/jenkins-slave/workspace/HBase-0.94-security/trunk
&& /x1/jenkins/tools/java/jdk1.6.0_32-32/jre/bin/java -enableassertions -Xmx1900m
-Djava.security.egd=file:/dev/./urandom -jar /x1/jenkins/jenkins-slave/workspace/HBase-0.94-security/trunk/target/surefire/surefirebooter3378907554464394143.jar
/x1/jenkins/jenkins-slave/workspace/HBase-0.94-security/trunk/target/surefire/surefire2285574805171124021tmp
/x1/jenkins/jenkins-slave/workspace/HBase-0.94-security/trunk/target/surefire/surefire_931803281401233851746tmp
Running org.apache.hadoop.hbase.ipc.TestDelayedRpc
Tests run: 4, Failures: 0, Errors: 0, Skipped: 0, Time elapsed: 2.664 sec
Forking command line: /bin/sh -c cd /x1/jenkins/jenkins-slave/workspace/HBase-0.94-security/trunk
&& /x1/jenkins/tools/java/jdk1.6.0_32-32/jre/bin/java -enableassertions -Xmx1900m
-Djava.security.egd=file:/dev/./urandom -jar /x1/jenkins/jenkins-slave/workspace/HBase-0.94-security/trunk/target/surefire/surefirebooter8791012603355448584.jar
/x1/jenkins/jenkins-slave/workspace/HBase-0.94-security/trunk/target/surefire/surefire3275565581083912642tmp
/x1/jenkins/jenkins-slave/workspace/HBase-0.94-security/trunk/target/surefire/surefire_942211822372435331483tmp
Running org.apache.hadoop.hbase.ipc.TestPBOnWritableRpc
Tests run: 1, Failures: 0, Errors: 0, Skipped: 0, Time elapsed: 1.026 sec
Forking command line: /bin/sh -c cd /x1/jenkins/jenkins-slave/workspace/HBase-0.94-security/trunk
&& /x1/jenkins/tools/java/jdk1.6.0_32-32/jre/bin/java -enableassertions -Xmx1900m
-Djava.security.egd=file:/dev/./urandom -jar /x1/jenkins/jenkins-slave/workspace/HBase-0.94-security/trunk/target/surefire/surefirebooter3915771041082872340.jar
/x1/jenkins/jenkins-slave/workspace/HBase-0.94-security/trunk/target/surefire/surefire2787601836672156683tmp
/x1/jenkins/jenkins-slave/workspace/HBase-0.94-security/trunk/target/surefire/surefire_956327497194280505095tmp
Running org.apache.hadoop.hbase.TestGlobalMemStoreSize
Tests run: 1, Failures: 0, Errors: 0, Skipped: 0, Time elapsed: 15.374 sec
Forking command line: /bin/sh -c cd /x1/jenkins/jenkins-slave/workspace/HBase-0.94-security/trunk
&& /x1/jenkins/tools/java/jdk1.6.0_32-32/jre/bin/java -enableassertions -Xmx1900m
-Djava.security.egd=file:/dev/./urandom -jar /x1/jenkins/jenkins-slave/workspace/HBase-0.94-security/trunk/target/surefire/surefirebooter8601943207615990141.jar
/x1/jenkins/jenkins-slave/workspace/HBase-0.94-security/trunk/target/surefire/surefire7707574354656058818tmp
/x1/jenkins/jenkins-slave/workspace/HBase-0.94-security/trunk/target/surefire/surefire_963473367720362378453tmp
Running org.apache.hadoop.hbase.constraint.TestConstraint
Tests run: 5, Failures: 0, Errors: 0, Skipped: 0, Time elapsed: 26.761 sec
Forking command line: /bin/sh -c cd /x1/jenkins/jenkins-slave/workspace/HBase-0.94-security/trunk
&& /x1/jenkins/tools/java/jdk1.6.0_32-32/jre/bin/java -enableassertions -Xmx1900m
-Djava.security.egd=file:/dev/./urandom -jar /x1/jenkins/jenkins-slave/workspace/HBase-0.94-security/trunk/target/surefire/surefirebooter6115680104908372328.jar
/x1/jenkins/jenkins-slave/workspace/HBase-0.94-security/trunk/target/surefire/surefire3960167212709513608tmp
/x1/jenkins/jenkins-slave/workspace/HBase-0.94-security/trunk/target/surefire/surefire_973095074404196400845tmp
Running org.apache.hadoop.hbase.rest.TestSchemaResource
Tests run: 2, Failures: 0, Errors: 0, Skipped: 0, Time elapsed: 19.23 sec
Forking command line: /bin/sh -c cd /x1/jenkins/jenkins-slave/workspace/HBase-0.94-security/trunk
&& /x1/jenkins/tools/java/jdk1.6.0_32-32/jre/bin/java -enableassertions -Xmx1900m
-Djava.security.egd=file:/dev/./urandom -jar /x1/jenkins/jenkins-slave/workspace/HBase-0.94-security/trunk/target/surefire/surefirebooter2289166420950822250.jar
/x1/jenkins/jenkins-slave/workspace/HBase-0.94-security/trunk/target/surefire/surefire4772156658302250340tmp
/x1/jenkins/jenkins-slave/workspace/HBase-0.94-security/trunk/target/surefire/surefire_981445866832788509855tmp
Running org.apache.hadoop.hbase.rest.client.TestRemoteAdmin
Tests run: 1, Failures: 0, Errors: 0, Skipped: 0, Time elapsed: 16.447 sec
Forking command line: /bin/sh -c cd /x1/jenkins/jenkins-slave/workspace/HBase-0.94-security/trunk
&& /x1/jenkins/tools/java/jdk1.6.0_32-32/jre/bin/java -enableassertions -Xmx1900m
-Djava.security.egd=file:/dev/./urandom -jar /x1/jenkins/jenkins-slave/workspace/HBase-0.94-security/trunk/target/surefire/surefirebooter5918555278708757100.jar
/x1/jenkins/jenkins-slave/workspace/HBase-0.94-security/trunk/target/surefire/surefire6910243310824295403tmp
/x1/jenkins/jenkins-slave/workspace/HBase-0.94-security/trunk/target/surefire/surefire_997881060549456606613tmp
Running org.apache.hadoop.hbase.rest.client.TestRemoteTable
Tests run: 4, Failures: 0, Errors: 0, Skipped: 0, Time elapsed: 13.635 sec
Forking command line: /bin/sh -c cd /x1/jenkins/jenkins-slave/workspace/HBase-0.94-security/trunk
&& /x1/jenkins/tools/java/jdk1.6.0_32-32/jre/bin/java -enableassertions -Xmx1900m
-Djava.security.egd=file:/dev/./urandom -jar /x1/jenkins/jenkins-slave/workspace/HBase-0.94-security/trunk/target/surefire/surefirebooter6237483689685861327.jar
/x1/jenkins/jenkins-slave/workspace/HBase-0.94-security/trunk/target/surefire/surefire1307042132803674348tmp
/x1/jenkins/jenkins-slave/workspace/HBase-0.94-security/trunk/target/surefire/surefire_1006515065018764737038tmp
Running org.apache.hadoop.hbase.backup.TestHFileArchiving
Tests run: 5, Failures: 0, Errors: 0, Skipped: 0, Time elapsed: 133.484 sec
Forking command line: /bin/sh -c cd /x1/jenkins/jenkins-slave/workspace/HBase-0.94-security/trunk
&& /x1/jenkins/tools/java/jdk1.6.0_32-32/jre/bin/java -enableassertions -Xmx1900m
-Djava.security.egd=file:/dev/./urandom -jar /x1/jenkins/jenkins-slave/workspace/HBase-0.94-security/trunk/target/surefire/surefirebooter4815442061927112140.jar
/x1/jenkins/jenkins-slave/workspace/HBase-0.94-security/trunk/target/surefire/surefire7848078362163266145tmp
/x1/jenkins/jenkins-slave/workspace/HBase-0.94-security/trunk/target/surefire/surefire_1011199662281458677817tmp
Running org.apache.hadoop.hbase.rest.TestMultiRowResource
Tests run: 3, Failures: 0, Errors: 0, Skipped: 0, Time elapsed: 13.949 sec
Forking command line: /bin/sh -c cd /x1/jenkins/jenkins-slave/workspace/HBase-0.94-security/trunk
&& /x1/jenkins/tools/java/jdk1.6.0_32-32/jre/bin/java -enableassertions -Xmx1900m
-Djava.security.egd=file:/dev/./urandom -jar /x1/jenkins/jenkins-slave/workspace/HBase-0.94-security/trunk/target/surefire/surefirebooter1938716362454412861.jar
/x1/jenkins/jenkins-slave/workspace/HBase-0.94-security/trunk/target/surefire/surefire5009480493357934876tmp
/x1/jenkins/jenkins-slave/workspace/HBase-0.94-security/trunk/target/surefire/surefire_1022583416631066564995tmp
Running org.apache.hadoop.hbase.rest.TestTableResource
Tests run: 8, Failures: 0, Errors: 0, Skipped: 0, Time elapsed: 24.03 sec
Forking command line: /bin/sh -c cd /x1/jenkins/jenkins-slave/workspace/HBase-0.94-security/trunk
&& /x1/jenkins/tools/java/jdk1.6.0_32-32/jre/bin/java -enableassertions -Xmx1900m
-Djava.security.egd=file:/dev/./urandom -jar /x1/jenkins/jenkins-slave/workspace/HBase-0.94-security/trunk/target/surefire/surefirebooter3184249486897291878.jar
/x1/jenkins/jenkins-slave/workspace/HBase-0.94-security/trunk/target/surefire/surefire5981556557390245762tmp
/x1/jenkins/jenkins-slave/workspace/HBase-0.94-security/trunk/target/surefire/surefire_1032538089186611087321tmp
Running org.apache.hadoop.hbase.rest.TestGzipFilter
Tests run: 3, Failures: 0, Errors: 0, Skipped: 0, Time elapsed: 14.755 sec
Forking command line: /bin/sh -c cd /x1/jenkins/jenkins-slave/workspace/HBase-0.94-security/trunk
&& /x1/jenkins/tools/java/jdk1.6.0_32-32/jre/bin/java -enableassertions -Xmx1900m
-Djava.security.egd=file:/dev/./urandom -jar /x1/jenkins/jenkins-slave/workspace/HBase-0.94-security/trunk/target/surefire/surefirebooter3912672874220294142.jar
/x1/jenkins/jenkins-slave/workspace/HBase-0.94-security/trunk/target/surefire/surefire744831784199472637tmp
/x1/jenkins/jenkins-slave/workspace/HBase-0.94-security/trunk/target/surefire/surefire_1044441449226845083718tmp
Running org.apache.hadoop.hbase.rest.TestRowResource
Tests run: 11, Failures: 0, Errors: 0, Skipped: 0, Time elapsed: 16.702 sec
Forking command line: /bin/sh -c cd /x1/jenkins/jenkins-slave/workspace/HBase-0.94-security/trunk
&& /x1/jenkins/tools/java/jdk1.6.0_32-32/jre/bin/java -enableassertions -Xmx1900m
-Djava.security.egd=file:/dev/./urandom -jar /x1/jenkins/jenkins-slave/workspace/HBase-0.94-security/trunk/target/surefire/surefirebooter8001989317802394775.jar
/x1/jenkins/jenkins-slave/workspace/HBase-0.94-security/trunk/target/surefire/surefire7582349438879172405tmp
/x1/jenkins/jenkins-slave/workspace/HBase-0.94-security/trunk/target/surefire/surefire_1054537706795836403437tmp
Running org.apache.hadoop.hbase.rest.TestVersionResource
Tests run: 7, Failures: 0, Errors: 0, Skipped: 0, Time elapsed: 11.469 sec
Forking command line: /bin/sh -c cd /x1/jenkins/jenkins-slave/workspace/HBase-0.94-security/trunk
&& /x1/jenkins/tools/java/jdk1.6.0_32-32/jre/bin/java -enableassertions -Xmx1900m
-Djava.security.egd=file:/dev/./urandom -jar /x1/jenkins/jenkins-slave/workspace/HBase-0.94-security/trunk/target/surefire/surefirebooter5950471381299173658.jar
/x1/jenkins/jenkins-slave/workspace/HBase-0.94-security/trunk/target/surefire/surefire5786884203021480874tmp
/x1/jenkins/jenkins-slave/workspace/HBase-0.94-security/trunk/target/surefire/surefire_1063729892405736747438tmp
Running org.apache.hadoop.hbase.rest.TestStatusResource
Tests run: 2, Failures: 0, Errors: 0, Skipped: 0, Time elapsed: 11.308 sec
Forking command line: /bin/sh -c cd /x1/jenkins/jenkins-slave/workspace/HBase-0.94-security/trunk
&& /x1/jenkins/tools/java/jdk1.6.0_32-32/jre/bin/java -enableassertions -Xmx1900m
-Djava.security.egd=file:/dev/./urandom -jar /x1/jenkins/jenkins-slave/workspace/HBase-0.94-security/trunk/target/surefire/surefirebooter4568872962752873707.jar
/x1/jenkins/jenkins-slave/workspace/HBase-0.94-security/trunk/target/surefire/surefire3071238805632935005tmp
/x1/jenkins/jenkins-slave/workspace/HBase-0.94-security/trunk/target/surefire/surefire_1077927269838728898073tmp
Running org.apache.hadoop.hbase.rest.TestScannerResource
Tests run: 5, Failures: 0, Errors: 0, Skipped: 0, Time elapsed: 33 sec
Forking command line: /bin/sh -c cd /x1/jenkins/jenkins-slave/workspace/HBase-0.94-security/trunk
&& /x1/jenkins/tools/java/jdk1.6.0_32-32/jre/bin/java -enableassertions -Xmx1900m
-Djava.security.egd=file:/dev/./urandom -jar /x1/jenkins/jenkins-slave/workspace/HBase-0.94-security/trunk/target/surefire/surefirebooter2022733196826102550.jar
/x1/jenkins/jenkins-slave/workspace/HBase-0.94-security/trunk/target/surefire/surefire8579163889484858352tmp
/x1/jenkins/jenkins-slave/workspace/HBase-0.94-security/trunk/target/surefire/surefire_108705308653169805323tmp
Running org.apache.hadoop.hbase.metrics.TestMetricsMBeanBase
Tests run: 3, Failures: 0, Errors: 0, Skipped: 0, Time elapsed: 1.288 sec
Forking command line: /bin/sh -c cd /x1/jenkins/jenkins-slave/workspace/HBase-0.94-security/trunk
&& /x1/jenkins/tools/java/jdk1.6.0_32-32/jre/bin/java -enableassertions -Xmx1900m
-Djava.security.egd=file:/dev/./urandom -jar /x1/jenkins/jenkins-slave/workspace/HBase-0.94-security/trunk/target/surefire/surefirebooter1315155135471791179.jar
/x1/jenkins/jenkins-slave/workspace/HBase-0.94-security/trunk/target/surefire/surefire2033975200860279428tmp
/x1/jenkins/jenkins-slave/workspace/HBase-0.94-security/trunk/target/surefire/surefire_1091760521774124638412tmp
Running org.apache.hadoop.hbase.io.hfile.TestHFileBlockIndex
Tests run: 10, Failures: 0, Errors: 0, Skipped: 0, Time elapsed: 7.669 sec
Forking command line: /bin/sh -c cd /x1/jenkins/jenkins-slave/workspace/HBase-0.94-security/trunk
&& /x1/jenkins/tools/java/jdk1.6.0_32-32/jre/bin/java -enableassertions -Xmx1900m
-Djava.security.egd=file:/dev/./urandom -jar /x1/jenkins/jenkins-slave/workspace/HBase-0.94-security/trunk/target/surefire/surefirebooter2566924631848795034.jar
/x1/jenkins/jenkins-slave/workspace/HBase-0.94-security/trunk/target/surefire/surefire3069919506473078946tmp
/x1/jenkins/jenkins-slave/workspace/HBase-0.94-security/trunk/target/surefire/surefire_1107990700499792309964tmp
Running org.apache.hadoop.hbase.io.hfile.TestHFileSeek
Tests run: 1, Failures: 0, Errors: 0, Skipped: 0, Time elapsed: 4.943 sec
Forking command line: /bin/sh -c cd /x1/jenkins/jenkins-slave/workspace/HBase-0.94-security/trunk
&& /x1/jenkins/tools/java/jdk1.6.0_32-32/jre/bin/java -enableassertions -Xmx1900m
-Djava.security.egd=file:/dev/./urandom -jar /x1/jenkins/jenkins-slave/workspace/HBase-0.94-security/trunk/target/surefire/surefirebooter8441918603694744038.jar
/x1/jenkins/jenkins-slave/workspace/HBase-0.94-security/trunk/target/surefire/surefire1262660940597282085tmp
/x1/jenkins/jenkins-slave/workspace/HBase-0.94-security/trunk/target/surefire/surefire_1111085269688880668158tmp
Running org.apache.hadoop.hbase.rest.TestScannersWithFilters
Tests run: 10, Failures: 0, Errors: 0, Skipped: 0, Time elapsed: 16.486 sec
Forking command line: /bin/sh -c cd /x1/jenkins/jenkins-slave/workspace/HBase-0.94-security/trunk
&& /x1/jenkins/tools/java/jdk1.6.0_32-32/jre/bin/java -enableassertions -Xmx1900m
-Djava.security.egd=file:/dev/./urandom -jar /x1/jenkins/jenkins-slave/workspace/HBase-0.94-security/trunk/target/surefire/surefirebooter4440019705407465024.jar
/x1/jenkins/jenkins-slave/workspace/HBase-0.94-security/trunk/target/surefire/surefire2247504879962539621tmp
/x1/jenkins/jenkins-slave/workspace/HBase-0.94-security/trunk/target/surefire/surefire_1121461087174977028475tmp
Running org.apache.hadoop.hbase.io.hfile.TestLruBlockCache
Tests run: 16, Failures: 0, Errors: 0, Skipped: 0, Time elapsed: 1.065 sec
Forking command line: /bin/sh -c cd /x1/jenkins/jenkins-slave/workspace/HBase-0.94-security/trunk
&& /x1/jenkins/tools/java/jdk1.6.0_32-32/jre/bin/java -enableassertions -Xmx1900m
-Djava.security.egd=file:/dev/./urandom -jar /x1/jenkins/jenkins-slave/workspace/HBase-0.94-security/trunk/target/surefire/surefirebooter2563725531620006400.jar
/x1/jenkins/jenkins-slave/workspace/HBase-0.94-security/trunk/target/surefire/surefire530415191930556782tmp
/x1/jenkins/jenkins-slave/workspace/HBase-0.94-security/trunk/target/surefire/surefire_1136711663125364935491tmp
Running org.apache.hadoop.hbase.io.hfile.TestFixedFileTrailer
Tests run: 2, Failures: 0, Errors: 0, Skipped: 0, Time elapsed: 0.566 sec
Forking command line: /bin/sh -c cd /x1/jenkins/jenkins-slave/workspace/HBase-0.94-security/trunk
&& /x1/jenkins/tools/java/jdk1.6.0_32-32/jre/bin/java -enableassertions -Xmx1900m
-Djava.security.egd=file:/dev/./urandom -jar /x1/jenkins/jenkins-slave/workspace/HBase-0.94-security/trunk/target/surefire/surefirebooter7275240605782833115.jar
/x1/jenkins/jenkins-slave/workspace/HBase-0.94-security/trunk/target/surefire/surefire845508487948691878tmp
/x1/jenkins/jenkins-slave/workspace/HBase-0.94-security/trunk/target/surefire/surefire_1144352827930697664918tmp
Running org.apache.hadoop.hbase.io.hfile.TestHFilePerformance
Tests run: 1, Failures: 0, Errors: 0, Skipped: 0, Time elapsed: 4.538 sec
Forking command line: /bin/sh -c cd /x1/jenkins/jenkins-slave/workspace/HBase-0.94-security/trunk
&& /x1/jenkins/tools/java/jdk1.6.0_32-32/jre/bin/java -enableassertions -Xmx1900m
-Djava.security.egd=file:/dev/./urandom -jar /x1/jenkins/jenkins-slave/workspace/HBase-0.94-security/trunk/target/surefire/surefirebooter9104044544241171895.jar
/x1/jenkins/jenkins-slave/workspace/HBase-0.94-security/trunk/target/surefire/surefire3189954564916612610tmp
/x1/jenkins/jenkins-slave/workspace/HBase-0.94-security/trunk/target/surefire/surefire_115238444142368623732tmp
Running org.apache.hadoop.hbase.io.hfile.TestHFileBlockCompatibility
Tests run: 10, Failures: 0, Errors: 0, Skipped: 0, Time elapsed: 0.983 sec
Forking command line: /bin/sh -c cd /x1/jenkins/jenkins-slave/workspace/HBase-0.94-security/trunk
&& /x1/jenkins/tools/java/jdk1.6.0_32-32/jre/bin/java -enableassertions -Xmx1900m
-Djava.security.egd=file:/dev/./urandom -jar /x1/jenkins/jenkins-slave/workspace/HBase-0.94-security/trunk/target/surefire/surefirebooter1667778681774571302.jar
/x1/jenkins/jenkins-slave/workspace/HBase-0.94-security/trunk/target/surefire/surefire51273440581695670tmp
/x1/jenkins/jenkins-slave/workspace/HBase-0.94-security/trunk/target/surefire/surefire_1162507868532577284034tmp
Running org.apache.hadoop.hbase.io.hfile.TestCacheOnWrite
Tests run: 36, Failures: 0, Errors: 0, Skipped: 0, Time elapsed: 26.376 sec
Forking command line: /bin/sh -c cd /x1/jenkins/jenkins-slave/workspace/HBase-0.94-security/trunk
&& /x1/jenkins/tools/java/jdk1.6.0_32-32/jre/bin/java -enableassertions -Xmx1900m
-Djava.security.egd=file:/dev/./urandom -jar /x1/jenkins/jenkins-slave/workspace/HBase-0.94-security/trunk/target/surefire/surefirebooter9121958904691399105.jar
/x1/jenkins/jenkins-slave/workspace/HBase-0.94-security/trunk/target/surefire/surefire5980269444137963740tmp
/x1/jenkins/jenkins-slave/workspace/HBase-0.94-security/trunk/target/surefire/surefire_1177278148402847837365tmp
Running org.apache.hadoop.hbase.io.hfile.TestChecksum
Tests run: 3, Failures: 0, Errors: 0, Skipped: 0, Time elapsed: 0.758 sec
Forking command line: /bin/sh -c cd /x1/jenkins/jenkins-slave/workspace/HBase-0.94-security/trunk
&& /x1/jenkins/tools/java/jdk1.6.0_32-32/jre/bin/java -enableassertions -Xmx1900m
-Djava.security.egd=file:/dev/./urandom -jar /x1/jenkins/jenkins-slave/workspace/HBase-0.94-security/trunk/target/surefire/surefirebooter3562149462444416119.jar
/x1/jenkins/jenkins-slave/workspace/HBase-0.94-security/trunk/target/surefire/surefire5111810171251785262tmp
/x1/jenkins/jenkins-slave/workspace/HBase-0.94-security/trunk/target/surefire/surefire_11834909261228619369tmp
Running org.apache.hadoop.hbase.io.hfile.TestForceCacheImportantBlocks
Tests run: 4, Failures: 0, Errors: 0, Skipped: 0, Time elapsed: 40.835 sec
Forking command line: /bin/sh -c cd /x1/jenkins/jenkins-slave/workspace/HBase-0.94-security/trunk
&& /x1/jenkins/tools/java/jdk1.6.0_32-32/jre/bin/java -enableassertions -Xmx1900m
-Djava.security.egd=file:/dev/./urandom -jar /x1/jenkins/jenkins-slave/workspace/HBase-0.94-security/trunk/target/surefire/surefirebooter6458706225187570113.jar
/x1/jenkins/jenkins-slave/workspace/HBase-0.94-security/trunk/target/surefire/surefire7558692514508027815tmp
/x1/jenkins/jenkins-slave/workspace/HBase-0.94-security/trunk/target/surefire/surefire_119499207176984095501tmp
Running org.apache.hadoop.hbase.io.hfile.slab.TestSlabCache
Tests run: 7, Failures: 0, Errors: 0, Skipped: 0, Time elapsed: 16.534 sec
Forking command line: /bin/sh -c cd /x1/jenkins/jenkins-slave/workspace/HBase-0.94-security/trunk
&& /x1/jenkins/tools/java/jdk1.6.0_32-32/jre/bin/java -enableassertions -Xmx1900m
-Djava.security.egd=file:/dev/./urandom -jar /x1/jenkins/jenkins-slave/workspace/HBase-0.94-security/trunk/target/surefire/surefirebooter6860420461157936138.jar
/x1/jenkins/jenkins-slave/workspace/HBase-0.94-security/trunk/target/surefire/surefire7393724838458791550tmp
/x1/jenkins/jenkins-slave/workspace/HBase-0.94-security/trunk/target/surefire/surefire_1204112168966869185689tmp
Running org.apache.hadoop.hbase.io.hfile.slab.TestSingleSizeCache
Tests run: 5, Failures: 0, Errors: 0, Skipped: 0, Time elapsed: 21.2 sec
Forking command line: /bin/sh -c cd /x1/jenkins/jenkins-slave/workspace/HBase-0.94-security/trunk
&& /x1/jenkins/tools/java/jdk1.6.0_32-32/jre/bin/java -enableassertions -Xmx1900m
-Djava.security.egd=file:/dev/./urandom -jar /x1/jenkins/jenkins-slave/workspace/HBase-0.94-security/trunk/target/surefire/surefirebooter3328131924939167068.jar
/x1/jenkins/jenkins-slave/workspace/HBase-0.94-security/trunk/target/surefire/surefire7548811221016239486tmp
/x1/jenkins/jenkins-slave/workspace/HBase-0.94-security/trunk/target/surefire/surefire_1216282181452186466594tmp
Running org.apache.hadoop.hbase.io.hfile.TestHFileBlock
Tests run: 16, Failures: 0, Errors: 0, Skipped: 0, Time elapsed: 49.408 sec
Forking command line: /bin/sh -c cd /x1/jenkins/jenkins-slave/workspace/HBase-0.94-security/trunk
&& /x1/jenkins/tools/java/jdk1.6.0_32-32/jre/bin/java -enableassertions -Xmx1900m
-Djava.security.egd=file:/dev/./urandom -jar /x1/jenkins/jenkins-slave/workspace/HBase-0.94-security/trunk/target/surefire/surefirebooter5868715258009292303.jar
/x1/jenkins/jenkins-slave/workspace/HBase-0.94-security/trunk/target/surefire/surefire6531958767220997397tmp
/x1/jenkins/jenkins-slave/workspace/HBase-0.94-security/trunk/target/surefire/surefire_1228647536005976596830tmp
Running org.apache.hadoop.hbase.replication.TestReplicationZookeeper
Tests run: 1, Failures: 0, Errors: 0, Skipped: 0, Time elapsed: 0.587 sec
Forking command line: /bin/sh -c cd /x1/jenkins/jenkins-slave/workspace/HBase-0.94-security/trunk
&& /x1/jenkins/tools/java/jdk1.6.0_32-32/jre/bin/java -enableassertions -Xmx1900m
-Djava.security.egd=file:/dev/./urandom -jar /x1/jenkins/jenkins-slave/workspace/HBase-0.94-security/trunk/target/surefire/surefirebooter6274075028139897773.jar
/x1/jenkins/jenkins-slave/workspace/HBase-0.94-security/trunk/target/surefire/surefire8980202143631161201tmp
/x1/jenkins/jenkins-slave/workspace/HBase-0.94-security/trunk/target/surefire/surefire_1233976225690377202662tmp
Running org.apache.hadoop.hbase.replication.regionserver.TestReplicationSink
Tests run: 5, Failures: 0, Errors: 0, Skipped: 0, Time elapsed: 15.797 sec
Forking command line: /bin/sh -c cd /x1/jenkins/jenkins-slave/workspace/HBase-0.94-security/trunk
&& /x1/jenkins/tools/java/jdk1.6.0_32-32/jre/bin/java -enableassertions -Xmx1900m
-Djava.security.egd=file:/dev/./urandom -jar /x1/jenkins/jenkins-slave/workspace/HBase-0.94-security/trunk/target/surefire/surefirebooter136269990293464440.jar
/x1/jenkins/jenkins-slave/workspace/HBase-0.94-security/trunk/target/surefire/surefire7264283267944883021tmp
/x1/jenkins/jenkins-slave/workspace/HBase-0.94-security/trunk/target/surefire/surefire_1241210033668264161723tmp
Running org.apache.hadoop.hbase.replication.regionserver.TestReplicationSourceManager
Tests run: 1, Failures: 0, Errors: 0, Skipped: 0, Time elapsed: 1.161 sec
Forking command line: /bin/sh -c cd /x1/jenkins/jenkins-slave/workspace/HBase-0.94-security/trunk
&& /x1/jenkins/tools/java/jdk1.6.0_32-32/jre/bin/java -enableassertions -Xmx1900m
-Djava.security.egd=file:/dev/./urandom -jar /x1/jenkins/jenkins-slave/workspace/HBase-0.94-security/trunk/target/surefire/surefirebooter5714999372127863311.jar
/x1/jenkins/jenkins-slave/workspace/HBase-0.94-security/trunk/target/surefire/surefire5699012948665276339tmp
/x1/jenkins/jenkins-slave/workspace/HBase-0.94-security/trunk/target/surefire/surefire_1257946139352209438058tmp
Running org.apache.hadoop.hbase.io.encoding.TestLoadAndSwitchEncodeOnDisk
Tests run: 1, Failures: 0, Errors: 0, Skipped: 0, Time elapsed: 25.029 sec
Forking command line: /bin/sh -c cd /x1/jenkins/jenkins-slave/workspace/HBase-0.94-security/trunk
&& /x1/jenkins/tools/java/jdk1.6.0_32-32/jre/bin/java -enableassertions -Xmx1900m
-Djava.security.egd=file:/dev/./urandom -jar /x1/jenkins/jenkins-slave/workspace/HBase-0.94-security/trunk/target/surefire/surefirebooter2433519723220027924.jar
/x1/jenkins/jenkins-slave/workspace/HBase-0.94-security/trunk/target/surefire/surefire5012464915893825082tmp
/x1/jenkins/jenkins-slave/workspace/HBase-0.94-security/trunk/target/surefire/surefire_1267676347904521562007tmp
Running org.apache.hadoop.hbase.util.TestFSTableDescriptors
Tests run: 11, Failures: 0, Errors: 0, Skipped: 0, Time elapsed: 0.834 sec
Forking command line: /bin/sh -c cd /x1/jenkins/jenkins-slave/workspace/HBase-0.94-security/trunk
&& /x1/jenkins/tools/java/jdk1.6.0_32-32/jre/bin/java -enableassertions -Xmx1900m
-Djava.security.egd=file:/dev/./urandom -jar /x1/jenkins/jenkins-slave/workspace/HBase-0.94-security/trunk/target/surefire/surefirebooter4059170233559121444.jar
/x1/jenkins/jenkins-slave/workspace/HBase-0.94-security/trunk/target/surefire/surefire2774447595329520565tmp
/x1/jenkins/jenkins-slave/workspace/HBase-0.94-security/trunk/target/surefire/surefire_1273132534055462100504tmp
Running org.apache.hadoop.hbase.replication.TestReplicationSource
Tests run: 1, Failures: 0, Errors: 0, Skipped: 0, Time elapsed: 2.512 sec
Forking command line: /bin/sh -c cd /x1/jenkins/jenkins-slave/workspace/HBase-0.94-security/trunk
&& /x1/jenkins/tools/java/jdk1.6.0_32-32/jre/bin/java -enableassertions -Xmx1900m
-Djava.security.egd=file:/dev/./urandom -jar /x1/jenkins/jenkins-slave/workspace/HBase-0.94-security/trunk/target/surefire/surefirebooter8703233656112568831.jar
/x1/jenkins/jenkins-slave/workspace/HBase-0.94-security/trunk/target/surefire/surefire5933054198867024638tmp
/x1/jenkins/jenkins-slave/workspace/HBase-0.94-security/trunk/target/surefire/surefire_1283232842409025414721tmp
Running org.apache.hadoop.hbase.util.TestEnvironmentEdgeManager
Tests run: 2, Failures: 0, Errors: 0, Skipped: 0, Time elapsed: 0.416 sec
Forking command line: /bin/sh -c cd /x1/jenkins/jenkins-slave/workspace/HBase-0.94-security/trunk
&& /x1/jenkins/tools/java/jdk1.6.0_32-32/jre/bin/java -enableassertions -Xmx1900m
-Djava.security.egd=file:/dev/./urandom -jar /x1/jenkins/jenkins-slave/workspace/HBase-0.94-security/trunk/target/surefire/surefirebooter5681726516689564661.jar
/x1/jenkins/jenkins-slave/workspace/HBase-0.94-security/trunk/target/surefire/surefire4101985917911416268tmp
/x1/jenkins/jenkins-slave/workspace/HBase-0.94-security/trunk/target/surefire/surefire_1292767788615519563992tmp
Running org.apache.hadoop.hbase.util.TestIdLock
Tests run: 1, Failures: 0, Errors: 0, Skipped: 0, Time elapsed: 15.464 sec
Forking command line: /bin/sh -c cd /x1/jenkins/jenkins-slave/workspace/HBase-0.94-security/trunk
&& /x1/jenkins/tools/java/jdk1.6.0_32-32/jre/bin/java -enableassertions -Xmx1900m
-Djava.security.egd=file:/dev/./urandom -jar /x1/jenkins/jenkins-slave/workspace/HBase-0.94-security/trunk/target/surefire/surefirebooter7839747053702170931.jar
/x1/jenkins/jenkins-slave/workspace/HBase-0.94-security/trunk/target/surefire/surefire85624414230707278tmp
/x1/jenkins/jenkins-slave/workspace/HBase-0.94-security/trunk/target/surefire/surefire_1303824338651907302113tmp
Running org.apache.hadoop.hbase.util.TestMergeTable
Tests run: 1, Failures: 0, Errors: 0, Skipped: 0, Time elapsed: 25.509 sec
Forking command line: /bin/sh -c cd /x1/jenkins/jenkins-slave/workspace/HBase-0.94-security/trunk
&& /x1/jenkins/tools/java/jdk1.6.0_32-32/jre/bin/java -enableassertions -Xmx1900m
-Djava.security.egd=file:/dev/./urandom -jar /x1/jenkins/jenkins-slave/workspace/HBase-0.94-security/trunk/target/surefire/surefirebooter7027573857677131973.jar
/x1/jenkins/jenkins-slave/workspace/HBase-0.94-security/trunk/target/surefire/surefire2761136191893794737tmp
/x1/jenkins/jenkins-slave/workspace/HBase-0.94-security/trunk/target/surefire/surefire_1317427155377351995193tmp
Running org.apache.hadoop.hbase.util.TestPoolMap$TestRoundRobinPoolType
Tests run: 3, Failures: 0, Errors: 0, Skipped: 0, Time elapsed: 0.007 sec
Running org.apache.hadoop.hbase.util.TestPoolMap$TestThreadLocalPoolType
Tests run: 3, Failures: 0, Errors: 0, Skipped: 0, Time elapsed: 0.002 sec
Running org.apache.hadoop.hbase.util.TestPoolMap$TestReusablePoolType
Tests run: 3, Failures: 0, Errors: 0, Skipped: 0, Time elapsed: 0.024 sec
Forking command line: /bin/sh -c cd /x1/jenkins/jenkins-slave/workspace/HBase-0.94-security/trunk
&& /x1/jenkins/tools/java/jdk1.6.0_32-32/jre/bin/java -enableassertions -Xmx1900m
-Djava.security.egd=file:/dev/./urandom -jar /x1/jenkins/jenkins-slave/workspace/HBase-0.94-security/trunk/target/surefire/surefirebooter4161013515968814005.jar
/x1/jenkins/jenkins-slave/workspace/HBase-0.94-security/trunk/target/surefire/surefire8801709234617978863tmp
/x1/jenkins/jenkins-slave/workspace/HBase-0.94-security/trunk/target/surefire/surefire_1327751149383354591195tmp
Running org.apache.hadoop.hbase.util.TestFSUtils
Tests run: 4, Failures: 0, Errors: 0, Skipped: 0, Time elapsed: 19.89 sec
Forking command line: /bin/sh -c cd /x1/jenkins/jenkins-slave/workspace/HBase-0.94-security/trunk
&& /x1/jenkins/tools/java/jdk1.6.0_32-32/jre/bin/java -enableassertions -Xmx1900m
-Djava.security.egd=file:/dev/./urandom -jar /x1/jenkins/jenkins-slave/workspace/HBase-0.94-security/trunk/target/surefire/surefirebooter1703785247060879523.jar
/x1/jenkins/jenkins-slave/workspace/HBase-0.94-security/trunk/target/surefire/surefire3453483728180323739tmp
/x1/jenkins/jenkins-slave/workspace/HBase-0.94-security/trunk/target/surefire/surefire_1331008320329563100023tmp
Running org.apache.hadoop.hbase.util.TestRegionSplitter
Tests run: 5, Failures: 0, Errors: 0, Skipped: 0, Time elapsed: 17.786 sec
Forking command line: /bin/sh -c cd /x1/jenkins/jenkins-slave/workspace/HBase-0.94-security/trunk
&& /x1/jenkins/tools/java/jdk1.6.0_32-32/jre/bin/java -enableassertions -Xmx1900m
-Djava.security.egd=file:/dev/./urandom -jar /x1/jenkins/jenkins-slave/workspace/HBase-0.94-security/trunk/target/surefire/surefirebooter6627138412203985915.jar
/x1/jenkins/jenkins-slave/workspace/HBase-0.94-security/trunk/target/surefire/surefire2539061085963317628tmp
/x1/jenkins/jenkins-slave/workspace/HBase-0.94-security/trunk/target/surefire/surefire_1341909119056976971374tmp
Running org.apache.hadoop.hbase.util.TestCoprocessorScanPolicy
Tests run: 2, Failures: 0, Errors: 0, Skipped: 0, Time elapsed: 14.939 sec
Forking command line: /bin/sh -c cd /x1/jenkins/jenkins-slave/workspace/HBase-0.94-security/trunk
&& /x1/jenkins/tools/java/jdk1.6.0_32-32/jre/bin/java -enableassertions -Xmx1900m
-Djava.security.egd=file:/dev/./urandom -jar /x1/jenkins/jenkins-slave/workspace/HBase-0.94-security/trunk/target/surefire/surefirebooter2264401922796734724.jar
/x1/jenkins/jenkins-slave/workspace/HBase-0.94-security/trunk/target/surefire/surefire7205446269050408757tmp
/x1/jenkins/jenkins-slave/workspace/HBase-0.94-security/trunk/target/surefire/surefire_1357287671388562644682tmp
Running org.apache.hadoop.hbase.util.hbck.TestOfflineMetaRebuildBase
Tests run: 1, Failures: 0, Errors: 0, Skipped: 0, Time elapsed: 25.227 sec
Forking command line: /bin/sh -c cd /x1/jenkins/jenkins-slave/workspace/HBase-0.94-security/trunk
&& /x1/jenkins/tools/java/jdk1.6.0_32-32/jre/bin/java -enableassertions -Xmx1900m
-Djava.security.egd=file:/dev/./urandom -jar /x1/jenkins/jenkins-slave/workspace/HBase-0.94-security/trunk/target/surefire/surefirebooter8509467358239870435.jar
/x1/jenkins/jenkins-slave/workspace/HBase-0.94-security/trunk/target/surefire/surefire8700694846651710847tmp
/x1/jenkins/jenkins-slave/workspace/HBase-0.94-security/trunk/target/surefire/surefire_136997689884394017037tmp
Running org.apache.hadoop.hbase.util.hbck.TestOfflineMetaRebuildOverlap
Tests run: 1, Failures: 0, Errors: 0, Skipped: 0, Time elapsed: 23.919 sec
Forking command line: /bin/sh -c cd /x1/jenkins/jenkins-slave/workspace/HBase-0.94-security/trunk
&& /x1/jenkins/tools/java/jdk1.6.0_32-32/jre/bin/java -enableassertions -Xmx1900m
-Djava.security.egd=file:/dev/./urandom -jar /x1/jenkins/jenkins-slave/workspace/HBase-0.94-security/trunk/target/surefire/surefirebooter692230285770640456.jar
/x1/jenkins/jenkins-slave/workspace/HBase-0.94-security/trunk/target/surefire/surefire559799492816637910tmp
/x1/jenkins/jenkins-slave/workspace/HBase-0.94-security/trunk/target/surefire/surefire_1373089443119413215999tmp
Running org.apache.hadoop.hbase.util.TestDefaultEnvironmentEdge
Tests run: 1, Failures: 0, Errors: 0, Skipped: 0, Time elapsed: 0.264 sec
Forking command line: /bin/sh -c cd /x1/jenkins/jenkins-slave/workspace/HBase-0.94-security/trunk
&& /x1/jenkins/tools/java/jdk1.6.0_32-32/jre/bin/java -enableassertions -Xmx1900m
-Djava.security.egd=file:/dev/./urandom -jar /x1/jenkins/jenkins-slave/workspace/HBase-0.94-security/trunk/target/surefire/surefirebooter809413950136043635.jar
/x1/jenkins/jenkins-slave/workspace/HBase-0.94-security/trunk/target/surefire/surefire6765465763895339374tmp
/x1/jenkins/jenkins-slave/workspace/HBase-0.94-security/trunk/target/surefire/surefire_1387811244309168149427tmp
Running org.apache.hadoop.hbase.util.hbck.TestOfflineMetaRebuildHole
Tests run: 1, Failures: 0, Errors: 0, Skipped: 0, Time elapsed: 23.555 sec
Forking command line: /bin/sh -c cd /x1/jenkins/jenkins-slave/workspace/HBase-0.94-security/trunk
&& /x1/jenkins/tools/java/jdk1.6.0_32-32/jre/bin/java -enableassertions -Xmx1900m
-Djava.security.egd=file:/dev/./urandom -jar /x1/jenkins/jenkins-slave/workspace/HBase-0.94-security/trunk/target/surefire/surefirebooter7934973601199287981.jar
/x1/jenkins/jenkins-slave/workspace/HBase-0.94-security/trunk/target/surefire/surefire1468074546362608957tmp
/x1/jenkins/jenkins-slave/workspace/HBase-0.94-security/trunk/target/surefire/surefire_1397165843546589939709tmp
Running org.apache.hadoop.hbase.TestInfoServers
Tests run: 3, Failures: 0, Errors: 0, Skipped: 0, Time elapsed: 12.664 sec
Running org.apache.hadoop.hbase.util.TestSizeBasedThrottler
Tests run: 3, Failures: 0, Errors: 0, Skipped: 0, Time elapsed: 52.906 sec

Results :

Tests in error: 
  testTableOperations(org.apache.hadoop.hbase.coprocessor.TestMasterObserver): org.apache.hadoop.hbase.InvalidFamilyOperationException:
Column family 'fam2' does not exist(..)
  testRegionTransitionOperations(org.apache.hadoop.hbase.coprocessor.TestMasterObserver):
org.apache.hadoop.hbase.TableExistsException: observed_table

Tests run: 830, Failures: 0, Errors: 2, Skipped: 2

[INFO] ------------------------------------------------------------------------
[INFO] BUILD FAILURE
[INFO] ------------------------------------------------------------------------
[INFO] Total time: 29:27.761s
[INFO] Finished at: Thu Feb 28 07:29:24 UTC 2013
[INFO] Final Memory: 43M/965M
[INFO] ------------------------------------------------------------------------
[ERROR] Failed to execute goal org.apache.maven.plugins:maven-surefire-plugin:2.12-TRUNK-HBASE-2:test
(secondPartTestsExecution) on project hbase: There are test failures.
[ERROR] 
[ERROR] Please refer to /x1/jenkins/jenkins-slave/workspace/HBase-0.94-security/trunk/target/surefire-reports
for the individual test results.
[ERROR] -> [Help 1]
org.apache.maven.lifecycle.LifecycleExecutionException: Failed to execute goal org.apache.maven.plugins:maven-surefire-plugin:2.12-TRUNK-HBASE-2:test
(secondPartTestsExecution) on project hbase: There are test failures.

Please refer to /x1/jenkins/jenkins-slave/workspace/HBase-0.94-security/trunk/target/surefire-reports
for the individual test results.
	at org.apache.maven.lifecycle.internal.MojoExecutor.execute(MojoExecutor.java:213)
	at org.apache.maven.lifecycle.internal.MojoExecutor.execute(MojoExecutor.java:153)
	at org.apache.maven.lifecycle.internal.MojoExecutor.execute(MojoExecutor.java:145)
	at org.apache.maven.lifecycle.internal.MojoExecutor.executeForkedExecutions(MojoExecutor.java:365)
	at org.apache.maven.lifecycle.internal.MojoExecutor.execute(MojoExecutor.java:199)
	at org.apache.maven.lifecycle.internal.MojoExecutor.execute(MojoExecutor.java:153)
	at org.apache.maven.lifecycle.internal.MojoExecutor.execute(MojoExecutor.java:145)
	at org.apache.maven.lifecycle.internal.LifecycleModuleBuilder.buildProject(LifecycleModuleBuilder.java:84)
	at org.apache.maven.lifecycle.internal.LifecycleModuleBuilder.buildProject(LifecycleModuleBuilder.java:59)
	at org.apache.maven.lifecycle.internal.LifecycleStarter.singleThreadedBuild(LifecycleStarter.java:183)
	at org.apache.maven.lifecycle.internal.LifecycleStarter.execute(LifecycleStarter.java:161)
	at org.apache.maven.DefaultMaven.doExecute(DefaultMaven.java:320)
	at org.apache.maven.DefaultMaven.execute(DefaultMaven.java:156)
	at org.apache.maven.cli.MavenCli.execute(MavenCli.java:537)
	at org.apache.maven.cli.MavenCli.doMain(MavenCli.java:196)
	at org.apache.maven.cli.MavenCli.main(MavenCli.java:141)
	at sun.reflect.NativeMethodAccessorImpl.invoke0(Native Method)
	at sun.reflect.NativeMethodAccessorImpl.invoke(NativeMethodAccessorImpl.java:39)
	at sun.reflect.DelegatingMethodAccessorImpl.invoke(DelegatingMethodAccessorImpl.java:25)
	at java.lang.reflect.Method.invoke(Method.java:597)
	at org.codehaus.plexus.classworlds.launcher.Launcher.launchEnhanced(Launcher.java:290)
	at org.codehaus.plexus.classworlds.launcher.Launcher.launch(Launcher.java:230)
	at org.codehaus.plexus.classworlds.launcher.Launcher.mainWithExitCode(Launcher.java:409)
	at org.codehaus.plexus.classworlds.launcher.Launcher.main(Launcher.java:352)
Caused by: org.apache.maven.plugin.MojoFailureException: There are test failures.

Please refer to /x1/jenkins/jenkins-slave/workspace/HBase-0.94-security/trunk/target/surefire-reports
for the individual test results.
	at org.apache.maven.plugin.surefire.SurefireHelper.reportExecution(SurefireHelper.java:87)
	at org.apache.maven.plugin.surefire.SurefirePlugin.writeSummary(SurefirePlugin.java:651)
	at org.apache.maven.plugin.surefire.SurefirePlugin.handleSummary(SurefirePlugin.java:625)
	at org.apache.maven.plugin.surefire.AbstractSurefireMojo.executeAfterPreconditionsChecked(AbstractSurefireMojo.java:137)
	at org.apache.maven.plugin.surefire.AbstractSurefireMojo.execute(AbstractSurefireMojo.java:98)
	at org.apache.maven.plugin.DefaultBuildPluginManager.executeMojo(DefaultBuildPluginManager.java:101)
	at org.apache.maven.lifecycle.internal.MojoExecutor.execute(MojoExecutor.java:209)
	... 23 more
[ERROR] 
[ERROR] 
[ERROR] For more information about the errors and possible solutions, please read the following
articles:
[ERROR] [Help 1] http://cwiki.apache.org/confluence/display/MAVEN/MojoFailureException
Build step 'Invoke top-level Maven targets' marked build as failure
Archiving artifacts
Updating HBASE-7777
Updating HBASE-4210
Updating HBASE-7929
Updating HBASE-7725
Updating HBASE-7507
Updating HBASE-7883
Updating HBASE-7878
Updating HBASE-7944
Updating HBASE-7945
Recording test results

Mime
View raw message