hbase-dev mailing list archives

Site index · List index
Message view « Date » · « Thread »
Top « Date » · « Thread »
From Apache Jenkins Server <jenk...@builds.apache.org>
Subject Build failed in Jenkins: HBase-0.94-security #107
Date Wed, 06 Feb 2013 05:19:10 GMT
See <https://builds.apache.org/job/HBase-0.94-security/107/changes>

Changes:

[tedyu] HBASE-7771 Secure HBase Client in MR job causes tasks to wait forever (Francis and
Matteo)

[enis] HBASE-7748. Add DelimitedKeyPrefixRegionSplitPolicy

------------------------------------------
[...truncated 8459 lines...]
Running org.apache.hadoop.hbase.regionserver.handler.TestCloseRegionHandler
Tests run: 3, Failures: 0, Errors: 0, Skipped: 0, Time elapsed: 0.968 sec
Forking command line: /bin/sh -c cd /x1/jenkins/jenkins-slave/workspace/HBase-0.94-security/trunk
&& /x1/jenkins/tools/java/jdk1.6.0_32-32/jre/bin/java -enableassertions -Xmx1900m
-Djava.security.egd=file:/dev/./urandom -jar /x1/jenkins/jenkins-slave/workspace/HBase-0.94-security/trunk/target/surefire/surefirebooter4290980087139932564.jar
/x1/jenkins/jenkins-slave/workspace/HBase-0.94-security/trunk/target/surefire/surefire4838856937484450497tmp
/x1/jenkins/jenkins-slave/workspace/HBase-0.94-security/trunk/target/surefire/surefire_826145888545667040718tmp
Running org.apache.hadoop.hbase.regionserver.TestSeekOptimizations
Tests run: 6, Failures: 0, Errors: 0, Skipped: 0, Time elapsed: 2.039 sec
Forking command line: /bin/sh -c cd /x1/jenkins/jenkins-slave/workspace/HBase-0.94-security/trunk
&& /x1/jenkins/tools/java/jdk1.6.0_32-32/jre/bin/java -enableassertions -Xmx1900m
-Djava.security.egd=file:/dev/./urandom -jar /x1/jenkins/jenkins-slave/workspace/HBase-0.94-security/trunk/target/surefire/surefirebooter4677288296798294139.jar
/x1/jenkins/jenkins-slave/workspace/HBase-0.94-security/trunk/target/surefire/surefire8631931950364136450tmp
/x1/jenkins/jenkins-slave/workspace/HBase-0.94-security/trunk/target/surefire/surefire_831693311414714454405tmp
Running org.apache.hadoop.hbase.regionserver.handler.TestOpenRegionHandler
Tests run: 3, Failures: 0, Errors: 0, Skipped: 0, Time elapsed: 0.776 sec
Forking command line: /bin/sh -c cd /x1/jenkins/jenkins-slave/workspace/HBase-0.94-security/trunk
&& /x1/jenkins/tools/java/jdk1.6.0_32-32/jre/bin/java -enableassertions -Xmx1900m
-Djava.security.egd=file:/dev/./urandom -jar /x1/jenkins/jenkins-slave/workspace/HBase-0.94-security/trunk/target/surefire/surefirebooter523595916999522186.jar
/x1/jenkins/jenkins-slave/workspace/HBase-0.94-security/trunk/target/surefire/surefire8999463056896697036tmp
/x1/jenkins/jenkins-slave/workspace/HBase-0.94-security/trunk/target/surefire/surefire_841235262455819177007tmp
Running org.apache.hadoop.hbase.regionserver.TestBlocksRead
Tests run: 4, Failures: 0, Errors: 0, Skipped: 0, Time elapsed: 0.764 sec
Forking command line: /bin/sh -c cd /x1/jenkins/jenkins-slave/workspace/HBase-0.94-security/trunk
&& /x1/jenkins/tools/java/jdk1.6.0_32-32/jre/bin/java -enableassertions -Xmx1900m
-Djava.security.egd=file:/dev/./urandom -jar /x1/jenkins/jenkins-slave/workspace/HBase-0.94-security/trunk/target/surefire/surefirebooter3860074041476380614.jar
/x1/jenkins/jenkins-slave/workspace/HBase-0.94-security/trunk/target/surefire/surefire5511285616007668549tmp
/x1/jenkins/jenkins-slave/workspace/HBase-0.94-security/trunk/target/surefire/surefire_854491911462993206901tmp
Running org.apache.hadoop.hbase.regionserver.TestStoreScanner
Tests run: 16, Failures: 0, Errors: 0, Skipped: 0, Time elapsed: 0.037 sec
Forking command line: /bin/sh -c cd /x1/jenkins/jenkins-slave/workspace/HBase-0.94-security/trunk
&& /x1/jenkins/tools/java/jdk1.6.0_32-32/jre/bin/java -enableassertions -Xmx1900m
-Djava.security.egd=file:/dev/./urandom -jar /x1/jenkins/jenkins-slave/workspace/HBase-0.94-security/trunk/target/surefire/surefirebooter1172468801563155500.jar
/x1/jenkins/jenkins-slave/workspace/HBase-0.94-security/trunk/target/surefire/surefire5710579606102520725tmp
/x1/jenkins/jenkins-slave/workspace/HBase-0.94-security/trunk/target/surefire/surefire_862799818371387961919tmp
Running org.apache.hadoop.hbase.regionserver.TestSplitLogWorker
Tests run: 5, Failures: 0, Errors: 0, Skipped: 0, Time elapsed: 2.607 sec
Forking command line: /bin/sh -c cd /x1/jenkins/jenkins-slave/workspace/HBase-0.94-security/trunk
&& /x1/jenkins/tools/java/jdk1.6.0_32-32/jre/bin/java -enableassertions -Xmx1900m
-Djava.security.egd=file:/dev/./urandom -jar /x1/jenkins/jenkins-slave/workspace/HBase-0.94-security/trunk/target/surefire/surefirebooter5459872283211403764.jar
/x1/jenkins/jenkins-slave/workspace/HBase-0.94-security/trunk/target/surefire/surefire6963472143964351677tmp
/x1/jenkins/jenkins-slave/workspace/HBase-0.94-security/trunk/target/surefire/surefire_874689441562010976665tmp
Running org.apache.hadoop.hbase.regionserver.metrics.TestSchemaMetrics
Tests run: 6, Failures: 0, Errors: 0, Skipped: 0, Time elapsed: 11.419 sec
Forking command line: /bin/sh -c cd /x1/jenkins/jenkins-slave/workspace/HBase-0.94-security/trunk
&& /x1/jenkins/tools/java/jdk1.6.0_32-32/jre/bin/java -enableassertions -Xmx1900m
-Djava.security.egd=file:/dev/./urandom -jar /x1/jenkins/jenkins-slave/workspace/HBase-0.94-security/trunk/target/surefire/surefirebooter5497547246976975972.jar
/x1/jenkins/jenkins-slave/workspace/HBase-0.94-security/trunk/target/surefire/surefire5794354787367370672tmp
/x1/jenkins/jenkins-slave/workspace/HBase-0.94-security/trunk/target/surefire/surefire_882230964269721375978tmp
Running org.apache.hadoop.hbase.regionserver.TestStoreFileBlockCacheSummary
Tests run: 1, Failures: 0, Errors: 0, Skipped: 0, Time elapsed: 13.248 sec
Forking command line: /bin/sh -c cd /x1/jenkins/jenkins-slave/workspace/HBase-0.94-security/trunk
&& /x1/jenkins/tools/java/jdk1.6.0_32-32/jre/bin/java -enableassertions -Xmx1900m
-Djava.security.egd=file:/dev/./urandom -jar /x1/jenkins/jenkins-slave/workspace/HBase-0.94-security/trunk/target/surefire/surefirebooter3135386830582870691.jar
/x1/jenkins/jenkins-slave/workspace/HBase-0.94-security/trunk/target/surefire/surefire1556092820545873307tmp
/x1/jenkins/jenkins-slave/workspace/HBase-0.94-security/trunk/target/surefire/surefire_898759225718212153754tmp
Running org.apache.hadoop.hbase.regionserver.TestMasterAddressManager
Tests run: 1, Failures: 0, Errors: 0, Skipped: 0, Time elapsed: 0.501 sec
Forking command line: /bin/sh -c cd /x1/jenkins/jenkins-slave/workspace/HBase-0.94-security/trunk
&& /x1/jenkins/tools/java/jdk1.6.0_32-32/jre/bin/java -enableassertions -Xmx1900m
-Djava.security.egd=file:/dev/./urandom -jar /x1/jenkins/jenkins-slave/workspace/HBase-0.94-security/trunk/target/surefire/surefirebooter2523853005260970231.jar
/x1/jenkins/jenkins-slave/workspace/HBase-0.94-security/trunk/target/surefire/surefire549458231366704236tmp
/x1/jenkins/jenkins-slave/workspace/HBase-0.94-security/trunk/target/surefire/surefire_905775533944019373720tmp
Running org.apache.hadoop.hbase.regionserver.TestMultiColumnScanner
Tests run: 12, Failures: 0, Errors: 0, Skipped: 0, Time elapsed: 27.727 sec
Forking command line: /bin/sh -c cd /x1/jenkins/jenkins-slave/workspace/HBase-0.94-security/trunk
&& /x1/jenkins/tools/java/jdk1.6.0_32-32/jre/bin/java -enableassertions -Xmx1900m
-Djava.security.egd=file:/dev/./urandom -jar /x1/jenkins/jenkins-slave/workspace/HBase-0.94-security/trunk/target/surefire/surefirebooter6940250874891148295.jar
/x1/jenkins/jenkins-slave/workspace/HBase-0.94-security/trunk/target/surefire/surefire3543409101671092577tmp
/x1/jenkins/jenkins-slave/workspace/HBase-0.94-security/trunk/target/surefire/surefire_915834858926706556034tmp
Running org.apache.hadoop.hbase.regionserver.TestHRegion
Tests run: 73, Failures: 0, Errors: 0, Skipped: 0, Time elapsed: 37.814 sec
Forking command line: /bin/sh -c cd /x1/jenkins/jenkins-slave/workspace/HBase-0.94-security/trunk
&& /x1/jenkins/tools/java/jdk1.6.0_32-32/jre/bin/java -enableassertions -Xmx1900m
-Djava.security.egd=file:/dev/./urandom -jar /x1/jenkins/jenkins-slave/workspace/HBase-0.94-security/trunk/target/surefire/surefirebooter3409425786213164943.jar
/x1/jenkins/jenkins-slave/workspace/HBase-0.94-security/trunk/target/surefire/surefire1853891721457681163tmp
/x1/jenkins/jenkins-slave/workspace/HBase-0.94-security/trunk/target/surefire/surefire_928900411385340428153tmp
Running org.apache.hadoop.hbase.TestLocalHBaseCluster
Tests run: 1, Failures: 0, Errors: 0, Skipped: 0, Time elapsed: 8.378 sec
Forking command line: /bin/sh -c cd /x1/jenkins/jenkins-slave/workspace/HBase-0.94-security/trunk
&& /x1/jenkins/tools/java/jdk1.6.0_32-32/jre/bin/java -enableassertions -Xmx1900m
-Djava.security.egd=file:/dev/./urandom -jar /x1/jenkins/jenkins-slave/workspace/HBase-0.94-security/trunk/target/surefire/surefirebooter8896212054113690061.jar
/x1/jenkins/jenkins-slave/workspace/HBase-0.94-security/trunk/target/surefire/surefire7099046131019241538tmp
/x1/jenkins/jenkins-slave/workspace/HBase-0.94-security/trunk/target/surefire/surefire_93828190059390675291tmp
Running org.apache.hadoop.hbase.ipc.TestDelayedRpc
Tests run: 4, Failures: 0, Errors: 0, Skipped: 0, Time elapsed: 2.587 sec
Forking command line: /bin/sh -c cd /x1/jenkins/jenkins-slave/workspace/HBase-0.94-security/trunk
&& /x1/jenkins/tools/java/jdk1.6.0_32-32/jre/bin/java -enableassertions -Xmx1900m
-Djava.security.egd=file:/dev/./urandom -jar /x1/jenkins/jenkins-slave/workspace/HBase-0.94-security/trunk/target/surefire/surefirebooter1221796064416474781.jar
/x1/jenkins/jenkins-slave/workspace/HBase-0.94-security/trunk/target/surefire/surefire8691868052607954220tmp
/x1/jenkins/jenkins-slave/workspace/HBase-0.94-security/trunk/target/surefire/surefire_945676699063439605763tmp
Running org.apache.hadoop.hbase.ipc.TestPBOnWritableRpc
Tests run: 1, Failures: 0, Errors: 0, Skipped: 0, Time elapsed: 0.724 sec
Forking command line: /bin/sh -c cd /x1/jenkins/jenkins-slave/workspace/HBase-0.94-security/trunk
&& /x1/jenkins/tools/java/jdk1.6.0_32-32/jre/bin/java -enableassertions -Xmx1900m
-Djava.security.egd=file:/dev/./urandom -jar /x1/jenkins/jenkins-slave/workspace/HBase-0.94-security/trunk/target/surefire/surefirebooter3495871086887609216.jar
/x1/jenkins/jenkins-slave/workspace/HBase-0.94-security/trunk/target/surefire/surefire2057812580404013574tmp
/x1/jenkins/jenkins-slave/workspace/HBase-0.94-security/trunk/target/surefire/surefire_951939303377874284103tmp
Running org.apache.hadoop.hbase.TestGlobalMemStoreSize
Tests run: 1, Failures: 0, Errors: 0, Skipped: 0, Time elapsed: 15.992 sec
Forking command line: /bin/sh -c cd /x1/jenkins/jenkins-slave/workspace/HBase-0.94-security/trunk
&& /x1/jenkins/tools/java/jdk1.6.0_32-32/jre/bin/java -enableassertions -Xmx1900m
-Djava.security.egd=file:/dev/./urandom -jar /x1/jenkins/jenkins-slave/workspace/HBase-0.94-security/trunk/target/surefire/surefirebooter4197687701423018791.jar
/x1/jenkins/jenkins-slave/workspace/HBase-0.94-security/trunk/target/surefire/surefire503684512765709328tmp
/x1/jenkins/jenkins-slave/workspace/HBase-0.94-security/trunk/target/surefire/surefire_961199399640278426796tmp
Running org.apache.hadoop.hbase.constraint.TestConstraint
Tests run: 5, Failures: 0, Errors: 0, Skipped: 0, Time elapsed: 25.446 sec
Forking command line: /bin/sh -c cd /x1/jenkins/jenkins-slave/workspace/HBase-0.94-security/trunk
&& /x1/jenkins/tools/java/jdk1.6.0_32-32/jre/bin/java -enableassertions -Xmx1900m
-Djava.security.egd=file:/dev/./urandom -jar /x1/jenkins/jenkins-slave/workspace/HBase-0.94-security/trunk/target/surefire/surefirebooter7806390992699829215.jar
/x1/jenkins/jenkins-slave/workspace/HBase-0.94-security/trunk/target/surefire/surefire2650893439294702821tmp
/x1/jenkins/jenkins-slave/workspace/HBase-0.94-security/trunk/target/surefire/surefire_97960852342342914546tmp
Running org.apache.hadoop.hbase.rest.TestSchemaResource
Tests run: 2, Failures: 0, Errors: 0, Skipped: 0, Time elapsed: 17.978 sec
Forking command line: /bin/sh -c cd /x1/jenkins/jenkins-slave/workspace/HBase-0.94-security/trunk
&& /x1/jenkins/tools/java/jdk1.6.0_32-32/jre/bin/java -enableassertions -Xmx1900m
-Djava.security.egd=file:/dev/./urandom -jar /x1/jenkins/jenkins-slave/workspace/HBase-0.94-security/trunk/target/surefire/surefirebooter3157510900478550205.jar
/x1/jenkins/jenkins-slave/workspace/HBase-0.94-security/trunk/target/surefire/surefire4132639241195597865tmp
/x1/jenkins/jenkins-slave/workspace/HBase-0.94-security/trunk/target/surefire/surefire_98964537819000205637tmp
Running org.apache.hadoop.hbase.rest.client.TestRemoteAdmin
Tests run: 1, Failures: 0, Errors: 0, Skipped: 0, Time elapsed: 14.158 sec
Forking command line: /bin/sh -c cd /x1/jenkins/jenkins-slave/workspace/HBase-0.94-security/trunk
&& /x1/jenkins/tools/java/jdk1.6.0_32-32/jre/bin/java -enableassertions -Xmx1900m
-Djava.security.egd=file:/dev/./urandom -jar /x1/jenkins/jenkins-slave/workspace/HBase-0.94-security/trunk/target/surefire/surefirebooter61505574659059159.jar
/x1/jenkins/jenkins-slave/workspace/HBase-0.94-security/trunk/target/surefire/surefire1172660806989192119tmp
/x1/jenkins/jenkins-slave/workspace/HBase-0.94-security/trunk/target/surefire/surefire_999072520841434766626tmp
Running org.apache.hadoop.hbase.rest.client.TestRemoteTable
Tests run: 4, Failures: 0, Errors: 0, Skipped: 0, Time elapsed: 12.961 sec
Forking command line: /bin/sh -c cd /x1/jenkins/jenkins-slave/workspace/HBase-0.94-security/trunk
&& /x1/jenkins/tools/java/jdk1.6.0_32-32/jre/bin/java -enableassertions -Xmx1900m
-Djava.security.egd=file:/dev/./urandom -jar /x1/jenkins/jenkins-slave/workspace/HBase-0.94-security/trunk/target/surefire/surefirebooter3020401086835472897.jar
/x1/jenkins/jenkins-slave/workspace/HBase-0.94-security/trunk/target/surefire/surefire1478289611426712016tmp
/x1/jenkins/jenkins-slave/workspace/HBase-0.94-security/trunk/target/surefire/surefire_1001040014627772543439tmp
Running org.apache.hadoop.hbase.backup.TestHFileArchiving
Tests run: 5, Failures: 0, Errors: 0, Skipped: 0, Time elapsed: 133.458 sec
Forking command line: /bin/sh -c cd /x1/jenkins/jenkins-slave/workspace/HBase-0.94-security/trunk
&& /x1/jenkins/tools/java/jdk1.6.0_32-32/jre/bin/java -enableassertions -Xmx1900m
-Djava.security.egd=file:/dev/./urandom -jar /x1/jenkins/jenkins-slave/workspace/HBase-0.94-security/trunk/target/surefire/surefirebooter7686247321278969890.jar
/x1/jenkins/jenkins-slave/workspace/HBase-0.94-security/trunk/target/surefire/surefire5690155771105927914tmp
/x1/jenkins/jenkins-slave/workspace/HBase-0.94-security/trunk/target/surefire/surefire_1017289363702016880871tmp
Running org.apache.hadoop.hbase.rest.TestTableResource
Tests run: 8, Failures: 0, Errors: 0, Skipped: 0, Time elapsed: 21.423 sec
Forking command line: /bin/sh -c cd /x1/jenkins/jenkins-slave/workspace/HBase-0.94-security/trunk
&& /x1/jenkins/tools/java/jdk1.6.0_32-32/jre/bin/java -enableassertions -Xmx1900m
-Djava.security.egd=file:/dev/./urandom -jar /x1/jenkins/jenkins-slave/workspace/HBase-0.94-security/trunk/target/surefire/surefirebooter7264591738647703588.jar
/x1/jenkins/jenkins-slave/workspace/HBase-0.94-security/trunk/target/surefire/surefire4516938385627393619tmp
/x1/jenkins/jenkins-slave/workspace/HBase-0.94-security/trunk/target/surefire/surefire_1027122044741875578237tmp
Running org.apache.hadoop.hbase.rest.TestMultiRowResource
Tests run: 3, Failures: 0, Errors: 0, Skipped: 0, Time elapsed: 12.38 sec
Forking command line: /bin/sh -c cd /x1/jenkins/jenkins-slave/workspace/HBase-0.94-security/trunk
&& /x1/jenkins/tools/java/jdk1.6.0_32-32/jre/bin/java -enableassertions -Xmx1900m
-Djava.security.egd=file:/dev/./urandom -jar /x1/jenkins/jenkins-slave/workspace/HBase-0.94-security/trunk/target/surefire/surefirebooter1451599537275097203.jar
/x1/jenkins/jenkins-slave/workspace/HBase-0.94-security/trunk/target/surefire/surefire3443213986773077555tmp
/x1/jenkins/jenkins-slave/workspace/HBase-0.94-security/trunk/target/surefire/surefire_1033663744804811027000tmp
Running org.apache.hadoop.hbase.rest.TestGzipFilter
Tests run: 3, Failures: 0, Errors: 0, Skipped: 0, Time elapsed: 11.757 sec
Forking command line: /bin/sh -c cd /x1/jenkins/jenkins-slave/workspace/HBase-0.94-security/trunk
&& /x1/jenkins/tools/java/jdk1.6.0_32-32/jre/bin/java -enableassertions -Xmx1900m
-Djava.security.egd=file:/dev/./urandom -jar /x1/jenkins/jenkins-slave/workspace/HBase-0.94-security/trunk/target/surefire/surefirebooter7057057352861381367.jar
/x1/jenkins/jenkins-slave/workspace/HBase-0.94-security/trunk/target/surefire/surefire6212731531752081835tmp
/x1/jenkins/jenkins-slave/workspace/HBase-0.94-security/trunk/target/surefire/surefire_1045397021230251592277tmp
Running org.apache.hadoop.hbase.rest.TestRowResource
Tests run: 11, Failures: 0, Errors: 0, Skipped: 0, Time elapsed: 14.713 sec
Forking command line: /bin/sh -c cd /x1/jenkins/jenkins-slave/workspace/HBase-0.94-security/trunk
&& /x1/jenkins/tools/java/jdk1.6.0_32-32/jre/bin/java -enableassertions -Xmx1900m
-Djava.security.egd=file:/dev/./urandom -jar /x1/jenkins/jenkins-slave/workspace/HBase-0.94-security/trunk/target/surefire/surefirebooter793916679337027303.jar
/x1/jenkins/jenkins-slave/workspace/HBase-0.94-security/trunk/target/surefire/surefire2279819542759416123tmp
/x1/jenkins/jenkins-slave/workspace/HBase-0.94-security/trunk/target/surefire/surefire_1054048419921081962879tmp
Running org.apache.hadoop.hbase.rest.TestVersionResource
Tests run: 7, Failures: 0, Errors: 0, Skipped: 0, Time elapsed: 12.125 sec
Forking command line: /bin/sh -c cd /x1/jenkins/jenkins-slave/workspace/HBase-0.94-security/trunk
&& /x1/jenkins/tools/java/jdk1.6.0_32-32/jre/bin/java -enableassertions -Xmx1900m
-Djava.security.egd=file:/dev/./urandom -jar /x1/jenkins/jenkins-slave/workspace/HBase-0.94-security/trunk/target/surefire/surefirebooter4656170397097486965.jar
/x1/jenkins/jenkins-slave/workspace/HBase-0.94-security/trunk/target/surefire/surefire3287956567220826715tmp
/x1/jenkins/jenkins-slave/workspace/HBase-0.94-security/trunk/target/surefire/surefire_1065513891156054384575tmp
Running org.apache.hadoop.hbase.rest.TestScannerResource
Tests run: 5, Failures: 0, Errors: 0, Skipped: 0, Time elapsed: 25.664 sec
Forking command line: /bin/sh -c cd /x1/jenkins/jenkins-slave/workspace/HBase-0.94-security/trunk
&& /x1/jenkins/tools/java/jdk1.6.0_32-32/jre/bin/java -enableassertions -Xmx1900m
-Djava.security.egd=file:/dev/./urandom -jar /x1/jenkins/jenkins-slave/workspace/HBase-0.94-security/trunk/target/surefire/surefirebooter1745474558136553892.jar
/x1/jenkins/jenkins-slave/workspace/HBase-0.94-security/trunk/target/surefire/surefire2474850566139119893tmp
/x1/jenkins/jenkins-slave/workspace/HBase-0.94-security/trunk/target/surefire/surefire_1074289948477815524844tmp
Running org.apache.hadoop.hbase.rest.TestStatusResource
Tests run: 2, Failures: 0, Errors: 0, Skipped: 0, Time elapsed: 11.275 sec
Forking command line: /bin/sh -c cd /x1/jenkins/jenkins-slave/workspace/HBase-0.94-security/trunk
&& /x1/jenkins/tools/java/jdk1.6.0_32-32/jre/bin/java -enableassertions -Xmx1900m
-Djava.security.egd=file:/dev/./urandom -jar /x1/jenkins/jenkins-slave/workspace/HBase-0.94-security/trunk/target/surefire/surefirebooter4613863792175570296.jar
/x1/jenkins/jenkins-slave/workspace/HBase-0.94-security/trunk/target/surefire/surefire7037817364568808262tmp
/x1/jenkins/jenkins-slave/workspace/HBase-0.94-security/trunk/target/surefire/surefire_108401591917659115566tmp
Running org.apache.hadoop.hbase.metrics.TestMetricsMBeanBase
Tests run: 3, Failures: 0, Errors: 0, Skipped: 0, Time elapsed: 1.237 sec
Forking command line: /bin/sh -c cd /x1/jenkins/jenkins-slave/workspace/HBase-0.94-security/trunk
&& /x1/jenkins/tools/java/jdk1.6.0_32-32/jre/bin/java -enableassertions -Xmx1900m
-Djava.security.egd=file:/dev/./urandom -jar /x1/jenkins/jenkins-slave/workspace/HBase-0.94-security/trunk/target/surefire/surefirebooter815852415473208781.jar
/x1/jenkins/jenkins-slave/workspace/HBase-0.94-security/trunk/target/surefire/surefire2554483472893443724tmp
/x1/jenkins/jenkins-slave/workspace/HBase-0.94-security/trunk/target/surefire/surefire_1095057695636200005879tmp
Running org.apache.hadoop.hbase.rest.TestScannersWithFilters
Tests run: 10, Failures: 0, Errors: 0, Skipped: 0, Time elapsed: 15.935 sec
Forking command line: /bin/sh -c cd /x1/jenkins/jenkins-slave/workspace/HBase-0.94-security/trunk
&& /x1/jenkins/tools/java/jdk1.6.0_32-32/jre/bin/java -enableassertions -Xmx1900m
-Djava.security.egd=file:/dev/./urandom -jar /x1/jenkins/jenkins-slave/workspace/HBase-0.94-security/trunk/target/surefire/surefirebooter6504071506877333581.jar
/x1/jenkins/jenkins-slave/workspace/HBase-0.94-security/trunk/target/surefire/surefire487990281626329016tmp
/x1/jenkins/jenkins-slave/workspace/HBase-0.94-security/trunk/target/surefire/surefire_110300560996257992087tmp
Running org.apache.hadoop.hbase.io.hfile.TestHFileBlockIndex
Tests run: 10, Failures: 0, Errors: 0, Skipped: 0, Time elapsed: 6.661 sec
Forking command line: /bin/sh -c cd /x1/jenkins/jenkins-slave/workspace/HBase-0.94-security/trunk
&& /x1/jenkins/tools/java/jdk1.6.0_32-32/jre/bin/java -enableassertions -Xmx1900m
-Djava.security.egd=file:/dev/./urandom -jar /x1/jenkins/jenkins-slave/workspace/HBase-0.94-security/trunk/target/surefire/surefirebooter7146221542012943924.jar
/x1/jenkins/jenkins-slave/workspace/HBase-0.94-security/trunk/target/surefire/surefire800060969822317859tmp
/x1/jenkins/jenkins-slave/workspace/HBase-0.94-security/trunk/target/surefire/surefire_1118792814738529235492tmp
Running org.apache.hadoop.hbase.io.hfile.TestLruBlockCache
Tests run: 16, Failures: 0, Errors: 0, Skipped: 0, Time elapsed: 0.838 sec
Forking command line: /bin/sh -c cd /x1/jenkins/jenkins-slave/workspace/HBase-0.94-security/trunk
&& /x1/jenkins/tools/java/jdk1.6.0_32-32/jre/bin/java -enableassertions -Xmx1900m
-Djava.security.egd=file:/dev/./urandom -jar /x1/jenkins/jenkins-slave/workspace/HBase-0.94-security/trunk/target/surefire/surefirebooter1279493270005660715.jar
/x1/jenkins/jenkins-slave/workspace/HBase-0.94-security/trunk/target/surefire/surefire1666819930368571632tmp
/x1/jenkins/jenkins-slave/workspace/HBase-0.94-security/trunk/target/surefire/surefire_112243821878206586778tmp
Running org.apache.hadoop.hbase.io.hfile.TestHFileSeek
Tests run: 1, Failures: 0, Errors: 0, Skipped: 0, Time elapsed: 4.18 sec
Forking command line: /bin/sh -c cd /x1/jenkins/jenkins-slave/workspace/HBase-0.94-security/trunk
&& /x1/jenkins/tools/java/jdk1.6.0_32-32/jre/bin/java -enableassertions -Xmx1900m
-Djava.security.egd=file:/dev/./urandom -jar /x1/jenkins/jenkins-slave/workspace/HBase-0.94-security/trunk/target/surefire/surefirebooter4618215707718292333.jar
/x1/jenkins/jenkins-slave/workspace/HBase-0.94-security/trunk/target/surefire/surefire1023304222448177313tmp
/x1/jenkins/jenkins-slave/workspace/HBase-0.94-security/trunk/target/surefire/surefire_1137385975464235213471tmp
Running org.apache.hadoop.hbase.io.hfile.TestFixedFileTrailer
Tests run: 2, Failures: 0, Errors: 0, Skipped: 0, Time elapsed: 0.403 sec
Forking command line: /bin/sh -c cd /x1/jenkins/jenkins-slave/workspace/HBase-0.94-security/trunk
&& /x1/jenkins/tools/java/jdk1.6.0_32-32/jre/bin/java -enableassertions -Xmx1900m
-Djava.security.egd=file:/dev/./urandom -jar /x1/jenkins/jenkins-slave/workspace/HBase-0.94-security/trunk/target/surefire/surefirebooter766356879104971113.jar
/x1/jenkins/jenkins-slave/workspace/HBase-0.94-security/trunk/target/surefire/surefire7757290620585845096tmp
/x1/jenkins/jenkins-slave/workspace/HBase-0.94-security/trunk/target/surefire/surefire_1147008872886559709869tmp
Running org.apache.hadoop.hbase.io.hfile.TestHFilePerformance
Tests run: 1, Failures: 0, Errors: 0, Skipped: 0, Time elapsed: 4.052 sec
Forking command line: /bin/sh -c cd /x1/jenkins/jenkins-slave/workspace/HBase-0.94-security/trunk
&& /x1/jenkins/tools/java/jdk1.6.0_32-32/jre/bin/java -enableassertions -Xmx1900m
-Djava.security.egd=file:/dev/./urandom -jar /x1/jenkins/jenkins-slave/workspace/HBase-0.94-security/trunk/target/surefire/surefirebooter8591196165355113098.jar
/x1/jenkins/jenkins-slave/workspace/HBase-0.94-security/trunk/target/surefire/surefire5031011266200522289tmp
/x1/jenkins/jenkins-slave/workspace/HBase-0.94-security/trunk/target/surefire/surefire_115571851510350288146tmp
Running org.apache.hadoop.hbase.io.hfile.TestHFileBlockCompatibility
Tests run: 10, Failures: 0, Errors: 0, Skipped: 0, Time elapsed: 0.816 sec
Forking command line: /bin/sh -c cd /x1/jenkins/jenkins-slave/workspace/HBase-0.94-security/trunk
&& /x1/jenkins/tools/java/jdk1.6.0_32-32/jre/bin/java -enableassertions -Xmx1900m
-Djava.security.egd=file:/dev/./urandom -jar /x1/jenkins/jenkins-slave/workspace/HBase-0.94-security/trunk/target/surefire/surefirebooter1546230279798329864.jar
/x1/jenkins/jenkins-slave/workspace/HBase-0.94-security/trunk/target/surefire/surefire4751758422012741837tmp
/x1/jenkins/jenkins-slave/workspace/HBase-0.94-security/trunk/target/surefire/surefire_1168697136845590639532tmp
Running org.apache.hadoop.hbase.io.hfile.TestCacheOnWrite
Tests run: 36, Failures: 0, Errors: 0, Skipped: 0, Time elapsed: 23.625 sec
Forking command line: /bin/sh -c cd /x1/jenkins/jenkins-slave/workspace/HBase-0.94-security/trunk
&& /x1/jenkins/tools/java/jdk1.6.0_32-32/jre/bin/java -enableassertions -Xmx1900m
-Djava.security.egd=file:/dev/./urandom -jar /x1/jenkins/jenkins-slave/workspace/HBase-0.94-security/trunk/target/surefire/surefirebooter6307830194591762641.jar
/x1/jenkins/jenkins-slave/workspace/HBase-0.94-security/trunk/target/surefire/surefire1039795173934819049tmp
/x1/jenkins/jenkins-slave/workspace/HBase-0.94-security/trunk/target/surefire/surefire_1175971266657684853078tmp
Running org.apache.hadoop.hbase.io.hfile.TestChecksum
Tests run: 3, Failures: 0, Errors: 0, Skipped: 0, Time elapsed: 0.599 sec
Forking command line: /bin/sh -c cd /x1/jenkins/jenkins-slave/workspace/HBase-0.94-security/trunk
&& /x1/jenkins/tools/java/jdk1.6.0_32-32/jre/bin/java -enableassertions -Xmx1900m
-Djava.security.egd=file:/dev/./urandom -jar /x1/jenkins/jenkins-slave/workspace/HBase-0.94-security/trunk/target/surefire/surefirebooter6159066379313965054.jar
/x1/jenkins/jenkins-slave/workspace/HBase-0.94-security/trunk/target/surefire/surefire8928866203338340279tmp
/x1/jenkins/jenkins-slave/workspace/HBase-0.94-security/trunk/target/surefire/surefire_1181556266079772239456tmp
Running org.apache.hadoop.hbase.io.hfile.TestForceCacheImportantBlocks
Tests run: 4, Failures: 0, Errors: 0, Skipped: 0, Time elapsed: 33.377 sec
Forking command line: /bin/sh -c cd /x1/jenkins/jenkins-slave/workspace/HBase-0.94-security/trunk
&& /x1/jenkins/tools/java/jdk1.6.0_32-32/jre/bin/java -enableassertions -Xmx1900m
-Djava.security.egd=file:/dev/./urandom -jar /x1/jenkins/jenkins-slave/workspace/HBase-0.94-security/trunk/target/surefire/surefirebooter3200363859558193858.jar
/x1/jenkins/jenkins-slave/workspace/HBase-0.94-security/trunk/target/surefire/surefire7580621835835706561tmp
/x1/jenkins/jenkins-slave/workspace/HBase-0.94-security/trunk/target/surefire/surefire_1191811221704619867321tmp
Running org.apache.hadoop.hbase.io.hfile.slab.TestSlabCache
Tests run: 7, Failures: 0, Errors: 0, Skipped: 0, Time elapsed: 11.801 sec
Forking command line: /bin/sh -c cd /x1/jenkins/jenkins-slave/workspace/HBase-0.94-security/trunk
&& /x1/jenkins/tools/java/jdk1.6.0_32-32/jre/bin/java -enableassertions -Xmx1900m
-Djava.security.egd=file:/dev/./urandom -jar /x1/jenkins/jenkins-slave/workspace/HBase-0.94-security/trunk/target/surefire/surefirebooter6723340240678401355.jar
/x1/jenkins/jenkins-slave/workspace/HBase-0.94-security/trunk/target/surefire/surefire1956289714753772844tmp
/x1/jenkins/jenkins-slave/workspace/HBase-0.94-security/trunk/target/surefire/surefire_1208488291383300844211tmp
Running org.apache.hadoop.hbase.io.hfile.slab.TestSingleSizeCache
Tests run: 5, Failures: 0, Errors: 0, Skipped: 0, Time elapsed: 24.034 sec
Forking command line: /bin/sh -c cd /x1/jenkins/jenkins-slave/workspace/HBase-0.94-security/trunk
&& /x1/jenkins/tools/java/jdk1.6.0_32-32/jre/bin/java -enableassertions -Xmx1900m
-Djava.security.egd=file:/dev/./urandom -jar /x1/jenkins/jenkins-slave/workspace/HBase-0.94-security/trunk/target/surefire/surefirebooter8674463673387624064.jar
/x1/jenkins/jenkins-slave/workspace/HBase-0.94-security/trunk/target/surefire/surefire3547860395037238762tmp
/x1/jenkins/jenkins-slave/workspace/HBase-0.94-security/trunk/target/surefire/surefire_1217474848708755506381tmp
Running org.apache.hadoop.hbase.io.hfile.TestHFileBlock
Tests run: 16, Failures: 0, Errors: 0, Skipped: 0, Time elapsed: 48.606 sec
Forking command line: /bin/sh -c cd /x1/jenkins/jenkins-slave/workspace/HBase-0.94-security/trunk
&& /x1/jenkins/tools/java/jdk1.6.0_32-32/jre/bin/java -enableassertions -Xmx1900m
-Djava.security.egd=file:/dev/./urandom -jar /x1/jenkins/jenkins-slave/workspace/HBase-0.94-security/trunk/target/surefire/surefirebooter2017929757784438752.jar
/x1/jenkins/jenkins-slave/workspace/HBase-0.94-security/trunk/target/surefire/surefire1815111057407066094tmp
/x1/jenkins/jenkins-slave/workspace/HBase-0.94-security/trunk/target/surefire/surefire_1229020496094528589412tmp
Running org.apache.hadoop.hbase.replication.TestReplicationZookeeper
Tests run: 1, Failures: 0, Errors: 0, Skipped: 0, Time elapsed: 0.459 sec
Forking command line: /bin/sh -c cd /x1/jenkins/jenkins-slave/workspace/HBase-0.94-security/trunk
&& /x1/jenkins/tools/java/jdk1.6.0_32-32/jre/bin/java -enableassertions -Xmx1900m
-Djava.security.egd=file:/dev/./urandom -jar /x1/jenkins/jenkins-slave/workspace/HBase-0.94-security/trunk/target/surefire/surefirebooter8116765381550623079.jar
/x1/jenkins/jenkins-slave/workspace/HBase-0.94-security/trunk/target/surefire/surefire1349148032040464173tmp
/x1/jenkins/jenkins-slave/workspace/HBase-0.94-security/trunk/target/surefire/surefire_1236935824469502381153tmp
Running org.apache.hadoop.hbase.io.encoding.TestLoadAndSwitchEncodeOnDisk
Tests run: 1, Failures: 0, Errors: 0, Skipped: 0, Time elapsed: 27.029 sec
Forking command line: /bin/sh -c cd /x1/jenkins/jenkins-slave/workspace/HBase-0.94-security/trunk
&& /x1/jenkins/tools/java/jdk1.6.0_32-32/jre/bin/java -enableassertions -Xmx1900m
-Djava.security.egd=file:/dev/./urandom -jar /x1/jenkins/jenkins-slave/workspace/HBase-0.94-security/trunk/target/surefire/surefirebooter8204204778301698262.jar
/x1/jenkins/jenkins-slave/workspace/HBase-0.94-security/trunk/target/surefire/surefire4471873469765206665tmp
/x1/jenkins/jenkins-slave/workspace/HBase-0.94-security/trunk/target/surefire/surefire_1245298243447069926754tmp
Running org.apache.hadoop.hbase.replication.regionserver.TestReplicationSink
Tests run: 5, Failures: 0, Errors: 0, Skipped: 0, Time elapsed: 15.523 sec
Forking command line: /bin/sh -c cd /x1/jenkins/jenkins-slave/workspace/HBase-0.94-security/trunk
&& /x1/jenkins/tools/java/jdk1.6.0_32-32/jre/bin/java -enableassertions -Xmx1900m
-Djava.security.egd=file:/dev/./urandom -jar /x1/jenkins/jenkins-slave/workspace/HBase-0.94-security/trunk/target/surefire/surefirebooter4420519987586196441.jar
/x1/jenkins/jenkins-slave/workspace/HBase-0.94-security/trunk/target/surefire/surefire5038932951157508653tmp
/x1/jenkins/jenkins-slave/workspace/HBase-0.94-security/trunk/target/surefire/surefire_1251481081969945883683tmp
Running org.apache.hadoop.hbase.replication.regionserver.TestReplicationSourceManager
Tests run: 1, Failures: 0, Errors: 0, Skipped: 0, Time elapsed: 0.782 sec
Forking command line: /bin/sh -c cd /x1/jenkins/jenkins-slave/workspace/HBase-0.94-security/trunk
&& /x1/jenkins/tools/java/jdk1.6.0_32-32/jre/bin/java -enableassertions -Xmx1900m
-Djava.security.egd=file:/dev/./urandom -jar /x1/jenkins/jenkins-slave/workspace/HBase-0.94-security/trunk/target/surefire/surefirebooter1089231790906647828.jar
/x1/jenkins/jenkins-slave/workspace/HBase-0.94-security/trunk/target/surefire/surefire1332859366650353856tmp
/x1/jenkins/jenkins-slave/workspace/HBase-0.94-security/trunk/target/surefire/surefire_1263769217839221186199tmp
Running org.apache.hadoop.hbase.util.TestFSTableDescriptors
Tests run: 11, Failures: 0, Errors: 0, Skipped: 0, Time elapsed: 0.709 sec
Forking command line: /bin/sh -c cd /x1/jenkins/jenkins-slave/workspace/HBase-0.94-security/trunk
&& /x1/jenkins/tools/java/jdk1.6.0_32-32/jre/bin/java -enableassertions -Xmx1900m
-Djava.security.egd=file:/dev/./urandom -jar /x1/jenkins/jenkins-slave/workspace/HBase-0.94-security/trunk/target/surefire/surefirebooter1703557626520218045.jar
/x1/jenkins/jenkins-slave/workspace/HBase-0.94-security/trunk/target/surefire/surefire7685012732269751154tmp
/x1/jenkins/jenkins-slave/workspace/HBase-0.94-security/trunk/target/surefire/surefire_1278505314101650911886tmp
Running org.apache.hadoop.hbase.replication.TestReplicationSource
Tests run: 1, Failures: 0, Errors: 0, Skipped: 0, Time elapsed: 2.047 sec
Forking command line: /bin/sh -c cd /x1/jenkins/jenkins-slave/workspace/HBase-0.94-security/trunk
&& /x1/jenkins/tools/java/jdk1.6.0_32-32/jre/bin/java -enableassertions -Xmx1900m
-Djava.security.egd=file:/dev/./urandom -jar /x1/jenkins/jenkins-slave/workspace/HBase-0.94-security/trunk/target/surefire/surefirebooter4169894805236991825.jar
/x1/jenkins/jenkins-slave/workspace/HBase-0.94-security/trunk/target/surefire/surefire2221087155599197931tmp
/x1/jenkins/jenkins-slave/workspace/HBase-0.94-security/trunk/target/surefire/surefire_1281266245832249756106tmp
Running org.apache.hadoop.hbase.util.TestEnvironmentEdgeManager
Tests run: 2, Failures: 0, Errors: 0, Skipped: 0, Time elapsed: 0.28 sec
Forking command line: /bin/sh -c cd /x1/jenkins/jenkins-slave/workspace/HBase-0.94-security/trunk
&& /x1/jenkins/tools/java/jdk1.6.0_32-32/jre/bin/java -enableassertions -Xmx1900m
-Djava.security.egd=file:/dev/./urandom -jar /x1/jenkins/jenkins-slave/workspace/HBase-0.94-security/trunk/target/surefire/surefirebooter4720128971472450064.jar
/x1/jenkins/jenkins-slave/workspace/HBase-0.94-security/trunk/target/surefire/surefire5573768600709746513tmp
/x1/jenkins/jenkins-slave/workspace/HBase-0.94-security/trunk/target/surefire/surefire_1297299917749727626119tmp
Running org.apache.hadoop.hbase.util.TestIdLock
Tests run: 1, Failures: 0, Errors: 0, Skipped: 0, Time elapsed: 15.366 sec
Forking command line: /bin/sh -c cd /x1/jenkins/jenkins-slave/workspace/HBase-0.94-security/trunk
&& /x1/jenkins/tools/java/jdk1.6.0_32-32/jre/bin/java -enableassertions -Xmx1900m
-Djava.security.egd=file:/dev/./urandom -jar /x1/jenkins/jenkins-slave/workspace/HBase-0.94-security/trunk/target/surefire/surefirebooter6170313422295372972.jar
/x1/jenkins/jenkins-slave/workspace/HBase-0.94-security/trunk/target/surefire/surefire3235517545188011900tmp
/x1/jenkins/jenkins-slave/workspace/HBase-0.94-security/trunk/target/surefire/surefire_1305292929549895671073tmp
Running org.apache.hadoop.hbase.util.TestMergeTable
Tests run: 1, Failures: 0, Errors: 0, Skipped: 0, Time elapsed: 21.126 sec
Forking command line: /bin/sh -c cd /x1/jenkins/jenkins-slave/workspace/HBase-0.94-security/trunk
&& /x1/jenkins/tools/java/jdk1.6.0_32-32/jre/bin/java -enableassertions -Xmx1900m
-Djava.security.egd=file:/dev/./urandom -jar /x1/jenkins/jenkins-slave/workspace/HBase-0.94-security/trunk/target/surefire/surefirebooter1217218545369898264.jar
/x1/jenkins/jenkins-slave/workspace/HBase-0.94-security/trunk/target/surefire/surefire1697575101188902284tmp
/x1/jenkins/jenkins-slave/workspace/HBase-0.94-security/trunk/target/surefire/surefire_1316315645665355943056tmp
Running org.apache.hadoop.hbase.util.TestPoolMap$TestRoundRobinPoolType
Tests run: 3, Failures: 0, Errors: 0, Skipped: 0, Time elapsed: 0.006 sec
Running org.apache.hadoop.hbase.util.TestPoolMap$TestThreadLocalPoolType
Tests run: 3, Failures: 0, Errors: 0, Skipped: 0, Time elapsed: 0.004 sec
Running org.apache.hadoop.hbase.util.TestPoolMap$TestReusablePoolType
Tests run: 3, Failures: 0, Errors: 0, Skipped: 0, Time elapsed: 0.022 sec
Forking command line: /bin/sh -c cd /x1/jenkins/jenkins-slave/workspace/HBase-0.94-security/trunk
&& /x1/jenkins/tools/java/jdk1.6.0_32-32/jre/bin/java -enableassertions -Xmx1900m
-Djava.security.egd=file:/dev/./urandom -jar /x1/jenkins/jenkins-slave/workspace/HBase-0.94-security/trunk/target/surefire/surefirebooter1770279527903360768.jar
/x1/jenkins/jenkins-slave/workspace/HBase-0.94-security/trunk/target/surefire/surefire5780276542292557305tmp
/x1/jenkins/jenkins-slave/workspace/HBase-0.94-security/trunk/target/surefire/surefire_1324166796530695373705tmp
Running org.apache.hadoop.hbase.util.TestFSUtils
Tests run: 4, Failures: 0, Errors: 0, Skipped: 0, Time elapsed: 18.037 sec
Forking command line: /bin/sh -c cd /x1/jenkins/jenkins-slave/workspace/HBase-0.94-security/trunk
&& /x1/jenkins/tools/java/jdk1.6.0_32-32/jre/bin/java -enableassertions -Xmx1900m
-Djava.security.egd=file:/dev/./urandom -jar /x1/jenkins/jenkins-slave/workspace/HBase-0.94-security/trunk/target/surefire/surefirebooter2008654280976681396.jar
/x1/jenkins/jenkins-slave/workspace/HBase-0.94-security/trunk/target/surefire/surefire529901961710810099tmp
/x1/jenkins/jenkins-slave/workspace/HBase-0.94-security/trunk/target/surefire/surefire_1334032153537771922072tmp
Running org.apache.hadoop.hbase.util.TestRegionSplitter
Tests run: 5, Failures: 0, Errors: 0, Skipped: 0, Time elapsed: 15.791 sec
Forking command line: /bin/sh -c cd /x1/jenkins/jenkins-slave/workspace/HBase-0.94-security/trunk
&& /x1/jenkins/tools/java/jdk1.6.0_32-32/jre/bin/java -enableassertions -Xmx1900m
-Djava.security.egd=file:/dev/./urandom -jar /x1/jenkins/jenkins-slave/workspace/HBase-0.94-security/trunk/target/surefire/surefirebooter2251726052563682814.jar
/x1/jenkins/jenkins-slave/workspace/HBase-0.94-security/trunk/target/surefire/surefire1445367166347005579tmp
/x1/jenkins/jenkins-slave/workspace/HBase-0.94-security/trunk/target/surefire/surefire_1341822270145573082109tmp
Running org.apache.hadoop.hbase.util.TestCoprocessorScanPolicy
Tests run: 2, Failures: 0, Errors: 0, Skipped: 0, Time elapsed: 13.416 sec
Forking command line: /bin/sh -c cd /x1/jenkins/jenkins-slave/workspace/HBase-0.94-security/trunk
&& /x1/jenkins/tools/java/jdk1.6.0_32-32/jre/bin/java -enableassertions -Xmx1900m
-Djava.security.egd=file:/dev/./urandom -jar /x1/jenkins/jenkins-slave/workspace/HBase-0.94-security/trunk/target/surefire/surefirebooter783776889507829404.jar
/x1/jenkins/jenkins-slave/workspace/HBase-0.94-security/trunk/target/surefire/surefire8484995393127710869tmp
/x1/jenkins/jenkins-slave/workspace/HBase-0.94-security/trunk/target/surefire/surefire_1353073909965025655184tmp
Running org.apache.hadoop.hbase.util.hbck.TestOfflineMetaRebuildBase
Tests run: 1, Failures: 0, Errors: 0, Skipped: 0, Time elapsed: 22.996 sec
Forking command line: /bin/sh -c cd /x1/jenkins/jenkins-slave/workspace/HBase-0.94-security/trunk
&& /x1/jenkins/tools/java/jdk1.6.0_32-32/jre/bin/java -enableassertions -Xmx1900m
-Djava.security.egd=file:/dev/./urandom -jar /x1/jenkins/jenkins-slave/workspace/HBase-0.94-security/trunk/target/surefire/surefirebooter7985779377352020195.jar
/x1/jenkins/jenkins-slave/workspace/HBase-0.94-security/trunk/target/surefire/surefire4096048310646803261tmp
/x1/jenkins/jenkins-slave/workspace/HBase-0.94-security/trunk/target/surefire/surefire_1365213158989655007910tmp
Running org.apache.hadoop.hbase.util.hbck.TestOfflineMetaRebuildOverlap
Tests run: 1, Failures: 0, Errors: 0, Skipped: 0, Time elapsed: 23.387 sec
Forking command line: /bin/sh -c cd /x1/jenkins/jenkins-slave/workspace/HBase-0.94-security/trunk
&& /x1/jenkins/tools/java/jdk1.6.0_32-32/jre/bin/java -enableassertions -Xmx1900m
-Djava.security.egd=file:/dev/./urandom -jar /x1/jenkins/jenkins-slave/workspace/HBase-0.94-security/trunk/target/surefire/surefirebooter7681956359256820517.jar
/x1/jenkins/jenkins-slave/workspace/HBase-0.94-security/trunk/target/surefire/surefire2208600287532911772tmp
/x1/jenkins/jenkins-slave/workspace/HBase-0.94-security/trunk/target/surefire/surefire_1377363878343608458433tmp
Running org.apache.hadoop.hbase.util.TestDefaultEnvironmentEdge
Tests run: 1, Failures: 0, Errors: 0, Skipped: 0, Time elapsed: 0.153 sec
Forking command line: /bin/sh -c cd /x1/jenkins/jenkins-slave/workspace/HBase-0.94-security/trunk
&& /x1/jenkins/tools/java/jdk1.6.0_32-32/jre/bin/java -enableassertions -Xmx1900m
-Djava.security.egd=file:/dev/./urandom -jar /x1/jenkins/jenkins-slave/workspace/HBase-0.94-security/trunk/target/surefire/surefirebooter3083231973108553179.jar
/x1/jenkins/jenkins-slave/workspace/HBase-0.94-security/trunk/target/surefire/surefire3990022296504558804tmp
/x1/jenkins/jenkins-slave/workspace/HBase-0.94-security/trunk/target/surefire/surefire_13869791784105330016tmp
Running org.apache.hadoop.hbase.util.hbck.TestOfflineMetaRebuildHole
Tests run: 1, Failures: 0, Errors: 0, Skipped: 0, Time elapsed: 22.129 sec
Forking command line: /bin/sh -c cd /x1/jenkins/jenkins-slave/workspace/HBase-0.94-security/trunk
&& /x1/jenkins/tools/java/jdk1.6.0_32-32/jre/bin/java -enableassertions -Xmx1900m
-Djava.security.egd=file:/dev/./urandom -jar /x1/jenkins/jenkins-slave/workspace/HBase-0.94-security/trunk/target/surefire/surefirebooter782913216578745286.jar
/x1/jenkins/jenkins-slave/workspace/HBase-0.94-security/trunk/target/surefire/surefire5047405549098347762tmp
/x1/jenkins/jenkins-slave/workspace/HBase-0.94-security/trunk/target/surefire/surefire_1391204812343899625882tmp
Running org.apache.hadoop.hbase.TestInfoServers
Tests run: 3, Failures: 0, Errors: 0, Skipped: 0, Time elapsed: 13.02 sec
Running org.apache.hadoop.hbase.util.TestSizeBasedThrottler
Tests run: 3, Failures: 0, Errors: 0, Skipped: 0, Time elapsed: 31.208 sec

Results :

Tests in error: 
  testTableOperations(org.apache.hadoop.hbase.coprocessor.TestMasterObserver): org.apache.hadoop.hbase.InvalidFamilyOperationException:
Column family 'fam2' does not exist(..)
  testRegionTransitionOperations(org.apache.hadoop.hbase.coprocessor.TestMasterObserver):
org.apache.hadoop.hbase.TableExistsException: observed_table

Tests run: 820, Failures: 0, Errors: 2, Skipped: 2

[INFO] ------------------------------------------------------------------------
[INFO] BUILD FAILURE
[INFO] ------------------------------------------------------------------------
[INFO] Total time: 26:20.879s
[INFO] Finished at: Wed Feb 06 05:19:03 UTC 2013
[INFO] Final Memory: 46M/1043M
[INFO] ------------------------------------------------------------------------
[ERROR] Failed to execute goal org.apache.maven.plugins:maven-surefire-plugin:2.12-TRUNK-HBASE-2:test
(secondPartTestsExecution) on project hbase: There are test failures.
[ERROR] 
[ERROR] Please refer to /x1/jenkins/jenkins-slave/workspace/HBase-0.94-security/trunk/target/surefire-reports
for the individual test results.
[ERROR] -> [Help 1]
org.apache.maven.lifecycle.LifecycleExecutionException: Failed to execute goal org.apache.maven.plugins:maven-surefire-plugin:2.12-TRUNK-HBASE-2:test
(secondPartTestsExecution) on project hbase: There are test failures.

Please refer to /x1/jenkins/jenkins-slave/workspace/HBase-0.94-security/trunk/target/surefire-reports
for the individual test results.
	at org.apache.maven.lifecycle.internal.MojoExecutor.execute(MojoExecutor.java:213)
	at org.apache.maven.lifecycle.internal.MojoExecutor.execute(MojoExecutor.java:153)
	at org.apache.maven.lifecycle.internal.MojoExecutor.execute(MojoExecutor.java:145)
	at org.apache.maven.lifecycle.internal.MojoExecutor.executeForkedExecutions(MojoExecutor.java:365)
	at org.apache.maven.lifecycle.internal.MojoExecutor.execute(MojoExecutor.java:199)
	at org.apache.maven.lifecycle.internal.MojoExecutor.execute(MojoExecutor.java:153)
	at org.apache.maven.lifecycle.internal.MojoExecutor.execute(MojoExecutor.java:145)
	at org.apache.maven.lifecycle.internal.LifecycleModuleBuilder.buildProject(LifecycleModuleBuilder.java:84)
	at org.apache.maven.lifecycle.internal.LifecycleModuleBuilder.buildProject(LifecycleModuleBuilder.java:59)
	at org.apache.maven.lifecycle.internal.LifecycleStarter.singleThreadedBuild(LifecycleStarter.java:183)
	at org.apache.maven.lifecycle.internal.LifecycleStarter.execute(LifecycleStarter.java:161)
	at org.apache.maven.DefaultMaven.doExecute(DefaultMaven.java:320)
	at org.apache.maven.DefaultMaven.execute(DefaultMaven.java:156)
	at org.apache.maven.cli.MavenCli.execute(MavenCli.java:537)
	at org.apache.maven.cli.MavenCli.doMain(MavenCli.java:196)
	at org.apache.maven.cli.MavenCli.main(MavenCli.java:141)
	at sun.reflect.NativeMethodAccessorImpl.invoke0(Native Method)
	at sun.reflect.NativeMethodAccessorImpl.invoke(NativeMethodAccessorImpl.java:39)
	at sun.reflect.DelegatingMethodAccessorImpl.invoke(DelegatingMethodAccessorImpl.java:25)
	at java.lang.reflect.Method.invoke(Method.java:597)
	at org.codehaus.plexus.classworlds.launcher.Launcher.launchEnhanced(Launcher.java:290)
	at org.codehaus.plexus.classworlds.launcher.Launcher.launch(Launcher.java:230)
	at org.codehaus.plexus.classworlds.launcher.Launcher.mainWithExitCode(Launcher.java:409)
	at org.codehaus.plexus.classworlds.launcher.Launcher.main(Launcher.java:352)
Caused by: org.apache.maven.plugin.MojoFailureException: There are test failures.

Please refer to /x1/jenkins/jenkins-slave/workspace/HBase-0.94-security/trunk/target/surefire-reports
for the individual test results.
	at org.apache.maven.plugin.surefire.SurefireHelper.reportExecution(SurefireHelper.java:87)
	at org.apache.maven.plugin.surefire.SurefirePlugin.writeSummary(SurefirePlugin.java:651)
	at org.apache.maven.plugin.surefire.SurefirePlugin.handleSummary(SurefirePlugin.java:625)
	at org.apache.maven.plugin.surefire.AbstractSurefireMojo.executeAfterPreconditionsChecked(AbstractSurefireMojo.java:137)
	at org.apache.maven.plugin.surefire.AbstractSurefireMojo.execute(AbstractSurefireMojo.java:98)
	at org.apache.maven.plugin.DefaultBuildPluginManager.executeMojo(DefaultBuildPluginManager.java:101)
	at org.apache.maven.lifecycle.internal.MojoExecutor.execute(MojoExecutor.java:209)
	... 23 more
[ERROR] 
[ERROR] 
[ERROR] For more information about the errors and possible solutions, please read the following
articles:
[ERROR] [Help 1] http://cwiki.apache.org/confluence/display/MAVEN/MojoFailureException
Build step 'Invoke top-level Maven targets' marked build as failure
Archiving artifacts
Updating HBASE-7771
Updating HBASE-7748
Recording test results

Mime
View raw message