hbase-dev mailing list archives

Site index · List index
Message view « Date » · « Thread »
Top « Date » · « Thread »
From Apache Jenkins Server <jenk...@builds.apache.org>
Subject Build failed in Jenkins: HBase-TRUNK-on-Hadoop-2.0.0 #323
Date Tue, 01 Jan 2013 11:44:28 GMT
See <https://builds.apache.org/job/HBase-TRUNK-on-Hadoop-2.0.0/323/changes>

Changes:

[tedyu] HBASE-7299 TestMultiParallel fails intermittently in trunk builds, addendum

[tedyu] HBASE-7467 CleanerChore checkAndDeleteDirectory not deleting empty directories (Jean-Marc and Jesse Yates)

------------------------------------------
[...truncated 18111 lines...]
Forking command line: /bin/sh -c cd /x1/jenkins/jenkins-slave/workspace/HBase-TRUNK-on-Hadoop-2.0.0/trunk/hbase-server && /x1/jenkins/tools/java/jdk1.6.0_32-32/jre/bin/java -enableassertions -Xmx1900m -Djava.security.egd=file:/dev/./urandom -Djava.net.preferIPv4Stack=true -jar /x1/jenkins/jenkins-slave/workspace/HBase-TRUNK-on-Hadoop-2.0.0/trunk/hbase-server/target/surefire/surefirebooter3789958294503273797.jar /x1/jenkins/jenkins-slave/workspace/HBase-TRUNK-on-Hadoop-2.0.0/trunk/hbase-server/target/surefire/surefire3447751939905691962tmp /x1/jenkins/jenkins-slave/workspace/HBase-TRUNK-on-Hadoop-2.0.0/trunk/hbase-server/target/surefire/surefire_946175053757666327325tmp
Running org.apache.hadoop.hbase.regionserver.TestStoreFileBlockCacheSummary
Tests run: 1, Failures: 0, Errors: 0, Skipped: 0, Time elapsed: 9.646 sec
Forking command line: /bin/sh -c cd /x1/jenkins/jenkins-slave/workspace/HBase-TRUNK-on-Hadoop-2.0.0/trunk/hbase-server && /x1/jenkins/tools/java/jdk1.6.0_32-32/jre/bin/java -enableassertions -Xmx1900m -Djava.security.egd=file:/dev/./urandom -Djava.net.preferIPv4Stack=true -jar /x1/jenkins/jenkins-slave/workspace/HBase-TRUNK-on-Hadoop-2.0.0/trunk/hbase-server/target/surefire/surefirebooter4279286631630374494.jar /x1/jenkins/jenkins-slave/workspace/HBase-TRUNK-on-Hadoop-2.0.0/trunk/hbase-server/target/surefire/surefire550095969786731791tmp /x1/jenkins/jenkins-slave/workspace/HBase-TRUNK-on-Hadoop-2.0.0/trunk/hbase-server/target/surefire/surefire_952670970194339879203tmp
Running org.apache.hadoop.hbase.regionserver.TestCompaction
Tests run: 15, Failures: 0, Errors: 0, Skipped: 0, Time elapsed: 31.426 sec
Forking command line: /bin/sh -c cd /x1/jenkins/jenkins-slave/workspace/HBase-TRUNK-on-Hadoop-2.0.0/trunk/hbase-server && /x1/jenkins/tools/java/jdk1.6.0_32-32/jre/bin/java -enableassertions -Xmx1900m -Djava.security.egd=file:/dev/./urandom -Djava.net.preferIPv4Stack=true -jar /x1/jenkins/jenkins-slave/workspace/HBase-TRUNK-on-Hadoop-2.0.0/trunk/hbase-server/target/surefire/surefirebooter6903158117059566957.jar /x1/jenkins/jenkins-slave/workspace/HBase-TRUNK-on-Hadoop-2.0.0/trunk/hbase-server/target/surefire/surefire5662710143027094749tmp /x1/jenkins/jenkins-slave/workspace/HBase-TRUNK-on-Hadoop-2.0.0/trunk/hbase-server/target/surefire/surefire_963748200110598104632tmp
Running org.apache.hadoop.hbase.regionserver.TestClusterId
Tests run: 1, Failures: 0, Errors: 0, Skipped: 0, Time elapsed: 25.964 sec
Forking command line: /bin/sh -c cd /x1/jenkins/jenkins-slave/workspace/HBase-TRUNK-on-Hadoop-2.0.0/trunk/hbase-server && /x1/jenkins/tools/java/jdk1.6.0_32-32/jre/bin/java -enableassertions -Xmx1900m -Djava.security.egd=file:/dev/./urandom -Djava.net.preferIPv4Stack=true -jar /x1/jenkins/jenkins-slave/workspace/HBase-TRUNK-on-Hadoop-2.0.0/trunk/hbase-server/target/surefire/surefirebooter8783674151589530676.jar /x1/jenkins/jenkins-slave/workspace/HBase-TRUNK-on-Hadoop-2.0.0/trunk/hbase-server/target/surefire/surefire214035099910102682tmp /x1/jenkins/jenkins-slave/workspace/HBase-TRUNK-on-Hadoop-2.0.0/trunk/hbase-server/target/surefire/surefire_973690109955293077937tmp
Running org.apache.hadoop.hbase.regionserver.TestMasterAddressManager
Tests run: 1, Failures: 0, Errors: 0, Skipped: 0, Time elapsed: 0.575 sec
Forking command line: /bin/sh -c cd /x1/jenkins/jenkins-slave/workspace/HBase-TRUNK-on-Hadoop-2.0.0/trunk/hbase-server && /x1/jenkins/tools/java/jdk1.6.0_32-32/jre/bin/java -enableassertions -Xmx1900m -Djava.security.egd=file:/dev/./urandom -Djava.net.preferIPv4Stack=true -jar /x1/jenkins/jenkins-slave/workspace/HBase-TRUNK-on-Hadoop-2.0.0/trunk/hbase-server/target/surefire/surefirebooter4370094122244155599.jar /x1/jenkins/jenkins-slave/workspace/HBase-TRUNK-on-Hadoop-2.0.0/trunk/hbase-server/target/surefire/surefire4439256273439588727tmp /x1/jenkins/jenkins-slave/workspace/HBase-TRUNK-on-Hadoop-2.0.0/trunk/hbase-server/target/surefire/surefire_981889881882212456323tmp
Running org.apache.hadoop.hbase.regionserver.TestMultiColumnScanner
Tests run: 12, Failures: 0, Errors: 0, Skipped: 0, Time elapsed: 39.831 sec
Forking command line: /bin/sh -c cd /x1/jenkins/jenkins-slave/workspace/HBase-TRUNK-on-Hadoop-2.0.0/trunk/hbase-server && /x1/jenkins/tools/java/jdk1.6.0_32-32/jre/bin/java -enableassertions -Xmx1900m -Djava.security.egd=file:/dev/./urandom -Djava.net.preferIPv4Stack=true -jar /x1/jenkins/jenkins-slave/workspace/HBase-TRUNK-on-Hadoop-2.0.0/trunk/hbase-server/target/surefire/surefirebooter3738828167834852927.jar /x1/jenkins/jenkins-slave/workspace/HBase-TRUNK-on-Hadoop-2.0.0/trunk/hbase-server/target/surefire/surefire3591447129603589139tmp /x1/jenkins/jenkins-slave/workspace/HBase-TRUNK-on-Hadoop-2.0.0/trunk/hbase-server/target/surefire/surefire_998420721493723479575tmp
Running org.apache.hadoop.hbase.regionserver.TestHRegion
Tests run: 58, Failures: 0, Errors: 0, Skipped: 0, Time elapsed: 33.46 sec
Forking command line: /bin/sh -c cd /x1/jenkins/jenkins-slave/workspace/HBase-TRUNK-on-Hadoop-2.0.0/trunk/hbase-server && /x1/jenkins/tools/java/jdk1.6.0_32-32/jre/bin/java -enableassertions -Xmx1900m -Djava.security.egd=file:/dev/./urandom -Djava.net.preferIPv4Stack=true -jar /x1/jenkins/jenkins-slave/workspace/HBase-TRUNK-on-Hadoop-2.0.0/trunk/hbase-server/target/surefire/surefirebooter6255713738349396513.jar /x1/jenkins/jenkins-slave/workspace/HBase-TRUNK-on-Hadoop-2.0.0/trunk/hbase-server/target/surefire/surefire206992545968750204tmp /x1/jenkins/jenkins-slave/workspace/HBase-TRUNK-on-Hadoop-2.0.0/trunk/hbase-server/target/surefire/surefire_1004498614297860351294tmp
Running org.apache.hadoop.hbase.backup.example.TestZooKeeperTableArchiveClient
Tests run: 3, Failures: 0, Errors: 0, Skipped: 0, Time elapsed: 6.084 sec
Forking command line: /bin/sh -c cd /x1/jenkins/jenkins-slave/workspace/HBase-TRUNK-on-Hadoop-2.0.0/trunk/hbase-server && /x1/jenkins/tools/java/jdk1.6.0_32-32/jre/bin/java -enableassertions -Xmx1900m -Djava.security.egd=file:/dev/./urandom -Djava.net.preferIPv4Stack=true -jar /x1/jenkins/jenkins-slave/workspace/HBase-TRUNK-on-Hadoop-2.0.0/trunk/hbase-server/target/surefire/surefirebooter6515311118448381906.jar /x1/jenkins/jenkins-slave/workspace/HBase-TRUNK-on-Hadoop-2.0.0/trunk/hbase-server/target/surefire/surefire669060987920908274tmp /x1/jenkins/jenkins-slave/workspace/HBase-TRUNK-on-Hadoop-2.0.0/trunk/hbase-server/target/surefire/surefire_1014118037328713142349tmp
Running org.apache.hadoop.hbase.TestLocalHBaseCluster
Tests run: 1, Failures: 0, Errors: 0, Skipped: 0, Time elapsed: 9.678 sec
Forking command line: /bin/sh -c cd /x1/jenkins/jenkins-slave/workspace/HBase-TRUNK-on-Hadoop-2.0.0/trunk/hbase-server && /x1/jenkins/tools/java/jdk1.6.0_32-32/jre/bin/java -enableassertions -Xmx1900m -Djava.security.egd=file:/dev/./urandom -Djava.net.preferIPv4Stack=true -jar /x1/jenkins/jenkins-slave/workspace/HBase-TRUNK-on-Hadoop-2.0.0/trunk/hbase-server/target/surefire/surefirebooter6861635238968824332.jar /x1/jenkins/jenkins-slave/workspace/HBase-TRUNK-on-Hadoop-2.0.0/trunk/hbase-server/target/surefire/surefire6032326602925339523tmp /x1/jenkins/jenkins-slave/workspace/HBase-TRUNK-on-Hadoop-2.0.0/trunk/hbase-server/target/surefire/surefire_1026462484351016894295tmp
Running org.apache.hadoop.hbase.security.token.TestTokenAuthentication
Tests run: 2, Failures: 0, Errors: 0, Skipped: 0, Time elapsed: 1.567 sec
Forking command line: /bin/sh -c cd /x1/jenkins/jenkins-slave/workspace/HBase-TRUNK-on-Hadoop-2.0.0/trunk/hbase-server && /x1/jenkins/tools/java/jdk1.6.0_32-32/jre/bin/java -enableassertions -Xmx1900m -Djava.security.egd=file:/dev/./urandom -Djava.net.preferIPv4Stack=true -jar /x1/jenkins/jenkins-slave/workspace/HBase-TRUNK-on-Hadoop-2.0.0/trunk/hbase-server/target/surefire/surefirebooter7203906397240641612.jar /x1/jenkins/jenkins-slave/workspace/HBase-TRUNK-on-Hadoop-2.0.0/trunk/hbase-server/target/surefire/surefire3240560253929874165tmp /x1/jenkins/jenkins-slave/workspace/HBase-TRUNK-on-Hadoop-2.0.0/trunk/hbase-server/target/surefire/surefire_1036534525119643295657tmp
Running org.apache.hadoop.hbase.ipc.TestDelayedRpc
Tests run: 4, Failures: 0, Errors: 0, Skipped: 0, Time elapsed: 2.445 sec
Forking command line: /bin/sh -c cd /x1/jenkins/jenkins-slave/workspace/HBase-TRUNK-on-Hadoop-2.0.0/trunk/hbase-server && /x1/jenkins/tools/java/jdk1.6.0_32-32/jre/bin/java -enableassertions -Xmx1900m -Djava.security.egd=file:/dev/./urandom -Djava.net.preferIPv4Stack=true -jar /x1/jenkins/jenkins-slave/workspace/HBase-TRUNK-on-Hadoop-2.0.0/trunk/hbase-server/target/surefire/surefirebooter5875504068159938065.jar /x1/jenkins/jenkins-slave/workspace/HBase-TRUNK-on-Hadoop-2.0.0/trunk/hbase-server/target/surefire/surefire1045374726331075503tmp /x1/jenkins/jenkins-slave/workspace/HBase-TRUNK-on-Hadoop-2.0.0/trunk/hbase-server/target/surefire/surefire_1045845751216961789054tmp
Running org.apache.hadoop.hbase.ipc.TestHBaseClient
Tests run: 1, Failures: 0, Errors: 0, Skipped: 0, Time elapsed: 0.255 sec
Forking command line: /bin/sh -c cd /x1/jenkins/jenkins-slave/workspace/HBase-TRUNK-on-Hadoop-2.0.0/trunk/hbase-server && /x1/jenkins/tools/java/jdk1.6.0_32-32/jre/bin/java -enableassertions -Xmx1900m -Djava.security.egd=file:/dev/./urandom -Djava.net.preferIPv4Stack=true -jar /x1/jenkins/jenkins-slave/workspace/HBase-TRUNK-on-Hadoop-2.0.0/trunk/hbase-server/target/surefire/surefirebooter5691357810599817751.jar /x1/jenkins/jenkins-slave/workspace/HBase-TRUNK-on-Hadoop-2.0.0/trunk/hbase-server/target/surefire/surefire4171824342826558172tmp /x1/jenkins/jenkins-slave/workspace/HBase-TRUNK-on-Hadoop-2.0.0/trunk/hbase-server/target/surefire/surefire_1054921522252700491330tmp
Running org.apache.hadoop.hbase.ipc.TestProtoBufRpc
Tests run: 1, Failures: 0, Errors: 0, Skipped: 0, Time elapsed: 0.857 sec
Forking command line: /bin/sh -c cd /x1/jenkins/jenkins-slave/workspace/HBase-TRUNK-on-Hadoop-2.0.0/trunk/hbase-server && /x1/jenkins/tools/java/jdk1.6.0_32-32/jre/bin/java -enableassertions -Xmx1900m -Djava.security.egd=file:/dev/./urandom -Djava.net.preferIPv4Stack=true -jar /x1/jenkins/jenkins-slave/workspace/HBase-TRUNK-on-Hadoop-2.0.0/trunk/hbase-server/target/surefire/surefirebooter3659623885875503638.jar /x1/jenkins/jenkins-slave/workspace/HBase-TRUNK-on-Hadoop-2.0.0/trunk/hbase-server/target/surefire/surefire8043287988799558697tmp /x1/jenkins/jenkins-slave/workspace/HBase-TRUNK-on-Hadoop-2.0.0/trunk/hbase-server/target/surefire/surefire_1065591159230416445616tmp
Running org.apache.hadoop.hbase.TestGlobalMemStoreSize
Tests run: 1, Failures: 0, Errors: 0, Skipped: 0, Time elapsed: 11.95 sec
Forking command line: /bin/sh -c cd /x1/jenkins/jenkins-slave/workspace/HBase-TRUNK-on-Hadoop-2.0.0/trunk/hbase-server && /x1/jenkins/tools/java/jdk1.6.0_32-32/jre/bin/java -enableassertions -Xmx1900m -Djava.security.egd=file:/dev/./urandom -Djava.net.preferIPv4Stack=true -jar /x1/jenkins/jenkins-slave/workspace/HBase-TRUNK-on-Hadoop-2.0.0/trunk/hbase-server/target/surefire/surefirebooter6493224076373332416.jar /x1/jenkins/jenkins-slave/workspace/HBase-TRUNK-on-Hadoop-2.0.0/trunk/hbase-server/target/surefire/surefire5869232906192549118tmp /x1/jenkins/jenkins-slave/workspace/HBase-TRUNK-on-Hadoop-2.0.0/trunk/hbase-server/target/surefire/surefire_1076876714931751113069tmp
Running org.apache.hadoop.hbase.backup.TestHFileArchiving
Tests run: 4, Failures: 0, Errors: 0, Skipped: 0, Time elapsed: 50.552 sec
Forking command line: /bin/sh -c cd /x1/jenkins/jenkins-slave/workspace/HBase-TRUNK-on-Hadoop-2.0.0/trunk/hbase-server && /x1/jenkins/tools/java/jdk1.6.0_32-32/jre/bin/java -enableassertions -Xmx1900m -Djava.security.egd=file:/dev/./urandom -Djava.net.preferIPv4Stack=true -jar /x1/jenkins/jenkins-slave/workspace/HBase-TRUNK-on-Hadoop-2.0.0/trunk/hbase-server/target/surefire/surefirebooter8723202218900424645.jar /x1/jenkins/jenkins-slave/workspace/HBase-TRUNK-on-Hadoop-2.0.0/trunk/hbase-server/target/surefire/surefire8192309013816312551tmp /x1/jenkins/jenkins-slave/workspace/HBase-TRUNK-on-Hadoop-2.0.0/trunk/hbase-server/target/surefire/surefire_1086721658999022250329tmp
Running org.apache.hadoop.hbase.constraint.TestConstraint
Tests run: 5, Failures: 0, Errors: 0, Skipped: 0, Time elapsed: 23.832 sec
Forking command line: /bin/sh -c cd /x1/jenkins/jenkins-slave/workspace/HBase-TRUNK-on-Hadoop-2.0.0/trunk/hbase-server && /x1/jenkins/tools/java/jdk1.6.0_32-32/jre/bin/java -enableassertions -Xmx1900m -Djava.security.egd=file:/dev/./urandom -Djava.net.preferIPv4Stack=true -jar /x1/jenkins/jenkins-slave/workspace/HBase-TRUNK-on-Hadoop-2.0.0/trunk/hbase-server/target/surefire/surefirebooter2366883032427821985.jar /x1/jenkins/jenkins-slave/workspace/HBase-TRUNK-on-Hadoop-2.0.0/trunk/hbase-server/target/surefire/surefire3773142459853338584tmp /x1/jenkins/jenkins-slave/workspace/HBase-TRUNK-on-Hadoop-2.0.0/trunk/hbase-server/target/surefire/surefire_109426924078614031066tmp
Running org.apache.hadoop.hbase.rest.TestSchemaResource
Tests run: 2, Failures: 0, Errors: 0, Skipped: 0, Time elapsed: 16.396 sec
Forking command line: /bin/sh -c cd /x1/jenkins/jenkins-slave/workspace/HBase-TRUNK-on-Hadoop-2.0.0/trunk/hbase-server && /x1/jenkins/tools/java/jdk1.6.0_32-32/jre/bin/java -enableassertions -Xmx1900m -Djava.security.egd=file:/dev/./urandom -Djava.net.preferIPv4Stack=true -jar /x1/jenkins/jenkins-slave/workspace/HBase-TRUNK-on-Hadoop-2.0.0/trunk/hbase-server/target/surefire/surefirebooter7787260432592854054.jar /x1/jenkins/jenkins-slave/workspace/HBase-TRUNK-on-Hadoop-2.0.0/trunk/hbase-server/target/surefire/surefire7466835499836473747tmp /x1/jenkins/jenkins-slave/workspace/HBase-TRUNK-on-Hadoop-2.0.0/trunk/hbase-server/target/surefire/surefire_1107725519914742645019tmp
Running org.apache.hadoop.hbase.rest.client.TestRemoteAdmin
Tests run: 1, Failures: 0, Errors: 0, Skipped: 0, Time elapsed: 13.221 sec
Forking command line: /bin/sh -c cd /x1/jenkins/jenkins-slave/workspace/HBase-TRUNK-on-Hadoop-2.0.0/trunk/hbase-server && /x1/jenkins/tools/java/jdk1.6.0_32-32/jre/bin/java -enableassertions -Xmx1900m -Djava.security.egd=file:/dev/./urandom -Djava.net.preferIPv4Stack=true -jar /x1/jenkins/jenkins-slave/workspace/HBase-TRUNK-on-Hadoop-2.0.0/trunk/hbase-server/target/surefire/surefirebooter6926943368514896429.jar /x1/jenkins/jenkins-slave/workspace/HBase-TRUNK-on-Hadoop-2.0.0/trunk/hbase-server/target/surefire/surefire8605546785452088385tmp /x1/jenkins/jenkins-slave/workspace/HBase-TRUNK-on-Hadoop-2.0.0/trunk/hbase-server/target/surefire/surefire_111490447579027163399tmp
Running org.apache.hadoop.hbase.rest.client.TestRemoteTable
Tests run: 4, Failures: 0, Errors: 0, Skipped: 0, Time elapsed: 10.669 sec
Forking command line: /bin/sh -c cd /x1/jenkins/jenkins-slave/workspace/HBase-TRUNK-on-Hadoop-2.0.0/trunk/hbase-server && /x1/jenkins/tools/java/jdk1.6.0_32-32/jre/bin/java -enableassertions -Xmx1900m -Djava.security.egd=file:/dev/./urandom -Djava.net.preferIPv4Stack=true -jar /x1/jenkins/jenkins-slave/workspace/HBase-TRUNK-on-Hadoop-2.0.0/trunk/hbase-server/target/surefire/surefirebooter6431266275290566018.jar /x1/jenkins/jenkins-slave/workspace/HBase-TRUNK-on-Hadoop-2.0.0/trunk/hbase-server/target/surefire/surefire1713085642647223415tmp /x1/jenkins/jenkins-slave/workspace/HBase-TRUNK-on-Hadoop-2.0.0/trunk/hbase-server/target/surefire/surefire_1122292651629088889437tmp
Running org.apache.hadoop.hbase.rest.TestMultiRowResource
Tests run: 3, Failures: 0, Errors: 0, Skipped: 0, Time elapsed: 10.719 sec
Forking command line: /bin/sh -c cd /x1/jenkins/jenkins-slave/workspace/HBase-TRUNK-on-Hadoop-2.0.0/trunk/hbase-server && /x1/jenkins/tools/java/jdk1.6.0_32-32/jre/bin/java -enableassertions -Xmx1900m -Djava.security.egd=file:/dev/./urandom -Djava.net.preferIPv4Stack=true -jar /x1/jenkins/jenkins-slave/workspace/HBase-TRUNK-on-Hadoop-2.0.0/trunk/hbase-server/target/surefire/surefirebooter3548231430230656822.jar /x1/jenkins/jenkins-slave/workspace/HBase-TRUNK-on-Hadoop-2.0.0/trunk/hbase-server/target/surefire/surefire1974999489397923096tmp /x1/jenkins/jenkins-slave/workspace/HBase-TRUNK-on-Hadoop-2.0.0/trunk/hbase-server/target/surefire/surefire_113699158363956207921tmp
Running org.apache.hadoop.hbase.rest.TestTableResource
Tests run: 8, Failures: 0, Errors: 0, Skipped: 0, Time elapsed: 20.752 sec
Forking command line: /bin/sh -c cd /x1/jenkins/jenkins-slave/workspace/HBase-TRUNK-on-Hadoop-2.0.0/trunk/hbase-server && /x1/jenkins/tools/java/jdk1.6.0_32-32/jre/bin/java -enableassertions -Xmx1900m -Djava.security.egd=file:/dev/./urandom -Djava.net.preferIPv4Stack=true -jar /x1/jenkins/jenkins-slave/workspace/HBase-TRUNK-on-Hadoop-2.0.0/trunk/hbase-server/target/surefire/surefirebooter2548861047059617668.jar /x1/jenkins/jenkins-slave/workspace/HBase-TRUNK-on-Hadoop-2.0.0/trunk/hbase-server/target/surefire/surefire1270408186351489270tmp /x1/jenkins/jenkins-slave/workspace/HBase-TRUNK-on-Hadoop-2.0.0/trunk/hbase-server/target/surefire/surefire_1146796747530857307328tmp
Running org.apache.hadoop.hbase.rest.TestGzipFilter
Tests run: 2, Failures: 0, Errors: 0, Skipped: 0, Time elapsed: 10.683 sec
Forking command line: /bin/sh -c cd /x1/jenkins/jenkins-slave/workspace/HBase-TRUNK-on-Hadoop-2.0.0/trunk/hbase-server && /x1/jenkins/tools/java/jdk1.6.0_32-32/jre/bin/java -enableassertions -Xmx1900m -Djava.security.egd=file:/dev/./urandom -Djava.net.preferIPv4Stack=true -jar /x1/jenkins/jenkins-slave/workspace/HBase-TRUNK-on-Hadoop-2.0.0/trunk/hbase-server/target/surefire/surefirebooter5172831233630650383.jar /x1/jenkins/jenkins-slave/workspace/HBase-TRUNK-on-Hadoop-2.0.0/trunk/hbase-server/target/surefire/surefire5738405905455835282tmp /x1/jenkins/jenkins-slave/workspace/HBase-TRUNK-on-Hadoop-2.0.0/trunk/hbase-server/target/surefire/surefire_1156978429143689354449tmp
Running org.apache.hadoop.hbase.rest.TestRowResource
Tests run: 12, Failures: 0, Errors: 0, Skipped: 0, Time elapsed: 13.218 sec
Forking command line: /bin/sh -c cd /x1/jenkins/jenkins-slave/workspace/HBase-TRUNK-on-Hadoop-2.0.0/trunk/hbase-server && /x1/jenkins/tools/java/jdk1.6.0_32-32/jre/bin/java -enableassertions -Xmx1900m -Djava.security.egd=file:/dev/./urandom -Djava.net.preferIPv4Stack=true -jar /x1/jenkins/jenkins-slave/workspace/HBase-TRUNK-on-Hadoop-2.0.0/trunk/hbase-server/target/surefire/surefirebooter1306269413716094587.jar /x1/jenkins/jenkins-slave/workspace/HBase-TRUNK-on-Hadoop-2.0.0/trunk/hbase-server/target/surefire/surefire7791156524886459273tmp /x1/jenkins/jenkins-slave/workspace/HBase-TRUNK-on-Hadoop-2.0.0/trunk/hbase-server/target/surefire/surefire_1165374383807401900032tmp
Running org.apache.hadoop.hbase.rest.TestVersionResource
Tests run: 7, Failures: 0, Errors: 0, Skipped: 0, Time elapsed: 9.566 sec
Forking command line: /bin/sh -c cd /x1/jenkins/jenkins-slave/workspace/HBase-TRUNK-on-Hadoop-2.0.0/trunk/hbase-server && /x1/jenkins/tools/java/jdk1.6.0_32-32/jre/bin/java -enableassertions -Xmx1900m -Djava.security.egd=file:/dev/./urandom -Djava.net.preferIPv4Stack=true -jar /x1/jenkins/jenkins-slave/workspace/HBase-TRUNK-on-Hadoop-2.0.0/trunk/hbase-server/target/surefire/surefirebooter1181588259313158567.jar /x1/jenkins/jenkins-slave/workspace/HBase-TRUNK-on-Hadoop-2.0.0/trunk/hbase-server/target/surefire/surefire4556663949243460604tmp /x1/jenkins/jenkins-slave/workspace/HBase-TRUNK-on-Hadoop-2.0.0/trunk/hbase-server/target/surefire/surefire_1176998030937590955695tmp
Running org.apache.hadoop.hbase.rest.TestScannerResource
Tests run: 5, Failures: 0, Errors: 0, Skipped: 0, Time elapsed: 24.968 sec
Forking command line: /bin/sh -c cd /x1/jenkins/jenkins-slave/workspace/HBase-TRUNK-on-Hadoop-2.0.0/trunk/hbase-server && /x1/jenkins/tools/java/jdk1.6.0_32-32/jre/bin/java -enableassertions -Xmx1900m -Djava.security.egd=file:/dev/./urandom -Djava.net.preferIPv4Stack=true -jar /x1/jenkins/jenkins-slave/workspace/HBase-TRUNK-on-Hadoop-2.0.0/trunk/hbase-server/target/surefire/surefirebooter3695072243931963527.jar /x1/jenkins/jenkins-slave/workspace/HBase-TRUNK-on-Hadoop-2.0.0/trunk/hbase-server/target/surefire/surefire1252439763757947504tmp /x1/jenkins/jenkins-slave/workspace/HBase-TRUNK-on-Hadoop-2.0.0/trunk/hbase-server/target/surefire/surefire_1184449758137471764222tmp
Running org.apache.hadoop.hbase.rest.TestStatusResource
Tests run: 2, Failures: 0, Errors: 0, Skipped: 0, Time elapsed: 9.035 sec
Forking command line: /bin/sh -c cd /x1/jenkins/jenkins-slave/workspace/HBase-TRUNK-on-Hadoop-2.0.0/trunk/hbase-server && /x1/jenkins/tools/java/jdk1.6.0_32-32/jre/bin/java -enableassertions -Xmx1900m -Djava.security.egd=file:/dev/./urandom -Djava.net.preferIPv4Stack=true -jar /x1/jenkins/jenkins-slave/workspace/HBase-TRUNK-on-Hadoop-2.0.0/trunk/hbase-server/target/surefire/surefirebooter6849277044422725840.jar /x1/jenkins/jenkins-slave/workspace/HBase-TRUNK-on-Hadoop-2.0.0/trunk/hbase-server/target/surefire/surefire1721765748742142669tmp /x1/jenkins/jenkins-slave/workspace/HBase-TRUNK-on-Hadoop-2.0.0/trunk/hbase-server/target/surefire/surefire_1195628853862407800732tmp
Running org.apache.hadoop.hbase.trace.TestHTraceHooks
Tests run: 1, Failures: 0, Errors: 0, Skipped: 0, Time elapsed: 10.003 sec
Forking command line: /bin/sh -c cd /x1/jenkins/jenkins-slave/workspace/HBase-TRUNK-on-Hadoop-2.0.0/trunk/hbase-server && /x1/jenkins/tools/java/jdk1.6.0_32-32/jre/bin/java -enableassertions -Xmx1900m -Djava.security.egd=file:/dev/./urandom -Djava.net.preferIPv4Stack=true -jar /x1/jenkins/jenkins-slave/workspace/HBase-TRUNK-on-Hadoop-2.0.0/trunk/hbase-server/target/surefire/surefirebooter4461103815341117102.jar /x1/jenkins/jenkins-slave/workspace/HBase-TRUNK-on-Hadoop-2.0.0/trunk/hbase-server/target/surefire/surefire4468456677310345488tmp /x1/jenkins/jenkins-slave/workspace/HBase-TRUNK-on-Hadoop-2.0.0/trunk/hbase-server/target/surefire/surefire_1201051145006142907050tmp
Running org.apache.hadoop.hbase.rest.TestScannersWithFilters
Tests run: 10, Failures: 0, Errors: 0, Skipped: 0, Time elapsed: 14.384 sec
Forking command line: /bin/sh -c cd /x1/jenkins/jenkins-slave/workspace/HBase-TRUNK-on-Hadoop-2.0.0/trunk/hbase-server && /x1/jenkins/tools/java/jdk1.6.0_32-32/jre/bin/java -enableassertions -Xmx1900m -Djava.security.egd=file:/dev/./urandom -Djava.net.preferIPv4Stack=true -jar /x1/jenkins/jenkins-slave/workspace/HBase-TRUNK-on-Hadoop-2.0.0/trunk/hbase-server/target/surefire/surefirebooter3271221609072547528.jar /x1/jenkins/jenkins-slave/workspace/HBase-TRUNK-on-Hadoop-2.0.0/trunk/hbase-server/target/surefire/surefire5795122470465832095tmp /x1/jenkins/jenkins-slave/workspace/HBase-TRUNK-on-Hadoop-2.0.0/trunk/hbase-server/target/surefire/surefire_1213586134350189918712tmp
Running org.apache.hadoop.hbase.io.hfile.TestHFileSeek
Tests run: 1, Failures: 0, Errors: 0, Skipped: 0, Time elapsed: 4.947 sec
Forking command line: /bin/sh -c cd /x1/jenkins/jenkins-slave/workspace/HBase-TRUNK-on-Hadoop-2.0.0/trunk/hbase-server && /x1/jenkins/tools/java/jdk1.6.0_32-32/jre/bin/java -enableassertions -Xmx1900m -Djava.security.egd=file:/dev/./urandom -Djava.net.preferIPv4Stack=true -jar /x1/jenkins/jenkins-slave/workspace/HBase-TRUNK-on-Hadoop-2.0.0/trunk/hbase-server/target/surefire/surefirebooter7750749203268491037.jar /x1/jenkins/jenkins-slave/workspace/HBase-TRUNK-on-Hadoop-2.0.0/trunk/hbase-server/target/surefire/surefire7735378100004016597tmp /x1/jenkins/jenkins-slave/workspace/HBase-TRUNK-on-Hadoop-2.0.0/trunk/hbase-server/target/surefire/surefire_1224871085350086806129tmp
Running org.apache.hadoop.hbase.io.hfile.TestHFileBlockIndex
Tests run: 10, Failures: 0, Errors: 0, Skipped: 0, Time elapsed: 7.734 sec
Forking command line: /bin/sh -c cd /x1/jenkins/jenkins-slave/workspace/HBase-TRUNK-on-Hadoop-2.0.0/trunk/hbase-server && /x1/jenkins/tools/java/jdk1.6.0_32-32/jre/bin/java -enableassertions -Xmx1900m -Djava.security.egd=file:/dev/./urandom -Djava.net.preferIPv4Stack=true -jar /x1/jenkins/jenkins-slave/workspace/HBase-TRUNK-on-Hadoop-2.0.0/trunk/hbase-server/target/surefire/surefirebooter4106436150911158254.jar /x1/jenkins/jenkins-slave/workspace/HBase-TRUNK-on-Hadoop-2.0.0/trunk/hbase-server/target/surefire/surefire6644915610694030533tmp /x1/jenkins/jenkins-slave/workspace/HBase-TRUNK-on-Hadoop-2.0.0/trunk/hbase-server/target/surefire/surefire_1237633525385325421346tmp
Running org.apache.hadoop.hbase.io.hfile.TestHFilePerformance
Tests run: 1, Failures: 0, Errors: 0, Skipped: 0, Time elapsed: 4.841 sec
Forking command line: /bin/sh -c cd /x1/jenkins/jenkins-slave/workspace/HBase-TRUNK-on-Hadoop-2.0.0/trunk/hbase-server && /x1/jenkins/tools/java/jdk1.6.0_32-32/jre/bin/java -enableassertions -Xmx1900m -Djava.security.egd=file:/dev/./urandom -Djava.net.preferIPv4Stack=true -jar /x1/jenkins/jenkins-slave/workspace/HBase-TRUNK-on-Hadoop-2.0.0/trunk/hbase-server/target/surefire/surefirebooter7392641409763220334.jar /x1/jenkins/jenkins-slave/workspace/HBase-TRUNK-on-Hadoop-2.0.0/trunk/hbase-server/target/surefire/surefire8976341119006249813tmp /x1/jenkins/jenkins-slave/workspace/HBase-TRUNK-on-Hadoop-2.0.0/trunk/hbase-server/target/surefire/surefire_1246387068389523407949tmp
Running org.apache.hadoop.hbase.io.hfile.TestCacheOnWrite
Tests run: 36, Failures: 0, Errors: 0, Skipped: 0, Time elapsed: 26.391 sec
Forking command line: /bin/sh -c cd /x1/jenkins/jenkins-slave/workspace/HBase-TRUNK-on-Hadoop-2.0.0/trunk/hbase-server && /x1/jenkins/tools/java/jdk1.6.0_32-32/jre/bin/java -enableassertions -Xmx1900m -Djava.security.egd=file:/dev/./urandom -Djava.net.preferIPv4Stack=true -jar /x1/jenkins/jenkins-slave/workspace/HBase-TRUNK-on-Hadoop-2.0.0/trunk/hbase-server/target/surefire/surefirebooter2139207353473581785.jar /x1/jenkins/jenkins-slave/workspace/HBase-TRUNK-on-Hadoop-2.0.0/trunk/hbase-server/target/surefire/surefire3749961885060076646tmp /x1/jenkins/jenkins-slave/workspace/HBase-TRUNK-on-Hadoop-2.0.0/trunk/hbase-server/target/surefire/surefire_125751447510882635448tmp
Running org.apache.hadoop.hbase.io.hfile.TestForceCacheImportantBlocks
Tests run: 4, Failures: 0, Errors: 0, Skipped: 0, Time elapsed: 35.378 sec
Forking command line: /bin/sh -c cd /x1/jenkins/jenkins-slave/workspace/HBase-TRUNK-on-Hadoop-2.0.0/trunk/hbase-server && /x1/jenkins/tools/java/jdk1.6.0_32-32/jre/bin/java -enableassertions -Xmx1900m -Djava.security.egd=file:/dev/./urandom -Djava.net.preferIPv4Stack=true -jar /x1/jenkins/jenkins-slave/workspace/HBase-TRUNK-on-Hadoop-2.0.0/trunk/hbase-server/target/surefire/surefirebooter1453305332742325901.jar /x1/jenkins/jenkins-slave/workspace/HBase-TRUNK-on-Hadoop-2.0.0/trunk/hbase-server/target/surefire/surefire8317932973702757510tmp /x1/jenkins/jenkins-slave/workspace/HBase-TRUNK-on-Hadoop-2.0.0/trunk/hbase-server/target/surefire/surefire_1266220760662746171805tmp
Running org.apache.hadoop.hbase.io.hfile.TestHFileBlock
Tests run: 16, Failures: 0, Errors: 0, Skipped: 0, Time elapsed: 48.833 sec
Forking command line: /bin/sh -c cd /x1/jenkins/jenkins-slave/workspace/HBase-TRUNK-on-Hadoop-2.0.0/trunk/hbase-server && /x1/jenkins/tools/java/jdk1.6.0_32-32/jre/bin/java -enableassertions -Xmx1900m -Djava.security.egd=file:/dev/./urandom -Djava.net.preferIPv4Stack=true -jar /x1/jenkins/jenkins-slave/workspace/HBase-TRUNK-on-Hadoop-2.0.0/trunk/hbase-server/target/surefire/surefirebooter7007469292102253983.jar /x1/jenkins/jenkins-slave/workspace/HBase-TRUNK-on-Hadoop-2.0.0/trunk/hbase-server/target/surefire/surefire4426447376059274442tmp /x1/jenkins/jenkins-slave/workspace/HBase-TRUNK-on-Hadoop-2.0.0/trunk/hbase-server/target/surefire/surefire_1273307863438802458975tmp
Running org.apache.hadoop.hbase.io.hfile.TestScannerSelectionUsingTTL
Tests run: 6, Failures: 0, Errors: 0, Skipped: 0, Time elapsed: 62.35 sec
Forking command line: /bin/sh -c cd /x1/jenkins/jenkins-slave/workspace/HBase-TRUNK-on-Hadoop-2.0.0/trunk/hbase-server && /x1/jenkins/tools/java/jdk1.6.0_32-32/jre/bin/java -enableassertions -Xmx1900m -Djava.security.egd=file:/dev/./urandom -Djava.net.preferIPv4Stack=true -jar /x1/jenkins/jenkins-slave/workspace/HBase-TRUNK-on-Hadoop-2.0.0/trunk/hbase-server/target/surefire/surefirebooter1155014554980689629.jar /x1/jenkins/jenkins-slave/workspace/HBase-TRUNK-on-Hadoop-2.0.0/trunk/hbase-server/target/surefire/surefire5768374582485501407tmp /x1/jenkins/jenkins-slave/workspace/HBase-TRUNK-on-Hadoop-2.0.0/trunk/hbase-server/target/surefire/surefire_1281493199470534815278tmp
Running org.apache.hadoop.hbase.io.hfile.slab.TestSlabCache
Tests run: 7, Failures: 0, Errors: 0, Skipped: 0, Time elapsed: 17.314 sec
Forking command line: /bin/sh -c cd /x1/jenkins/jenkins-slave/workspace/HBase-TRUNK-on-Hadoop-2.0.0/trunk/hbase-server && /x1/jenkins/tools/java/jdk1.6.0_32-32/jre/bin/java -enableassertions -Xmx1900m -Djava.security.egd=file:/dev/./urandom -Djava.net.preferIPv4Stack=true -jar /x1/jenkins/jenkins-slave/workspace/HBase-TRUNK-on-Hadoop-2.0.0/trunk/hbase-server/target/surefire/surefirebooter1465562457149788970.jar /x1/jenkins/jenkins-slave/workspace/HBase-TRUNK-on-Hadoop-2.0.0/trunk/hbase-server/target/surefire/surefire6426085145919300677tmp /x1/jenkins/jenkins-slave/workspace/HBase-TRUNK-on-Hadoop-2.0.0/trunk/hbase-server/target/surefire/surefire_1298139751984803811900tmp
Running org.apache.hadoop.hbase.io.TestFileLink
Tests run: 3, Failures: 0, Errors: 0, Skipped: 0, Time elapsed: 13.91 sec
Forking command line: /bin/sh -c cd /x1/jenkins/jenkins-slave/workspace/HBase-TRUNK-on-Hadoop-2.0.0/trunk/hbase-server && /x1/jenkins/tools/java/jdk1.6.0_32-32/jre/bin/java -enableassertions -Xmx1900m -Djava.security.egd=file:/dev/./urandom -Djava.net.preferIPv4Stack=true -jar /x1/jenkins/jenkins-slave/workspace/HBase-TRUNK-on-Hadoop-2.0.0/trunk/hbase-server/target/surefire/surefirebooter5150833013078072307.jar /x1/jenkins/jenkins-slave/workspace/HBase-TRUNK-on-Hadoop-2.0.0/trunk/hbase-server/target/surefire/surefire2521299325096656270tmp /x1/jenkins/jenkins-slave/workspace/HBase-TRUNK-on-Hadoop-2.0.0/trunk/hbase-server/target/surefire/surefire_1305924797267028819184tmp
Running org.apache.hadoop.hbase.io.hfile.slab.TestSingleSizeCache
Tests run: 5, Failures: 0, Errors: 0, Skipped: 0, Time elapsed: 30.58 sec
Forking command line: /bin/sh -c cd /x1/jenkins/jenkins-slave/workspace/HBase-TRUNK-on-Hadoop-2.0.0/trunk/hbase-server && /x1/jenkins/tools/java/jdk1.6.0_32-32/jre/bin/java -enableassertions -Xmx1900m -Djava.security.egd=file:/dev/./urandom -Djava.net.preferIPv4Stack=true -jar /x1/jenkins/jenkins-slave/workspace/HBase-TRUNK-on-Hadoop-2.0.0/trunk/hbase-server/target/surefire/surefirebooter1717468015258911243.jar /x1/jenkins/jenkins-slave/workspace/HBase-TRUNK-on-Hadoop-2.0.0/trunk/hbase-server/target/surefire/surefire9034462202828912199tmp /x1/jenkins/jenkins-slave/workspace/HBase-TRUNK-on-Hadoop-2.0.0/trunk/hbase-server/target/surefire/surefire_1314223796270720917498tmp
Running org.apache.hadoop.hbase.io.encoding.TestBufferedDataBlockEncoder
Tests run: 1, Failures: 0, Errors: 0, Skipped: 0, Time elapsed: 18.217 sec
Forking command line: /bin/sh -c cd /x1/jenkins/jenkins-slave/workspace/HBase-TRUNK-on-Hadoop-2.0.0/trunk/hbase-server && /x1/jenkins/tools/java/jdk1.6.0_32-32/jre/bin/java -enableassertions -Xmx1900m -Djava.security.egd=file:/dev/./urandom -Djava.net.preferIPv4Stack=true -jar /x1/jenkins/jenkins-slave/workspace/HBase-TRUNK-on-Hadoop-2.0.0/trunk/hbase-server/target/surefire/surefirebooter1859945154201521050.jar /x1/jenkins/jenkins-slave/workspace/HBase-TRUNK-on-Hadoop-2.0.0/trunk/hbase-server/target/surefire/surefire3331986400834670053tmp /x1/jenkins/jenkins-slave/workspace/HBase-TRUNK-on-Hadoop-2.0.0/trunk/hbase-server/target/surefire/surefire_1322509598578654360510tmp
Running org.apache.hadoop.hbase.io.encoding.TestEncodedSeekers
Tests run: 8, Failures: 0, Errors: 0, Skipped: 0, Time elapsed: 29.021 sec
Forking command line: /bin/sh -c cd /x1/jenkins/jenkins-slave/workspace/HBase-TRUNK-on-Hadoop-2.0.0/trunk/hbase-server && /x1/jenkins/tools/java/jdk1.6.0_32-32/jre/bin/java -enableassertions -Xmx1900m -Djava.security.egd=file:/dev/./urandom -Djava.net.preferIPv4Stack=true -jar /x1/jenkins/jenkins-slave/workspace/HBase-TRUNK-on-Hadoop-2.0.0/trunk/hbase-server/target/surefire/surefirebooter8853354905506065118.jar /x1/jenkins/jenkins-slave/workspace/HBase-TRUNK-on-Hadoop-2.0.0/trunk/hbase-server/target/surefire/surefire7801472219297428878tmp /x1/jenkins/jenkins-slave/workspace/HBase-TRUNK-on-Hadoop-2.0.0/trunk/hbase-server/target/surefire/surefire_133169663333696929382tmp
Running org.apache.hadoop.hbase.replication.TestReplicationZookeeper
Tests run: 1, Failures: 0, Errors: 0, Skipped: 0, Time elapsed: 0.593 sec
Forking command line: /bin/sh -c cd /x1/jenkins/jenkins-slave/workspace/HBase-TRUNK-on-Hadoop-2.0.0/trunk/hbase-server && /x1/jenkins/tools/java/jdk1.6.0_32-32/jre/bin/java -enableassertions -Xmx1900m -Djava.security.egd=file:/dev/./urandom -Djava.net.preferIPv4Stack=true -jar /x1/jenkins/jenkins-slave/workspace/HBase-TRUNK-on-Hadoop-2.0.0/trunk/hbase-server/target/surefire/surefirebooter1781511714656672350.jar /x1/jenkins/jenkins-slave/workspace/HBase-TRUNK-on-Hadoop-2.0.0/trunk/hbase-server/target/surefire/surefire6852283408102251956tmp /x1/jenkins/jenkins-slave/workspace/HBase-TRUNK-on-Hadoop-2.0.0/trunk/hbase-server/target/surefire/surefire_134673950981575581693tmp
Running org.apache.hadoop.hbase.replication.regionserver.TestReplicationSink
Tests run: 5, Failures: 0, Errors: 0, Skipped: 0, Time elapsed: 12.586 sec
Forking command line: /bin/sh -c cd /x1/jenkins/jenkins-slave/workspace/HBase-TRUNK-on-Hadoop-2.0.0/trunk/hbase-server && /x1/jenkins/tools/java/jdk1.6.0_32-32/jre/bin/java -enableassertions -Xmx1900m -Djava.security.egd=file:/dev/./urandom -Djava.net.preferIPv4Stack=true -jar /x1/jenkins/jenkins-slave/workspace/HBase-TRUNK-on-Hadoop-2.0.0/trunk/hbase-server/target/surefire/surefirebooter6144716628870531109.jar /x1/jenkins/jenkins-slave/workspace/HBase-TRUNK-on-Hadoop-2.0.0/trunk/hbase-server/target/surefire/surefire12734637520443188tmp /x1/jenkins/jenkins-slave/workspace/HBase-TRUNK-on-Hadoop-2.0.0/trunk/hbase-server/target/surefire/surefire_13515883000703560400tmp
Running org.apache.hadoop.hbase.replication.regionserver.TestReplicationSourceManager
Tests run: 1, Failures: 0, Errors: 0, Skipped: 0, Time elapsed: 1.364 sec
Forking command line: /bin/sh -c cd /x1/jenkins/jenkins-slave/workspace/HBase-TRUNK-on-Hadoop-2.0.0/trunk/hbase-server && /x1/jenkins/tools/java/jdk1.6.0_32-32/jre/bin/java -enableassertions -Xmx1900m -Djava.security.egd=file:/dev/./urandom -Djava.net.preferIPv4Stack=true -jar /x1/jenkins/jenkins-slave/workspace/HBase-TRUNK-on-Hadoop-2.0.0/trunk/hbase-server/target/surefire/surefirebooter2652890982831461278.jar /x1/jenkins/jenkins-slave/workspace/HBase-TRUNK-on-Hadoop-2.0.0/trunk/hbase-server/target/surefire/surefire9199468219346831923tmp /x1/jenkins/jenkins-slave/workspace/HBase-TRUNK-on-Hadoop-2.0.0/trunk/hbase-server/target/surefire/surefire_1364228030322071311407tmp
Running org.apache.hadoop.hbase.replication.TestReplicationSource
Tests run: 1, Failures: 0, Errors: 0, Skipped: 0, Time elapsed: 3.34 sec
Forking command line: /bin/sh -c cd /x1/jenkins/jenkins-slave/workspace/HBase-TRUNK-on-Hadoop-2.0.0/trunk/hbase-server && /x1/jenkins/tools/java/jdk1.6.0_32-32/jre/bin/java -enableassertions -Xmx1900m -Djava.security.egd=file:/dev/./urandom -Djava.net.preferIPv4Stack=true -jar /x1/jenkins/jenkins-slave/workspace/HBase-TRUNK-on-Hadoop-2.0.0/trunk/hbase-server/target/surefire/surefirebooter7896846400651157996.jar /x1/jenkins/jenkins-slave/workspace/HBase-TRUNK-on-Hadoop-2.0.0/trunk/hbase-server/target/surefire/surefire1041251033839286431tmp /x1/jenkins/jenkins-slave/workspace/HBase-TRUNK-on-Hadoop-2.0.0/trunk/hbase-server/target/surefire/surefire_1371313613336794849675tmp
Running org.apache.hadoop.hbase.util.TestFSTableDescriptors
Tests run: 11, Failures: 0, Errors: 0, Skipped: 0, Time elapsed: 1.233 sec
Forking command line: /bin/sh -c cd /x1/jenkins/jenkins-slave/workspace/HBase-TRUNK-on-Hadoop-2.0.0/trunk/hbase-server && /x1/jenkins/tools/java/jdk1.6.0_32-32/jre/bin/java -enableassertions -Xmx1900m -Djava.security.egd=file:/dev/./urandom -Djava.net.preferIPv4Stack=true -jar /x1/jenkins/jenkins-slave/workspace/HBase-TRUNK-on-Hadoop-2.0.0/trunk/hbase-server/target/surefire/surefirebooter3355597689608946260.jar /x1/jenkins/jenkins-slave/workspace/HBase-TRUNK-on-Hadoop-2.0.0/trunk/hbase-server/target/surefire/surefire3476140815403214715tmp /x1/jenkins/jenkins-slave/workspace/HBase-TRUNK-on-Hadoop-2.0.0/trunk/hbase-server/target/surefire/surefire_1382290977334092872061tmp
Running org.apache.hadoop.hbase.io.encoding.TestLoadAndSwitchEncodeOnDisk
Tests run: 1, Failures: 0, Errors: 0, Skipped: 0, Time elapsed: 33.924 sec
Forking command line: /bin/sh -c cd /x1/jenkins/jenkins-slave/workspace/HBase-TRUNK-on-Hadoop-2.0.0/trunk/hbase-server && /x1/jenkins/tools/java/jdk1.6.0_32-32/jre/bin/java -enableassertions -Xmx1900m -Djava.security.egd=file:/dev/./urandom -Djava.net.preferIPv4Stack=true -jar /x1/jenkins/jenkins-slave/workspace/HBase-TRUNK-on-Hadoop-2.0.0/trunk/hbase-server/target/surefire/surefirebooter47707136005517208.jar /x1/jenkins/jenkins-slave/workspace/HBase-TRUNK-on-Hadoop-2.0.0/trunk/hbase-server/target/surefire/surefire217790852449440297tmp /x1/jenkins/jenkins-slave/workspace/HBase-TRUNK-on-Hadoop-2.0.0/trunk/hbase-server/target/surefire/surefire_1398622689451933626129tmp
Running org.apache.hadoop.hbase.util.TestIdLock
Tests run: 1, Failures: 0, Errors: 0, Skipped: 0, Time elapsed: 15.354 sec
Forking command line: /bin/sh -c cd /x1/jenkins/jenkins-slave/workspace/HBase-TRUNK-on-Hadoop-2.0.0/trunk/hbase-server && /x1/jenkins/tools/java/jdk1.6.0_32-32/jre/bin/java -enableassertions -Xmx1900m -Djava.security.egd=file:/dev/./urandom -Djava.net.preferIPv4Stack=true -jar /x1/jenkins/jenkins-slave/workspace/HBase-TRUNK-on-Hadoop-2.0.0/trunk/hbase-server/target/surefire/surefirebooter116574412065806838.jar /x1/jenkins/jenkins-slave/workspace/HBase-TRUNK-on-Hadoop-2.0.0/trunk/hbase-server/target/surefire/surefire901412492214059979tmp /x1/jenkins/jenkins-slave/workspace/HBase-TRUNK-on-Hadoop-2.0.0/trunk/hbase-server/target/surefire/surefire_1402839151525559620758tmp
Running org.apache.hadoop.hbase.util.TestFSUtils
Tests run: 5, Failures: 0, Errors: 0, Skipped: 0, Time elapsed: 8.508 sec
Forking command line: /bin/sh -c cd /x1/jenkins/jenkins-slave/workspace/HBase-TRUNK-on-Hadoop-2.0.0/trunk/hbase-server && /x1/jenkins/tools/java/jdk1.6.0_32-32/jre/bin/java -enableassertions -Xmx1900m -Djava.security.egd=file:/dev/./urandom -Djava.net.preferIPv4Stack=true -jar /x1/jenkins/jenkins-slave/workspace/HBase-TRUNK-on-Hadoop-2.0.0/trunk/hbase-server/target/surefire/surefirebooter3591199054794795065.jar /x1/jenkins/jenkins-slave/workspace/HBase-TRUNK-on-Hadoop-2.0.0/trunk/hbase-server/target/surefire/surefire4542103615809748957tmp /x1/jenkins/jenkins-slave/workspace/HBase-TRUNK-on-Hadoop-2.0.0/trunk/hbase-server/target/surefire/surefire_1411018650248102161768tmp
Running org.apache.hadoop.hbase.util.TestMergeTable
Tests run: 1, Failures: 0, Errors: 0, Skipped: 0, Time elapsed: 19.956 sec
Forking command line: /bin/sh -c cd /x1/jenkins/jenkins-slave/workspace/HBase-TRUNK-on-Hadoop-2.0.0/trunk/hbase-server && /x1/jenkins/tools/java/jdk1.6.0_32-32/jre/bin/java -enableassertions -Xmx1900m -Djava.security.egd=file:/dev/./urandom -Djava.net.preferIPv4Stack=true -jar /x1/jenkins/jenkins-slave/workspace/HBase-TRUNK-on-Hadoop-2.0.0/trunk/hbase-server/target/surefire/surefirebooter7719511680124219567.jar /x1/jenkins/jenkins-slave/workspace/HBase-TRUNK-on-Hadoop-2.0.0/trunk/hbase-server/target/surefire/surefire5824378263834813822tmp /x1/jenkins/jenkins-slave/workspace/HBase-TRUNK-on-Hadoop-2.0.0/trunk/hbase-server/target/surefire/surefire_1422954984703141362165tmp
Running org.apache.hadoop.hbase.util.TestProcessBasedCluster
Tests run: 1, Failures: 0, Errors: 0, Skipped: 0, Time elapsed: 0.464 sec
Forking command line: /bin/sh -c cd /x1/jenkins/jenkins-slave/workspace/HBase-TRUNK-on-Hadoop-2.0.0/trunk/hbase-server && /x1/jenkins/tools/java/jdk1.6.0_32-32/jre/bin/java -enableassertions -Xmx1900m -Djava.security.egd=file:/dev/./urandom -Djava.net.preferIPv4Stack=true -jar /x1/jenkins/jenkins-slave/workspace/HBase-TRUNK-on-Hadoop-2.0.0/trunk/hbase-server/target/surefire/surefirebooter2697772655195727172.jar /x1/jenkins/jenkins-slave/workspace/HBase-TRUNK-on-Hadoop-2.0.0/trunk/hbase-server/target/surefire/surefire2553548740910817023tmp /x1/jenkins/jenkins-slave/workspace/HBase-TRUNK-on-Hadoop-2.0.0/trunk/hbase-server/target/surefire/surefire_1437938730189353286302tmp
Running org.apache.hadoop.hbase.util.TestRegionSplitter
Tests run: 5, Failures: 0, Errors: 0, Skipped: 0, Time elapsed: 11.78 sec
Forking command line: /bin/sh -c cd /x1/jenkins/jenkins-slave/workspace/HBase-TRUNK-on-Hadoop-2.0.0/trunk/hbase-server && /x1/jenkins/tools/java/jdk1.6.0_32-32/jre/bin/java -enableassertions -Xmx1900m -Djava.security.egd=file:/dev/./urandom -Djava.net.preferIPv4Stack=true -jar /x1/jenkins/jenkins-slave/workspace/HBase-TRUNK-on-Hadoop-2.0.0/trunk/hbase-server/target/surefire/surefirebooter336625036236329690.jar /x1/jenkins/jenkins-slave/workspace/HBase-TRUNK-on-Hadoop-2.0.0/trunk/hbase-server/target/surefire/surefire1741861243894951351tmp /x1/jenkins/jenkins-slave/workspace/HBase-TRUNK-on-Hadoop-2.0.0/trunk/hbase-server/target/surefire/surefire_144958002803682140910tmp
Running org.apache.hadoop.hbase.util.TestCoprocessorScanPolicy
Tests run: 2, Failures: 0, Errors: 0, Skipped: 0, Time elapsed: 9.885 sec
Forking command line: /bin/sh -c cd /x1/jenkins/jenkins-slave/workspace/HBase-TRUNK-on-Hadoop-2.0.0/trunk/hbase-server && /x1/jenkins/tools/java/jdk1.6.0_32-32/jre/bin/java -enableassertions -Xmx1900m -Djava.security.egd=file:/dev/./urandom -Djava.net.preferIPv4Stack=true -jar /x1/jenkins/jenkins-slave/workspace/HBase-TRUNK-on-Hadoop-2.0.0/trunk/hbase-server/target/surefire/surefirebooter8443137858470778187.jar /x1/jenkins/jenkins-slave/workspace/HBase-TRUNK-on-Hadoop-2.0.0/trunk/hbase-server/target/surefire/surefire1510806265171010220tmp /x1/jenkins/jenkins-slave/workspace/HBase-TRUNK-on-Hadoop-2.0.0/trunk/hbase-server/target/surefire/surefire_1457572593812883242061tmp
Running org.apache.hadoop.hbase.util.hbck.TestOfflineMetaRebuildBase
Tests run: 1, Failures: 0, Errors: 0, Skipped: 0, Time elapsed: 20.758 sec
Forking command line: /bin/sh -c cd /x1/jenkins/jenkins-slave/workspace/HBase-TRUNK-on-Hadoop-2.0.0/trunk/hbase-server && /x1/jenkins/tools/java/jdk1.6.0_32-32/jre/bin/java -enableassertions -Xmx1900m -Djava.security.egd=file:/dev/./urandom -Djava.net.preferIPv4Stack=true -jar /x1/jenkins/jenkins-slave/workspace/HBase-TRUNK-on-Hadoop-2.0.0/trunk/hbase-server/target/surefire/surefirebooter2809265259358080186.jar /x1/jenkins/jenkins-slave/workspace/HBase-TRUNK-on-Hadoop-2.0.0/trunk/hbase-server/target/surefire/surefire270714927326415766tmp /x1/jenkins/jenkins-slave/workspace/HBase-TRUNK-on-Hadoop-2.0.0/trunk/hbase-server/target/surefire/surefire_1465401672379809335489tmp
Running org.apache.hadoop.hbase.util.hbck.TestOfflineMetaRebuildOverlap
Tests run: 1, Failures: 0, Errors: 0, Skipped: 0, Time elapsed: 20.039 sec
Forking command line: /bin/sh -c cd /x1/jenkins/jenkins-slave/workspace/HBase-TRUNK-on-Hadoop-2.0.0/trunk/hbase-server && /x1/jenkins/tools/java/jdk1.6.0_32-32/jre/bin/java -enableassertions -Xmx1900m -Djava.security.egd=file:/dev/./urandom -Djava.net.preferIPv4Stack=true -jar /x1/jenkins/jenkins-slave/workspace/HBase-TRUNK-on-Hadoop-2.0.0/trunk/hbase-server/target/surefire/surefirebooter6476307479083128155.jar /x1/jenkins/jenkins-slave/workspace/HBase-TRUNK-on-Hadoop-2.0.0/trunk/hbase-server/target/surefire/surefire4702758064567052399tmp /x1/jenkins/jenkins-slave/workspace/HBase-TRUNK-on-Hadoop-2.0.0/trunk/hbase-server/target/surefire/surefire_1473940471482210936655tmp
Running org.apache.hadoop.hbase.util.TestDefaultEnvironmentEdge
Tests run: 1, Failures: 0, Errors: 0, Skipped: 0, Time elapsed: 0.285 sec
Forking command line: /bin/sh -c cd /x1/jenkins/jenkins-slave/workspace/HBase-TRUNK-on-Hadoop-2.0.0/trunk/hbase-server && /x1/jenkins/tools/java/jdk1.6.0_32-32/jre/bin/java -enableassertions -Xmx1900m -Djava.security.egd=file:/dev/./urandom -Djava.net.preferIPv4Stack=true -jar /x1/jenkins/jenkins-slave/workspace/HBase-TRUNK-on-Hadoop-2.0.0/trunk/hbase-server/target/surefire/surefirebooter8527544477336161625.jar /x1/jenkins/jenkins-slave/workspace/HBase-TRUNK-on-Hadoop-2.0.0/trunk/hbase-server/target/surefire/surefire612924336099166188tmp /x1/jenkins/jenkins-slave/workspace/HBase-TRUNK-on-Hadoop-2.0.0/trunk/hbase-server/target/surefire/surefire_1488496337582141759474tmp
Running org.apache.hadoop.hbase.TestInfoServers
Tests run: 3, Failures: 0, Errors: 0, Skipped: 0, Time elapsed: 9.464 sec
Running org.apache.hadoop.hbase.util.hbck.TestOfflineMetaRebuildHole
Tests run: 1, Failures: 0, Errors: 0, Skipped: 0, Time elapsed: 19.866 sec

Results :

Failed tests:   testSimpleCase(org.apache.hadoop.hbase.mapreduce.TestImportExport)

Tests run: 783, Failures: 1, Errors: 0, Skipped: 2

[INFO]                                                                         
[INFO] ------------------------------------------------------------------------
[INFO] Skipping HBase
[INFO] This project has been banned from the build due to previous failures.
[INFO] ------------------------------------------------------------------------
[INFO] ------------------------------------------------------------------------
[INFO] Reactor Summary:
[INFO] 
[INFO] HBase ............................................. SUCCESS [2.634s]
[INFO] HBase - Common .................................... SUCCESS [16.276s]
[INFO] HBase - Protocol .................................. SUCCESS [11.688s]
[INFO] HBase - Client .................................... SUCCESS [0.957s]
[INFO] HBase - Hadoop Compatibility ...................... SUCCESS [0.683s]
[INFO] HBase - Hadoop Two Compatibility .................. SUCCESS [3.130s]
[INFO] HBase - Server .................................... FAILURE [25:59.701s]
[INFO] HBase - Hadoop One Compatibility .................. SKIPPED
[INFO] HBase - Integration Tests ......................... SKIPPED
[INFO] HBase - Examples .................................. SKIPPED
[INFO] ------------------------------------------------------------------------
[INFO] BUILD FAILURE
[INFO] ------------------------------------------------------------------------
[INFO] Total time: 26:38.311s
[INFO] Finished at: Tue Jan 01 11:44:21 UTC 2013
[INFO] Final Memory: 60M/584M
[INFO] ------------------------------------------------------------------------
[ERROR] Failed to execute goal org.apache.maven.plugins:maven-surefire-plugin:2.12-TRUNK-HBASE-2:test (secondPartTestsExecution) on project hbase-server: There are test failures.
[ERROR] 
[ERROR] Please refer to /x1/jenkins/jenkins-slave/workspace/HBase-TRUNK-on-Hadoop-2.0.0/trunk/hbase-server/target/surefire-reports for the individual test results.
[ERROR] -> [Help 1]
org.apache.maven.lifecycle.LifecycleExecutionException: Failed to execute goal org.apache.maven.plugins:maven-surefire-plugin:2.12-TRUNK-HBASE-2:test (secondPartTestsExecution) on project hbase-server: There are test failures.

Please refer to /x1/jenkins/jenkins-slave/workspace/HBase-TRUNK-on-Hadoop-2.0.0/trunk/hbase-server/target/surefire-reports for the individual test results.
	at org.apache.maven.lifecycle.internal.MojoExecutor.execute(MojoExecutor.java:213)
	at org.apache.maven.lifecycle.internal.MojoExecutor.execute(MojoExecutor.java:153)
	at org.apache.maven.lifecycle.internal.MojoExecutor.execute(MojoExecutor.java:145)
	at org.apache.maven.lifecycle.internal.LifecycleModuleBuilder.buildProject(LifecycleModuleBuilder.java:84)
	at org.apache.maven.lifecycle.internal.LifecycleModuleBuilder.buildProject(LifecycleModuleBuilder.java:59)
	at org.apache.maven.lifecycle.internal.LifecycleStarter.singleThreadedBuild(LifecycleStarter.java:183)
	at org.apache.maven.lifecycle.internal.LifecycleStarter.execute(LifecycleStarter.java:161)
	at org.apache.maven.DefaultMaven.doExecute(DefaultMaven.java:320)
	at org.apache.maven.DefaultMaven.execute(DefaultMaven.java:156)
	at org.apache.maven.cli.MavenCli.execute(MavenCli.java:537)
	at org.apache.maven.cli.MavenCli.doMain(MavenCli.java:196)
	at org.apache.maven.cli.MavenCli.main(MavenCli.java:141)
	at sun.reflect.NativeMethodAccessorImpl.invoke0(Native Method)
	at sun.reflect.NativeMethodAccessorImpl.invoke(NativeMethodAccessorImpl.java:39)
	at sun.reflect.DelegatingMethodAccessorImpl.invoke(DelegatingMethodAccessorImpl.java:25)
	at java.lang.reflect.Method.invoke(Method.java:597)
	at org.codehaus.plexus.classworlds.launcher.Launcher.launchEnhanced(Launcher.java:290)
	at org.codehaus.plexus.classworlds.launcher.Launcher.launch(Launcher.java:230)
	at org.codehaus.plexus.classworlds.launcher.Launcher.mainWithExitCode(Launcher.java:409)
	at org.codehaus.plexus.classworlds.launcher.Launcher.main(Launcher.java:352)
Caused by: org.apache.maven.plugin.MojoFailureException: There are test failures.

Please refer to /x1/jenkins/jenkins-slave/workspace/HBase-TRUNK-on-Hadoop-2.0.0/trunk/hbase-server/target/surefire-reports for the individual test results.
	at org.apache.maven.plugin.surefire.SurefireHelper.reportExecution(SurefireHelper.java:87)
	at org.apache.maven.plugin.surefire.SurefirePlugin.writeSummary(SurefirePlugin.java:651)
	at org.apache.maven.plugin.surefire.SurefirePlugin.handleSummary(SurefirePlugin.java:625)
	at org.apache.maven.plugin.surefire.AbstractSurefireMojo.executeAfterPreconditionsChecked(AbstractSurefireMojo.java:137)
	at org.apache.maven.plugin.surefire.AbstractSurefireMojo.execute(AbstractSurefireMojo.java:98)
	at org.apache.maven.plugin.DefaultBuildPluginManager.executeMojo(DefaultBuildPluginManager.java:101)
	at org.apache.maven.lifecycle.internal.MojoExecutor.execute(MojoExecutor.java:209)
	... 19 more
[ERROR] 
[ERROR] 
[ERROR] For more information about the errors and possible solutions, please read the following articles:
[ERROR] [Help 1] http://cwiki.apache.org/confluence/display/MAVEN/MojoFailureException
[ERROR] 
[ERROR] After correcting the problems, you can resume the build with the command
[ERROR]   mvn <goals> -rf :hbase-server
Build step 'Invoke top-level Maven targets' marked build as failure
Archiving artifacts
Recording test results
Updating HBASE-7467
Updating HBASE-7299

Mime
View raw message