hbase-dev mailing list archives

Site index · List index
Message view « Date » · « Thread »
Top « Date » · « Thread »
From Apache Jenkins Server <jenk...@builds.apache.org>
Subject Build failed in Jenkins: HBase-TRUNK #3688
Date Wed, 02 Jan 2013 19:47:26 GMT
See <https://builds.apache.org/job/HBase-TRUNK/3688/>

------------------------------------------
[...truncated 3145 lines...]
Running org.apache.hadoop.hbase.master.TestMasterFileSystem
Tests run: 1, Failures: 0, Errors: 0, Skipped: 0, Time elapsed: 24.406 sec
Running org.apache.hadoop.hbase.master.TestMasterFailover
Tests run: 5, Failures: 0, Errors: 0, Skipped: 0, Time elapsed: 211.078 sec
Running org.apache.hadoop.hbase.TestFullLogReconstruction
Tests run: 1, Failures: 0, Errors: 0, Skipped: 0, Time elapsed: 60.671 sec
Running org.apache.hadoop.hbase.replication.TestReplicationZookeeper
Tests run: 1, Failures: 0, Errors: 0, Skipped: 0, Time elapsed: 1.888 sec
Running org.apache.hadoop.hbase.TestGlobalMemStoreSize
Tests run: 1, Failures: 0, Errors: 0, Skipped: 0, Time elapsed: 53.954 sec
Running org.apache.hadoop.hbase.replication.TestReplicationSource
Tests run: 1, Failures: 0, Errors: 0, Skipped: 0, Time elapsed: 10.305 sec
Running org.apache.hadoop.hbase.TestZooKeeper
Tests run: 9, Failures: 0, Errors: 0, Skipped: 0, Time elapsed: 67.184 sec
Running org.apache.hadoop.hbase.replication.regionserver.TestReplicationSink
Tests run: 5, Failures: 0, Errors: 0, Skipped: 0, Time elapsed: 43.745 sec
Running org.apache.hadoop.hbase.replication.regionserver.TestReplicationSourceManager
Tests run: 1, Failures: 0, Errors: 0, Skipped: 0, Time elapsed: 5.663 sec
Running org.apache.hadoop.hbase.master.TestRollingRestart
Tests run: 1, Failures: 0, Errors: 1, Skipped: 0, Time elapsed: 500.267 sec <<< FAILURE!
Running org.apache.hadoop.hbase.master.TestDistributedLogSplitting
Tests run: 4, Failures: 0, Errors: 0, Skipped: 0, Time elapsed: 292.005 sec
Running org.apache.hadoop.hbase.replication.TestMultiSlaveReplication
Tests run: 1, Failures: 0, Errors: 0, Skipped: 0, Time elapsed: 95.112 sec
Running org.apache.hadoop.hbase.replication.TestMasterReplication
Tests run: 2, Failures: 0, Errors: 0, Skipped: 0, Time elapsed: 169.87 sec
Running org.apache.hadoop.hbase.catalog.TestMetaReaderEditorNoCluster
Tests run: 2, Failures: 0, Errors: 0, Skipped: 0, Time elapsed: 5.825 sec
Running org.apache.hadoop.hbase.TestMultiVersions
Tests run: 3, Failures: 0, Errors: 0, Skipped: 0, Time elapsed: 45.465 sec
Running org.apache.hadoop.hbase.catalog.TestCatalogTracker
Tests run: 10, Failures: 0, Errors: 0, Skipped: 1, Time elapsed: 11.765 sec
Running org.apache.hadoop.hbase.catalog.TestMetaReaderEditor
Tests run: 5, Failures: 0, Errors: 0, Skipped: 0, Time elapsed: 56.141 sec
Running org.apache.hadoop.hbase.catalog.TestCatalogTrackerOnCluster
Tests run: 1, Failures: 0, Errors: 0, Skipped: 0, Time elapsed: 34.297 sec
Running org.apache.hadoop.hbase.TestHBaseTestingUtility
Tests run: 7, Failures: 0, Errors: 0, Skipped: 0, Time elapsed: 139.009 sec
Running org.apache.hadoop.hbase.coprocessor.TestAggregateProtocol
Tests run: 45, Failures: 0, Errors: 0, Skipped: 0, Time elapsed: 29.114 sec
Running org.apache.hadoop.hbase.catalog.TestMetaMigrationConvertingToPB
Tests run: 3, Failures: 0, Errors: 0, Skipped: 0, Time elapsed: 74.076 sec
Running org.apache.hadoop.hbase.coprocessor.TestRowProcessorEndpoint
Tests run: 4, Failures: 0, Errors: 0, Skipped: 0, Time elapsed: 44.938 sec
Running org.apache.hadoop.hbase.coprocessor.TestCoprocessorEndpoint
Tests run: 4, Failures: 0, Errors: 0, Skipped: 0, Time elapsed: 27.561 sec
Running org.apache.hadoop.hbase.coprocessor.TestMasterObserver
Tests run: 3, Failures: 0, Errors: 0, Skipped: 0, Time elapsed: 69.16 sec
Running org.apache.hadoop.hbase.coprocessor.TestClassLoading
Tests run: 7, Failures: 0, Errors: 0, Skipped: 0, Time elapsed: 52.132 sec
Running org.apache.hadoop.hbase.coprocessor.TestMasterCoprocessorExceptionWithRemove
Tests run: 1, Failures: 0, Errors: 0, Skipped: 0, Time elapsed: 25.8 sec
Running org.apache.hadoop.hbase.coprocessor.TestRegionObserverInterface
Tests run: 7, Failures: 0, Errors: 0, Skipped: 0, Time elapsed: 65.909 sec
Running org.apache.hadoop.hbase.coprocessor.TestRegionServerCoprocessorExceptionWithRemove
Tests run: 1, Failures: 0, Errors: 0, Skipped: 0, Time elapsed: 44.281 sec
Running org.apache.hadoop.hbase.coprocessor.TestMasterCoprocessorExceptionWithAbort
Tests run: 1, Failures: 0, Errors: 0, Skipped: 0, Time elapsed: 42.551 sec
Running org.apache.hadoop.hbase.coprocessor.TestWALObserver
Tests run: 3, Failures: 0, Errors: 0, Skipped: 0, Time elapsed: 38.106 sec
Running org.apache.hadoop.hbase.coprocessor.TestRegionObserverBypass
Tests run: 2, Failures: 0, Errors: 0, Skipped: 0, Time elapsed: 37.414 sec
Running org.apache.hadoop.hbase.thrift2.TestThriftHBaseServiceHandler
Tests run: 12, Failures: 0, Errors: 0, Skipped: 0, Time elapsed: 38.763 sec
Running org.apache.hadoop.hbase.coprocessor.TestRegionServerCoprocessorExceptionWithAbort
Tests run: 1, Failures: 0, Errors: 0, Skipped: 0, Time elapsed: 56.411 sec
Running org.apache.hadoop.hbase.trace.TestHTraceHooks
Tests run: 1, Failures: 0, Errors: 0, Skipped: 0, Time elapsed: 47.451 sec
Running org.apache.hadoop.hbase.thrift.TestThriftServerCmdLine
Tests run: 32, Failures: 0, Errors: 0, Skipped: 0, Time elapsed: 83.084 sec
Running org.apache.hadoop.hbase.replication.TestReplication
Tests run: 10, Failures: 0, Errors: 1, Skipped: 0, Time elapsed: 559.228 sec <<<
FAILURE!
Running org.apache.hadoop.hbase.regionserver.TestHRegionOnCluster
Tests run: 1, Failures: 0, Errors: 0, Skipped: 0, Time elapsed: 54.306 sec
Running org.apache.hadoop.hbase.regionserver.TestMemStore
Tests run: 21, Failures: 0, Errors: 0, Skipped: 0, Time elapsed: 30.928 sec
Running org.apache.hadoop.hbase.regionserver.TestMasterAddressManager
Tests run: 1, Failures: 0, Errors: 0, Skipped: 0, Time elapsed: 1.443 sec
Running org.apache.hadoop.hbase.thrift.TestThriftServer
Tests run: 1, Failures: 0, Errors: 0, Skipped: 0, Time elapsed: 135.236 sec
Running org.apache.hadoop.hbase.regionserver.TestRegionServerNoMaster
Tests run: 7, Failures: 0, Errors: 0, Skipped: 0, Time elapsed: 54.486 sec
Running org.apache.hadoop.hbase.regionserver.TestCompoundBloomFilter
Tests run: 3, Failures: 0, Errors: 0, Skipped: 0, Time elapsed: 20.093 sec
Running org.apache.hadoop.hbase.replication.TestReplicationWithCompression
Tests run: 10, Failures: 0, Errors: 0, Skipped: 0, Time elapsed: 542.637 sec
Running org.apache.hadoop.hbase.regionserver.TestSplitLogWorker
Tests run: 5, Failures: 0, Errors: 0, Skipped: 0, Time elapsed: 10.222 sec
Running org.apache.hadoop.hbase.regionserver.TestCompactionWithCoprocessor
Tests run: 15, Failures: 0, Errors: 0, Skipped: 0, Time elapsed: 35.485 sec
Running org.apache.hadoop.hbase.regionserver.TestHRegion
Tests run: 58, Failures: 0, Errors: 0, Skipped: 0, Time elapsed: 63.788 sec
Running org.apache.hadoop.hbase.regionserver.TestRegionServerMetrics
Tests run: 8, Failures: 0, Errors: 0, Skipped: 0, Time elapsed: 62.423 sec
Running org.apache.hadoop.hbase.regionserver.TestStore
Tests run: 13, Failures: 0, Errors: 0, Skipped: 0, Time elapsed: 10.705 sec
Running org.apache.hadoop.hbase.regionserver.TestServerCustomProtocol
Tests run: 7, Failures: 0, Errors: 0, Skipped: 0, Time elapsed: 39.022 sec
Running org.apache.hadoop.hbase.regionserver.TestStoreFileBlockCacheSummary
Tests run: 1, Failures: 0, Errors: 0, Skipped: 0, Time elapsed: 35.94 sec
Running org.apache.hadoop.hbase.regionserver.TestBlocksRead
Tests run: 4, Failures: 0, Errors: 0, Skipped: 0, Time elapsed: 1.801 sec
Running org.apache.hadoop.hbase.regionserver.TestAtomicOperation
Tests run: 5, Failures: 0, Errors: 0, Skipped: 0, Time elapsed: 28.946 sec
Running org.apache.hadoop.hbase.regionserver.TestFSErrorsExposed
Tests run: 3, Failures: 0, Errors: 0, Skipped: 1, Time elapsed: 1.03 sec
Running org.apache.hadoop.hbase.regionserver.TestHRegionBusyWait
Tests run: 59, Failures: 0, Errors: 0, Skipped: 0, Time elapsed: 63.898 sec
Running org.apache.hadoop.hbase.regionserver.TestSeekOptimizations
Tests run: 6, Failures: 0, Errors: 0, Skipped: 0, Time elapsed: 3.546 sec
Running org.apache.hadoop.hbase.regionserver.handler.TestCloseRegionHandler
Tests run: 3, Failures: 0, Errors: 0, Skipped: 0, Time elapsed: 3.318 sec
Running org.apache.hadoop.hbase.regionserver.handler.TestOpenRegionHandler
Tests run: 3, Failures: 0, Errors: 0, Skipped: 0, Time elapsed: 3.108 sec
Running org.apache.hadoop.hbase.regionserver.TestClusterId
Tests run: 1, Failures: 0, Errors: 0, Skipped: 0, Time elapsed: 48.334 sec
Running org.apache.hadoop.hbase.regionserver.TestGetClosestAtOrBefore
Tests run: 3, Failures: 0, Errors: 0, Skipped: 0, Time elapsed: 1.33 sec
Running org.apache.hadoop.hbase.regionserver.TestParallelPut
Tests run: 2, Failures: 0, Errors: 0, Skipped: 0, Time elapsed: 5.803 sec
Running org.apache.hadoop.hbase.regionserver.TestCacheOnWriteInSchema
Tests run: 3, Failures: 0, Errors: 0, Skipped: 0, Time elapsed: 1.839 sec
Running org.apache.hadoop.hbase.regionserver.TestPriorityRpc
Tests run: 3, Failures: 0, Errors: 0, Skipped: 0, Time elapsed: 1.422 sec
Running org.apache.hadoop.hbase.regionserver.TestRSKilledWhenMasterInitializing
Tests run: 1, Failures: 0, Errors: 0, Skipped: 0, Time elapsed: 69.237 sec
Running org.apache.hadoop.hbase.regionserver.wal.TestLogRollAbort
Tests run: 1, Failures: 0, Errors: 0, Skipped: 0, Time elapsed: 37.618 sec
Running org.apache.hadoop.hbase.regionserver.TestHRegionServerBulkLoad
Tests run: 1, Failures: 0, Errors: 0, Skipped: 0, Time elapsed: 66.352 sec
Running org.apache.hadoop.hbase.regionserver.TestSplitTransactionOnCluster
Tests run: 10, Failures: 0, Errors: 0, Skipped: 0, Time elapsed: 135.207 sec
Running org.apache.hadoop.hbase.regionserver.TestCompactionState
Tests run: 5, Failures: 0, Errors: 0, Skipped: 0, Time elapsed: 164.352 sec
Running org.apache.hadoop.hbase.regionserver.wal.TestHLog
Tests run: 11, Failures: 0, Errors: 0, Skipped: 0, Time elapsed: 91.809 sec
Running org.apache.hadoop.hbase.regionserver.wal.TestWALReplay
Tests run: 7, Failures: 0, Errors: 0, Skipped: 0, Time elapsed: 86.482 sec
Running org.apache.hadoop.hbase.regionserver.wal.TestWALReplayCompressed
Tests run: 7, Failures: 0, Errors: 0, Skipped: 0, Time elapsed: 85.841 sec
Running org.apache.hadoop.hbase.regionserver.TestStoreScanner
Tests run: 16, Failures: 0, Errors: 0, Skipped: 0, Time elapsed: 0.22 sec
Running org.apache.hadoop.hbase.regionserver.wal.TestLogRolling
Tests run: 2, Failures: 0, Errors: 0, Skipped: 0, Time elapsed: 298.568 sec
Running org.apache.hadoop.hbase.regionserver.wal.TestHLogFiltering
Tests run: 1, Failures: 0, Errors: 0, Skipped: 0, Time elapsed: 49.255 sec
Running org.apache.hadoop.hbase.regionserver.TestCompaction
Tests run: 15, Failures: 0, Errors: 0, Skipped: 0, Time elapsed: 34.31 sec
Running org.apache.hadoop.hbase.regionserver.TestMultiColumnScanner
Tests run: 12, Failures: 0, Errors: 0, Skipped: 0, Time elapsed: 31.006 sec
Running org.apache.hadoop.hbase.regionserver.TestEndToEndSplitTransaction
Tests run: 2, Failures: 0, Errors: 0, Skipped: 0, Time elapsed: 89.66 sec
Running org.apache.hadoop.hbase.regionserver.wal.TestHLogSplit
Tests run: 32, Failures: 0, Errors: 0, Skipped: 1, Time elapsed: 358.318 sec
Running org.apache.hadoop.hbase.mapred.TestTableInputFormat
Tests run: 10, Failures: 0, Errors: 0, Skipped: 0, Time elapsed: 60.333 sec
Running org.apache.hadoop.hbase.backup.example.TestZooKeeperTableArchiveClient
Tests run: 3, Failures: 0, Errors: 0, Skipped: 0, Time elapsed: 10.686 sec
Running org.apache.hadoop.hbase.fs.TestBlockReorder
Tests run: 3, Failures: 0, Errors: 0, Skipped: 0, Time elapsed: 78.184 sec
Running org.apache.hadoop.hbase.regionserver.wal.TestHLogSplitCompressed
Tests run: 32, Failures: 0, Errors: 0, Skipped: 1, Time elapsed: 359.109 sec
Running org.apache.hadoop.hbase.TestClusterBootOrder
Tests run: 2, Failures: 0, Errors: 0, Skipped: 0, Time elapsed: 58.36 sec
Running org.apache.hadoop.hbase.TestDrainingServer
Tests run: 2, Failures: 0, Errors: 0, Skipped: 0, Time elapsed: 51.251 sec
Running org.apache.hadoop.hbase.mapreduce.TestRowCounter
Tests run: 3, Failures: 0, Errors: 0, Skipped: 0, Time elapsed: 69.538 sec
Running org.apache.hadoop.hbase.mapreduce.TestTimeRangeMapRed
Tests run: 1, Failures: 0, Errors: 0, Skipped: 0, Time elapsed: 104.661 sec
Running org.apache.hadoop.hbase.mapred.TestTableMapReduce
Tests run: 1, Failures: 0, Errors: 0, Skipped: 0, Time elapsed: 225.339 sec
Running org.apache.hadoop.hbase.mapreduce.TestImportExport
Tests run: 3, Failures: 0, Errors: 0, Skipped: 0, Time elapsed: 74.965 sec
Running org.apache.hadoop.hbase.backup.TestHFileArchiving
Tests run: 4, Failures: 0, Errors: 0, Skipped: 0, Time elapsed: 265.769 sec
Running org.apache.hadoop.hbase.mapreduce.TestWALPlayer
Tests run: 1, Failures: 0, Errors: 0, Skipped: 0, Time elapsed: 53.595 sec
Running org.apache.hadoop.hbase.mapreduce.TestMultithreadedTableMapper
Tests run: 1, Failures: 0, Errors: 0, Skipped: 0, Time elapsed: 134.302 sec
Running org.apache.hadoop.hbase.mapreduce.TestLoadIncrementalHFilesSplitRecovery
Tests run: 4, Failures: 0, Errors: 0, Skipped: 0, Time elapsed: 133.413 sec
Running org.apache.hadoop.hbase.mapreduce.TestLoadIncrementalHFiles
Tests run: 6, Failures: 0, Errors: 0, Skipped: 0, Time elapsed: 62.844 sec
Running org.apache.hadoop.hbase.mapreduce.TestHLogRecordReader
Tests run: 2, Failures: 0, Errors: 0, Skipped: 0, Time elapsed: 9.369 sec
Running org.apache.hadoop.hbase.mapreduce.TestTableMapReduce
Tests run: 1, Failures: 0, Errors: 0, Skipped: 0, Time elapsed: 126.54 sec
Running org.apache.hadoop.hbase.mapreduce.TestHFileOutputFormat
Tests run: 10, Failures: 0, Errors: 0, Skipped: 0, Time elapsed: 449.003 sec
Running org.apache.hadoop.hbase.mapreduce.TestImportTsv
Tests run: 13, Failures: 0, Errors: 0, Skipped: 0, Time elapsed: 405.977 sec
Running org.apache.hadoop.hbase.mapreduce.TestTableInputFormatScan
Tests run: 12, Failures: 0, Errors: 0, Skipped: 0, Time elapsed: 444.825 sec

Results :

Failed tests:   testRegionShouldNotBeDeployed(org.apache.hadoop.hbase.util.TestHBaseFsck):
expected:<[SHOULD_NOT_BE_DEPLOYED]> but was:<[]>

Tests in error: 
  testRegionCaching(org.apache.hadoop.hbase.client.TestHCM): test timed out after 60000 milliseconds
  testBasicRollingRestart(org.apache.hadoop.hbase.master.TestRollingRestart): test timed out
after 500000 milliseconds
  queueFailover(org.apache.hadoop.hbase.replication.TestReplication): Failed 3 actions: ExecutionException:
3 times, 

Tests run: 1304, Failures: 1, Errors: 3, Skipped: 13

[INFO]                                                                         
[INFO] ------------------------------------------------------------------------
[INFO] Skipping HBase
[INFO] This project has been banned from the build due to previous failures.
[INFO] ------------------------------------------------------------------------
[INFO]                                                                         
[INFO] ------------------------------------------------------------------------
[INFO] Skipping HBase
[INFO] This project has been banned from the build due to previous failures.
[INFO] ------------------------------------------------------------------------
[INFO] ------------------------------------------------------------------------
[INFO] Reactor Summary:
[INFO] 
[INFO] HBase ............................................. SUCCESS [8.252s]
[INFO] HBase - Common .................................... SUCCESS [19.215s]
[INFO] HBase - Protocol .................................. SUCCESS [7.052s]
[INFO] HBase - Client .................................... SUCCESS [0.729s]
[INFO] HBase - Hadoop Compatibility ...................... SUCCESS [0.738s]
[INFO] HBase - Hadoop One Compatibility .................. SUCCESS [1.659s]
[INFO] HBase - Server .................................... FAILURE [1:00:43.636s]
[INFO] HBase - Hadoop Two Compatibility .................. SKIPPED
[INFO] HBase - Integration Tests ......................... SKIPPED
[INFO] HBase - Examples .................................. SKIPPED
[INFO] ------------------------------------------------------------------------
[INFO] BUILD FAILURE
[INFO] ------------------------------------------------------------------------
[INFO] Total time: 1:01:22.272s
[INFO] Finished at: Wed Jan 02 19:46:51 UTC 2013
[INFO] Final Memory: 33M/1051M
[INFO] ------------------------------------------------------------------------
[ERROR] Failed to execute goal org.apache.maven.plugins:maven-surefire-plugin:2.12-TRUNK-HBASE-2:test
(secondPartTestsExecution) on project hbase-server: Failure or timeout -> [Help 1]
[ERROR] 
[ERROR] To see the full stack trace of the errors, re-run Maven with the -e switch.
[ERROR] Re-run Maven using the -X switch to enable full debug logging.
[ERROR] 
[ERROR] For more information about the errors and possible solutions, please read the following
articles:
[ERROR] [Help 1] http://cwiki.apache.org/confluence/display/MAVEN/MojoExecutionException
[ERROR] 
[ERROR] After correcting the problems, you can resume the build with the command
[ERROR]   mvn <goals> -rf :hbase-server
Build step 'Invoke top-level Maven targets' marked build as failure
Archiving artifacts
Recording test results

Mime
View raw message