hbase-dev mailing list archives

Site index · List index
Message view « Date » · « Thread »
Top « Date » · « Thread »
From Apache Jenkins Server <jenk...@builds.apache.org>
Subject Build failed in Jenkins: HBase-TRUNK #3681
Date Tue, 01 Jan 2013 08:06:33 GMT
See <https://builds.apache.org/job/HBase-TRUNK/3681/>

------------------------------------------
[...truncated 3145 lines...]
Tests run: 4, Failures: 0, Errors: 0, Skipped: 0, Time elapsed: 56.565 sec
Running org.apache.hadoop.hbase.regionserver.wal.TestLogRolling
Tests run: 2, Failures: 0, Errors: 0, Skipped: 0, Time elapsed: 294.847 sec
Running org.apache.hadoop.hbase.coprocessor.TestRegionServerCoprocessorExceptionWithAbort
Tests run: 1, Failures: 0, Errors: 0, Skipped: 0, Time elapsed: 44.564 sec
Running org.apache.hadoop.hbase.regionserver.wal.TestHLogSplitCompressed
Tests run: 32, Failures: 0, Errors: 0, Skipped: 1, Time elapsed: 381.208 sec
Running org.apache.hadoop.hbase.regionserver.wal.TestHLogSplit
Tests run: 32, Failures: 0, Errors: 0, Skipped: 1, Time elapsed: 399.465 sec
Running org.apache.hadoop.hbase.coprocessor.TestCoprocessorEndpoint
Tests run: 4, Failures: 0, Errors: 0, Skipped: 0, Time elapsed: 41.374 sec
Running org.apache.hadoop.hbase.coprocessor.TestWALObserver
Tests run: 3, Failures: 0, Errors: 0, Skipped: 0, Time elapsed: 43.321 sec
Running org.apache.hadoop.hbase.coprocessor.TestMasterObserver
Tests run: 3, Failures: 0, Errors: 0, Skipped: 0, Time elapsed: 89.057 sec
Running org.apache.hadoop.hbase.coprocessor.TestMasterCoprocessorExceptionWithAbort
Tests run: 1, Failures: 0, Errors: 0, Skipped: 0, Time elapsed: 42.251 sec
Running org.apache.hadoop.hbase.coprocessor.TestMasterCoprocessorExceptionWithRemove
Tests run: 1, Failures: 0, Errors: 0, Skipped: 0, Time elapsed: 37.828 sec
Running org.apache.hadoop.hbase.coprocessor.TestRegionObserverBypass
Tests run: 2, Failures: 0, Errors: 0, Skipped: 0, Time elapsed: 35.792 sec
Running org.apache.hadoop.hbase.coprocessor.TestRegionObserverInterface
Tests run: 7, Failures: 0, Errors: 0, Skipped: 0, Time elapsed: 87.135 sec
Running org.apache.hadoop.hbase.TestGlobalMemStoreSize
Tests run: 1, Failures: 0, Errors: 0, Skipped: 0, Time elapsed: 61.462 sec
Running org.apache.hadoop.hbase.mapreduce.TestHLogRecordReader
Tests run: 2, Failures: 0, Errors: 0, Skipped: 0, Time elapsed: 12.928 sec
Running org.apache.hadoop.hbase.mapred.TestTableInputFormat
Tests run: 10, Failures: 0, Errors: 0, Skipped: 0, Time elapsed: 80.434 sec
Running org.apache.hadoop.hbase.fs.TestBlockReorder
Tests run: 3, Failures: 0, Errors: 0, Skipped: 0, Time elapsed: 104.282 sec
Running org.apache.hadoop.hbase.mapreduce.TestLoadIncrementalHFilesSplitRecovery
Tests run: 4, Failures: 0, Errors: 0, Skipped: 0, Time elapsed: 137.855 sec
Running org.apache.hadoop.hbase.mapred.TestTableMapReduce
Tests run: 1, Failures: 0, Errors: 0, Skipped: 0, Time elapsed: 250.073 sec
Running org.apache.hadoop.hbase.mapreduce.TestWALPlayer
Tests run: 1, Failures: 0, Errors: 0, Skipped: 0, Time elapsed: 127.032 sec
Running org.apache.hadoop.hbase.mapreduce.TestTableMapReduce
Tests run: 1, Failures: 0, Errors: 0, Skipped: 0, Time elapsed: 196.961 sec
Running org.apache.hadoop.hbase.mapreduce.TestRowCounter
Tests run: 3, Failures: 0, Errors: 0, Skipped: 0, Time elapsed: 99.019 sec
Running org.apache.hadoop.hbase.mapreduce.TestTimeRangeMapRed
Tests run: 1, Failures: 0, Errors: 0, Skipped: 0, Time elapsed: 65.657 sec
Running org.apache.hadoop.hbase.mapreduce.TestMultithreadedTableMapper
Tests run: 1, Failures: 0, Errors: 0, Skipped: 0, Time elapsed: 172.455 sec
Running org.apache.hadoop.hbase.mapreduce.TestLoadIncrementalHFiles
Tests run: 6, Failures: 0, Errors: 0, Skipped: 0, Time elapsed: 61.698 sec
Running org.apache.hadoop.hbase.mapreduce.TestImportExport
Tests run: 3, Failures: 0, Errors: 0, Skipped: 0, Time elapsed: 90.822 sec
Running org.apache.hadoop.hbase.trace.TestHTraceHooks
Tests run: 1, Failures: 0, Errors: 0, Skipped: 0, Time elapsed: 41.204 sec
Running org.apache.hadoop.hbase.thrift2.TestThriftHBaseServiceHandler
Tests run: 12, Failures: 0, Errors: 0, Skipped: 0, Time elapsed: 30.761 sec
Running org.apache.hadoop.hbase.catalog.TestMetaReaderEditorNoCluster
Tests run: 2, Failures: 0, Errors: 0, Skipped: 0, Time elapsed: 9.295 sec
Running org.apache.hadoop.hbase.TestAcidGuarantees
Tests run: 3, Failures: 0, Errors: 0, Skipped: 0, Time elapsed: 180.906 sec
Running org.apache.hadoop.hbase.mapreduce.TestHFileOutputFormat
Tests run: 10, Failures: 0, Errors: 0, Skipped: 0, Time elapsed: 587.392 sec
Running org.apache.hadoop.hbase.catalog.TestMetaReaderEditor
Tests run: 5, Failures: 0, Errors: 0, Skipped: 0, Time elapsed: 81.524 sec
Running org.apache.hadoop.hbase.catalog.TestCatalogTracker
Tests run: 10, Failures: 0, Errors: 0, Skipped: 1, Time elapsed: 11.407 sec
Running org.apache.hadoop.hbase.catalog.TestCatalogTrackerOnCluster
Tests run: 1, Failures: 0, Errors: 0, Skipped: 0, Time elapsed: 43.978 sec
Running org.apache.hadoop.hbase.mapreduce.TestImportTsv
Tests run: 13, Failures: 0, Errors: 0, Skipped: 0, Time elapsed: 498.598 sec
Running org.apache.hadoop.hbase.mapreduce.TestTableInputFormatScan
Tests run: 12, Failures: 0, Errors: 0, Skipped: 0, Time elapsed: 487.487 sec
Running org.apache.hadoop.hbase.client.TestTimestampsFilter
Tests run: 3, Failures: 0, Errors: 0, Skipped: 0, Time elapsed: 55.08 sec
Running org.apache.hadoop.hbase.client.TestFromClientSide3
Tests run: 1, Failures: 0, Errors: 0, Skipped: 0, Time elapsed: 63.635 sec
Running org.apache.hadoop.hbase.catalog.TestMetaMigrationConvertingToPB
Tests run: 3, Failures: 0, Errors: 0, Skipped: 0, Time elapsed: 88.405 sec
Running org.apache.hadoop.hbase.client.TestClientTimeouts
Tests run: 1, Failures: 0, Errors: 0, Skipped: 0, Time elapsed: 36.111 sec
Running org.apache.hadoop.hbase.client.TestScannersFromClientSide
Tests run: 4, Failures: 0, Errors: 0, Skipped: 0, Time elapsed: 64.189 sec
Running org.apache.hadoop.hbase.client.TestScannerTimeout
Tests run: 4, Failures: 0, Errors: 0, Skipped: 0, Time elapsed: 83.078 sec
Running org.apache.hadoop.hbase.client.TestHCM
Tests run: 7, Failures: 0, Errors: 1, Skipped: 0, Time elapsed: 107.403 sec <<< FAILURE!
Running org.apache.hadoop.hbase.client.TestHTableMultiplexer
Tests run: 1, Failures: 0, Errors: 0, Skipped: 0, Time elapsed: 58.259 sec
Running org.apache.hadoop.hbase.client.TestMetaScanner
Tests run: 1, Failures: 0, Errors: 0, Skipped: 0, Time elapsed: 42.165 sec
Running org.apache.hadoop.hbase.client.TestHTableUtil
Tests run: 2, Failures: 0, Errors: 0, Skipped: 0, Time elapsed: 41.305 sec
Running org.apache.hadoop.hbase.client.TestHTablePool$TestHTableReusablePool
Tests run: 8, Failures: 0, Errors: 0, Skipped: 0, Time elapsed: 11.821 sec
Running org.apache.hadoop.hbase.client.TestHTablePool$TestHTableThreadLocalPool
Tests run: 8, Failures: 0, Errors: 0, Skipped: 0, Time elapsed: 57.287 sec
Running org.apache.hadoop.hbase.client.TestShell
Tests run: 1, Failures: 0, Errors: 0, Skipped: 0, Time elapsed: 306.715 sec
Running org.apache.hadoop.hbase.client.replication.TestReplicationAdmin
Tests run: 1, Failures: 0, Errors: 0, Skipped: 0, Time elapsed: 3.618 sec
Running org.apache.hadoop.hbase.client.TestClientScannerRPCTimeout
Tests run: 1, Failures: 0, Errors: 0, Skipped: 0, Time elapsed: 54.615 sec
Running org.apache.hadoop.hbase.client.TestMultipleTimestamps
Tests run: 8, Failures: 0, Errors: 0, Skipped: 0, Time elapsed: 80.297 sec
Running org.apache.hadoop.hbase.constraint.TestConstraint
Tests run: 5, Failures: 0, Errors: 0, Skipped: 0, Time elapsed: 85.074 sec
Running org.apache.hadoop.hbase.client.TestFromClientSide
Tests run: 62, Failures: 0, Errors: 0, Skipped: 3, Time elapsed: 442.491 sec
Running org.apache.hadoop.hbase.rest.TestGzipFilter
Tests run: 2, Failures: 0, Errors: 0, Skipped: 0, Time elapsed: 45.698 sec
Running org.apache.hadoop.hbase.rest.TestMultiRowResource
Tests run: 3, Failures: 0, Errors: 0, Skipped: 0, Time elapsed: 50.547 sec
Running org.apache.hadoop.hbase.client.TestMultiParallel
Tests run: 11, Failures: 0, Errors: 0, Skipped: 0, Time elapsed: 203.461 sec
Running org.apache.hadoop.hbase.rest.TestScannersWithFilters
Tests run: 10, Failures: 0, Errors: 0, Skipped: 0, Time elapsed: 61.27 sec
Running org.apache.hadoop.hbase.client.TestFromClientSideWithCoprocessor
Tests run: 62, Failures: 0, Errors: 0, Skipped: 3, Time elapsed: 446.205 sec
Running org.apache.hadoop.hbase.rest.TestRowResource
Tests run: 12, Failures: 0, Errors: 0, Skipped: 0, Time elapsed: 53.84 sec
Running org.apache.hadoop.hbase.rest.client.TestRemoteTable
Tests run: 4, Failures: 0, Errors: 0, Skipped: 0, Time elapsed: 43.725 sec
Running org.apache.hadoop.hbase.rest.client.TestRemoteAdmin
Tests run: 1, Failures: 0, Errors: 0, Skipped: 0, Time elapsed: 46.031 sec
Running org.apache.hadoop.hbase.rest.TestVersionResource
Tests run: 7, Failures: 0, Errors: 0, Skipped: 0, Time elapsed: 40.729 sec
Running org.apache.hadoop.hbase.rest.TestStatusResource
Tests run: 2, Failures: 0, Errors: 0, Skipped: 0, Time elapsed: 35.444 sec
Running org.apache.hadoop.hbase.rest.TestScannerResource
Tests run: 5, Failures: 0, Errors: 0, Skipped: 0, Time elapsed: 58.231 sec
Running org.apache.hadoop.hbase.rest.TestTableResource
Tests run: 8, Failures: 0, Errors: 0, Skipped: 0, Time elapsed: 60.754 sec
Running org.apache.hadoop.hbase.rest.TestSchemaResource
Tests run: 2, Failures: 0, Errors: 0, Skipped: 0, Time elapsed: 45.789 sec
Running org.apache.hadoop.hbase.io.encoding.TestEncodedSeekers
Tests run: 8, Failures: 0, Errors: 0, Skipped: 0, Time elapsed: 32.764 sec
Running org.apache.hadoop.hbase.thrift.TestThriftServerCmdLine
Tests run: 32, Failures: 0, Errors: 0, Skipped: 0, Time elapsed: 77.031 sec
Running org.apache.hadoop.hbase.io.encoding.TestLoadAndSwitchEncodeOnDisk
Tests run: 1, Failures: 0, Errors: 0, Skipped: 0, Time elapsed: 70.315 sec
Running org.apache.hadoop.hbase.io.encoding.TestBufferedDataBlockEncoder
Tests run: 1, Failures: 0, Errors: 0, Skipped: 0, Time elapsed: 18.335 sec
Running org.apache.hadoop.hbase.client.TestAdmin
Tests run: 42, Failures: 0, Errors: 0, Skipped: 0, Time elapsed: 403.767 sec
Running org.apache.hadoop.hbase.io.hfile.TestHFileSeek
Tests run: 1, Failures: 0, Errors: 0, Skipped: 0, Time elapsed: 5.591 sec
Running org.apache.hadoop.hbase.thrift.TestThriftServer
Tests run: 1, Failures: 0, Errors: 0, Skipped: 0, Time elapsed: 125.246 sec
Running org.apache.hadoop.hbase.io.hfile.slab.TestSlabCache
Tests run: 7, Failures: 0, Errors: 0, Skipped: 0, Time elapsed: 18.347 sec
Running org.apache.hadoop.hbase.io.hfile.TestHFileBlockIndex
Tests run: 10, Failures: 0, Errors: 0, Skipped: 0, Time elapsed: 9.478 sec
Running org.apache.hadoop.hbase.io.hfile.TestHFilePerformance
Tests run: 1, Failures: 0, Errors: 0, Skipped: 0, Time elapsed: 5.713 sec
Running org.apache.hadoop.hbase.io.hfile.slab.TestSingleSizeCache
Tests run: 5, Failures: 0, Errors: 0, Skipped: 0, Time elapsed: 24.463 sec
Running org.apache.hadoop.hbase.io.encoding.TestUpgradeFromHFileV1ToEncoding
Tests run: 1, Failures: 0, Errors: 0, Skipped: 0, Time elapsed: 86.341 sec
Running org.apache.hadoop.hbase.io.encoding.TestDataBlockEncoders
Tests run: 12, Failures: 0, Errors: 0, Skipped: 0, Time elapsed: 110.279 sec
Running org.apache.hadoop.hbase.io.hfile.TestForceCacheImportantBlocks
Tests run: 4, Failures: 0, Errors: 0, Skipped: 0, Time elapsed: 55.867 sec
Running org.apache.hadoop.hbase.io.hfile.TestScannerSelectionUsingTTL
Tests run: 6, Failures: 0, Errors: 0, Skipped: 0, Time elapsed: 62.087 sec
Running org.apache.hadoop.hbase.io.hfile.TestHFileBlock
Tests run: 16, Failures: 0, Errors: 0, Skipped: 0, Time elapsed: 50.675 sec
Running org.apache.hadoop.hbase.io.hfile.TestCacheOnWrite
Tests run: 36, Failures: 0, Errors: 0, Skipped: 0, Time elapsed: 39.493 sec
Running org.apache.hadoop.hbase.replication.regionserver.TestReplicationSourceManager
Tests run: 1, Failures: 0, Errors: 0, Skipped: 0, Time elapsed: 12.086 sec
Running org.apache.hadoop.hbase.io.TestFileLink
Tests run: 3, Failures: 0, Errors: 0, Skipped: 0, Time elapsed: 41.995 sec
Running org.apache.hadoop.hbase.TestClusterBootOrder
Tests run: 2, Failures: 0, Errors: 0, Skipped: 0, Time elapsed: 83.772 sec
Running org.apache.hadoop.hbase.replication.regionserver.TestReplicationSink
Tests run: 5, Failures: 0, Errors: 0, Skipped: 0, Time elapsed: 53.744 sec
Running org.apache.hadoop.hbase.replication.TestReplicationSource
Tests run: 1, Failures: 0, Errors: 0, Skipped: 0, Time elapsed: 13.284 sec
Running org.apache.hadoop.hbase.replication.TestReplicationZookeeper
Tests run: 1, Failures: 0, Errors: 0, Skipped: 0, Time elapsed: 2.167 sec
Running org.apache.hadoop.hbase.replication.TestMultiSlaveReplication
Tests run: 1, Failures: 0, Errors: 0, Skipped: 0, Time elapsed: 135.257 sec
Running org.apache.hadoop.hbase.ipc.TestDelayedRpc
Tests run: 4, Failures: 0, Errors: 0, Skipped: 0, Time elapsed: 2.56 sec
Running org.apache.hadoop.hbase.ipc.TestProtoBufRpc
Tests run: 1, Failures: 0, Errors: 0, Skipped: 0, Time elapsed: 0.956 sec
Running org.apache.hadoop.hbase.ipc.TestHBaseClient
Tests run: 1, Failures: 0, Errors: 0, Skipped: 0, Time elapsed: 0.267 sec
Running org.apache.hadoop.hbase.TestZooKeeper
Tests run: 9, Failures: 0, Errors: 0, Skipped: 0, Time elapsed: 83.767 sec
Running org.apache.hadoop.hbase.replication.TestMasterReplication
Tests run: 2, Failures: 0, Errors: 0, Skipped: 0, Time elapsed: 170.671 sec
Running org.apache.hadoop.hbase.TestHBaseTestingUtility
Tests run: 7, Failures: 0, Errors: 0, Skipped: 0, Time elapsed: 126.124 sec
Running org.apache.hadoop.hbase.replication.TestReplication
Tests run: 10, Failures: 0, Errors: 0, Skipped: 0, Time elapsed: 510.044 sec
Running org.apache.hadoop.hbase.replication.TestReplicationWithCompression
Tests run: 10, Failures: 0, Errors: 0, Skipped: 0, Time elapsed: 584.066 sec

Results :

Failed tests:   testRegionShouldNotBeDeployed(org.apache.hadoop.hbase.util.TestHBaseFsck):
expected:<[SHOULD_NOT_BE_DEPLOYED]> but was:<[]>

Tests in error: 
  testDelayedDeleteOnFailure(org.apache.hadoop.hbase.master.TestDistributedLogSplitting):
test timed out after 30000 milliseconds
  testRegionCaching(org.apache.hadoop.hbase.client.TestHCM): test timed out after 60000 milliseconds

Tests run: 1304, Failures: 1, Errors: 2, Skipped: 13

[INFO]                                                                         
[INFO] ------------------------------------------------------------------------
[INFO] Skipping HBase
[INFO] This project has been banned from the build due to previous failures.
[INFO] ------------------------------------------------------------------------
[INFO]                                                                         
[INFO] ------------------------------------------------------------------------
[INFO] Skipping HBase
[INFO] This project has been banned from the build due to previous failures.
[INFO] ------------------------------------------------------------------------
[INFO] ------------------------------------------------------------------------
[INFO] Reactor Summary:
[INFO] 
[INFO] HBase ............................................. SUCCESS [11.336s]
[INFO] HBase - Common .................................... SUCCESS [15.138s]
[INFO] HBase - Protocol .................................. SUCCESS [7.079s]
[INFO] HBase - Client .................................... SUCCESS [0.667s]
[INFO] HBase - Hadoop Compatibility ...................... SUCCESS [0.704s]
[INFO] HBase - Hadoop One Compatibility .................. SUCCESS [1.773s]
[INFO] HBase - Server .................................... FAILURE [1:10:46.511s]
[INFO] HBase - Hadoop Two Compatibility .................. SKIPPED
[INFO] HBase - Integration Tests ......................... SKIPPED
[INFO] HBase - Examples .................................. SKIPPED
[INFO] ------------------------------------------------------------------------
[INFO] BUILD FAILURE
[INFO] ------------------------------------------------------------------------
[INFO] Total time: 1:11:25.275s
[INFO] Finished at: Tue Jan 01 08:05:35 UTC 2013
[INFO] Final Memory: 67M/995M
[INFO] ------------------------------------------------------------------------
[ERROR] Failed to execute goal org.apache.maven.plugins:maven-surefire-plugin:2.12-TRUNK-HBASE-2:test
(secondPartTestsExecution) on project hbase-server: Failure or timeout -> [Help 1]
[ERROR] 
[ERROR] To see the full stack trace of the errors, re-run Maven with the -e switch.
[ERROR] Re-run Maven using the -X switch to enable full debug logging.
[ERROR] 
[ERROR] For more information about the errors and possible solutions, please read the following
articles:
[ERROR] [Help 1] http://cwiki.apache.org/confluence/display/MAVEN/MojoExecutionException
[ERROR] 
[ERROR] After correcting the problems, you can resume the build with the command
[ERROR]   mvn <goals> -rf :hbase-server
Build step 'Invoke top-level Maven targets' marked build as failure
Archiving artifacts
Recording test results

Mime
View raw message