hbase-dev mailing list archives

Site index · List index
Message view « Date » · « Thread »
Top « Date » · « Thread »
From Apache Jenkins Server <jenk...@builds.apache.org>
Subject Build failed in Jenkins: HBase-0.94-security #99
Date Sun, 27 Jan 2013 05:41:34 GMT
See <https://builds.apache.org/job/HBase-0.94-security/99/changes>

Changes:

[larsh] HBASE-7681 Address some recent random test failures

[mbertozzi] HBASE-7643 HFileArchiver.resolveAndArchive() race condition may lead to snapshot
data loss

[zjushch] HBASE-7669 ROOT region wouldn't be handled by PRI-IPC-Handler(Chunhui)

[apurtell] HBASE-7654. Add List<String> getCoprocessors() to HTableDescriptor (Jean-Marc
Spaggiari)

------------------------------------------
[...truncated 8454 lines...]
Forking command line: /bin/sh -c cd /x1/jenkins/jenkins-slave/workspace/HBase-0.94-security/trunk
&& /x1/jenkins/tools/java/jdk1.6.0_32-32/jre/bin/java -enableassertions -Xmx1900m
-Djava.security.egd=file:/dev/./urandom -jar /x1/jenkins/jenkins-slave/workspace/HBase-0.94-security/trunk/target/surefire/surefirebooter7318159352589319497.jar
/x1/jenkins/jenkins-slave/workspace/HBase-0.94-security/trunk/target/surefire/surefire9033702363455370901tmp
/x1/jenkins/jenkins-slave/workspace/HBase-0.94-security/trunk/target/surefire/surefire_822850806986641625426tmp
Running org.apache.hadoop.hbase.regionserver.TestSeekOptimizations
Tests run: 6, Failures: 0, Errors: 0, Skipped: 0, Time elapsed: 2.375 sec
Forking command line: /bin/sh -c cd /x1/jenkins/jenkins-slave/workspace/HBase-0.94-security/trunk
&& /x1/jenkins/tools/java/jdk1.6.0_32-32/jre/bin/java -enableassertions -Xmx1900m
-Djava.security.egd=file:/dev/./urandom -jar /x1/jenkins/jenkins-slave/workspace/HBase-0.94-security/trunk/target/surefire/surefirebooter5171679957748453137.jar
/x1/jenkins/jenkins-slave/workspace/HBase-0.94-security/trunk/target/surefire/surefire7077739310363609488tmp
/x1/jenkins/jenkins-slave/workspace/HBase-0.94-security/trunk/target/surefire/surefire_832364350623444395009tmp
Running org.apache.hadoop.hbase.regionserver.handler.TestOpenRegionHandler
Tests run: 3, Failures: 0, Errors: 0, Skipped: 0, Time elapsed: 0.909 sec
Forking command line: /bin/sh -c cd /x1/jenkins/jenkins-slave/workspace/HBase-0.94-security/trunk
&& /x1/jenkins/tools/java/jdk1.6.0_32-32/jre/bin/java -enableassertions -Xmx1900m
-Djava.security.egd=file:/dev/./urandom -jar /x1/jenkins/jenkins-slave/workspace/HBase-0.94-security/trunk/target/surefire/surefirebooter4209072286511628383.jar
/x1/jenkins/jenkins-slave/workspace/HBase-0.94-security/trunk/target/surefire/surefire6680332360644322244tmp
/x1/jenkins/jenkins-slave/workspace/HBase-0.94-security/trunk/target/surefire/surefire_846481789835269360057tmp
Running org.apache.hadoop.hbase.regionserver.TestBlocksRead
Tests run: 4, Failures: 0, Errors: 0, Skipped: 0, Time elapsed: 0.852 sec
Forking command line: /bin/sh -c cd /x1/jenkins/jenkins-slave/workspace/HBase-0.94-security/trunk
&& /x1/jenkins/tools/java/jdk1.6.0_32-32/jre/bin/java -enableassertions -Xmx1900m
-Djava.security.egd=file:/dev/./urandom -jar /x1/jenkins/jenkins-slave/workspace/HBase-0.94-security/trunk/target/surefire/surefirebooter6139963597728040891.jar
/x1/jenkins/jenkins-slave/workspace/HBase-0.94-security/trunk/target/surefire/surefire4658646824306250421tmp
/x1/jenkins/jenkins-slave/workspace/HBase-0.94-security/trunk/target/surefire/surefire_854860762621552169857tmp
Running org.apache.hadoop.hbase.regionserver.TestStoreScanner
Tests run: 16, Failures: 0, Errors: 0, Skipped: 0, Time elapsed: 0.067 sec
Forking command line: /bin/sh -c cd /x1/jenkins/jenkins-slave/workspace/HBase-0.94-security/trunk
&& /x1/jenkins/tools/java/jdk1.6.0_32-32/jre/bin/java -enableassertions -Xmx1900m
-Djava.security.egd=file:/dev/./urandom -jar /x1/jenkins/jenkins-slave/workspace/HBase-0.94-security/trunk/target/surefire/surefirebooter5040356160883820817.jar
/x1/jenkins/jenkins-slave/workspace/HBase-0.94-security/trunk/target/surefire/surefire5840584375873887773tmp
/x1/jenkins/jenkins-slave/workspace/HBase-0.94-security/trunk/target/surefire/surefire_864627106572116019549tmp
Running org.apache.hadoop.hbase.regionserver.TestSplitLogWorker
Tests run: 5, Failures: 0, Errors: 0, Skipped: 0, Time elapsed: 2.612 sec
Forking command line: /bin/sh -c cd /x1/jenkins/jenkins-slave/workspace/HBase-0.94-security/trunk
&& /x1/jenkins/tools/java/jdk1.6.0_32-32/jre/bin/java -enableassertions -Xmx1900m
-Djava.security.egd=file:/dev/./urandom -jar /x1/jenkins/jenkins-slave/workspace/HBase-0.94-security/trunk/target/surefire/surefirebooter2697685156040560928.jar
/x1/jenkins/jenkins-slave/workspace/HBase-0.94-security/trunk/target/surefire/surefire1856506212508273261tmp
/x1/jenkins/jenkins-slave/workspace/HBase-0.94-security/trunk/target/surefire/surefire_87208408927539893125tmp
Running org.apache.hadoop.hbase.regionserver.metrics.TestSchemaMetrics
Tests run: 6, Failures: 0, Errors: 0, Skipped: 0, Time elapsed: 12.715 sec
Forking command line: /bin/sh -c cd /x1/jenkins/jenkins-slave/workspace/HBase-0.94-security/trunk
&& /x1/jenkins/tools/java/jdk1.6.0_32-32/jre/bin/java -enableassertions -Xmx1900m
-Djava.security.egd=file:/dev/./urandom -jar /x1/jenkins/jenkins-slave/workspace/HBase-0.94-security/trunk/target/surefire/surefirebooter7913685885948822913.jar
/x1/jenkins/jenkins-slave/workspace/HBase-0.94-security/trunk/target/surefire/surefire1757420534859992950tmp
/x1/jenkins/jenkins-slave/workspace/HBase-0.94-security/trunk/target/surefire/surefire_886982530145728988933tmp
Running org.apache.hadoop.hbase.regionserver.TestStoreFileBlockCacheSummary
Tests run: 1, Failures: 0, Errors: 0, Skipped: 0, Time elapsed: 13.377 sec
Forking command line: /bin/sh -c cd /x1/jenkins/jenkins-slave/workspace/HBase-0.94-security/trunk
&& /x1/jenkins/tools/java/jdk1.6.0_32-32/jre/bin/java -enableassertions -Xmx1900m
-Djava.security.egd=file:/dev/./urandom -jar /x1/jenkins/jenkins-slave/workspace/HBase-0.94-security/trunk/target/surefire/surefirebooter1648713420651975871.jar
/x1/jenkins/jenkins-slave/workspace/HBase-0.94-security/trunk/target/surefire/surefire7632742325814834753tmp
/x1/jenkins/jenkins-slave/workspace/HBase-0.94-security/trunk/target/surefire/surefire_898475954482160547373tmp
Running org.apache.hadoop.hbase.regionserver.TestMasterAddressManager
Tests run: 1, Failures: 0, Errors: 0, Skipped: 0, Time elapsed: 0.492 sec
Forking command line: /bin/sh -c cd /x1/jenkins/jenkins-slave/workspace/HBase-0.94-security/trunk
&& /x1/jenkins/tools/java/jdk1.6.0_32-32/jre/bin/java -enableassertions -Xmx1900m
-Djava.security.egd=file:/dev/./urandom -jar /x1/jenkins/jenkins-slave/workspace/HBase-0.94-security/trunk/target/surefire/surefirebooter6344504149876437603.jar
/x1/jenkins/jenkins-slave/workspace/HBase-0.94-security/trunk/target/surefire/surefire2831000400651614913tmp
/x1/jenkins/jenkins-slave/workspace/HBase-0.94-security/trunk/target/surefire/surefire_907308466001485823622tmp
Running org.apache.hadoop.hbase.regionserver.TestMultiColumnScanner
Tests run: 12, Failures: 0, Errors: 0, Skipped: 0, Time elapsed: 29.84 sec
Forking command line: /bin/sh -c cd /x1/jenkins/jenkins-slave/workspace/HBase-0.94-security/trunk
&& /x1/jenkins/tools/java/jdk1.6.0_32-32/jre/bin/java -enableassertions -Xmx1900m
-Djava.security.egd=file:/dev/./urandom -jar /x1/jenkins/jenkins-slave/workspace/HBase-0.94-security/trunk/target/surefire/surefirebooter2763128016778889641.jar
/x1/jenkins/jenkins-slave/workspace/HBase-0.94-security/trunk/target/surefire/surefire266647136241672640tmp
/x1/jenkins/jenkins-slave/workspace/HBase-0.94-security/trunk/target/surefire/surefire_911051124524960048184tmp
Running org.apache.hadoop.hbase.regionserver.TestHRegion
Tests run: 71, Failures: 0, Errors: 0, Skipped: 0, Time elapsed: 34.74 sec
Forking command line: /bin/sh -c cd /x1/jenkins/jenkins-slave/workspace/HBase-0.94-security/trunk
&& /x1/jenkins/tools/java/jdk1.6.0_32-32/jre/bin/java -enableassertions -Xmx1900m
-Djava.security.egd=file:/dev/./urandom -jar /x1/jenkins/jenkins-slave/workspace/HBase-0.94-security/trunk/target/surefire/surefirebooter7337286284407306761.jar
/x1/jenkins/jenkins-slave/workspace/HBase-0.94-security/trunk/target/surefire/surefire3759625983563828954tmp
/x1/jenkins/jenkins-slave/workspace/HBase-0.94-security/trunk/target/surefire/surefire_924666258152788737467tmp
Running org.apache.hadoop.hbase.TestLocalHBaseCluster
Tests run: 1, Failures: 0, Errors: 0, Skipped: 0, Time elapsed: 8.729 sec
Forking command line: /bin/sh -c cd /x1/jenkins/jenkins-slave/workspace/HBase-0.94-security/trunk
&& /x1/jenkins/tools/java/jdk1.6.0_32-32/jre/bin/java -enableassertions -Xmx1900m
-Djava.security.egd=file:/dev/./urandom -jar /x1/jenkins/jenkins-slave/workspace/HBase-0.94-security/trunk/target/surefire/surefirebooter8015665814142074697.jar
/x1/jenkins/jenkins-slave/workspace/HBase-0.94-security/trunk/target/surefire/surefire7171393038064207729tmp
/x1/jenkins/jenkins-slave/workspace/HBase-0.94-security/trunk/target/surefire/surefire_934729046015203090357tmp
Running org.apache.hadoop.hbase.ipc.TestDelayedRpc
Tests run: 4, Failures: 0, Errors: 0, Skipped: 0, Time elapsed: 2.399 sec
Forking command line: /bin/sh -c cd /x1/jenkins/jenkins-slave/workspace/HBase-0.94-security/trunk
&& /x1/jenkins/tools/java/jdk1.6.0_32-32/jre/bin/java -enableassertions -Xmx1900m
-Djava.security.egd=file:/dev/./urandom -jar /x1/jenkins/jenkins-slave/workspace/HBase-0.94-security/trunk/target/surefire/surefirebooter4759086852095552086.jar
/x1/jenkins/jenkins-slave/workspace/HBase-0.94-security/trunk/target/surefire/surefire8631394678569194334tmp
/x1/jenkins/jenkins-slave/workspace/HBase-0.94-security/trunk/target/surefire/surefire_94408420472806532578tmp
Running org.apache.hadoop.hbase.ipc.TestPBOnWritableRpc
Tests run: 1, Failures: 0, Errors: 0, Skipped: 0, Time elapsed: 0.91 sec
Forking command line: /bin/sh -c cd /x1/jenkins/jenkins-slave/workspace/HBase-0.94-security/trunk
&& /x1/jenkins/tools/java/jdk1.6.0_32-32/jre/bin/java -enableassertions -Xmx1900m
-Djava.security.egd=file:/dev/./urandom -jar /x1/jenkins/jenkins-slave/workspace/HBase-0.94-security/trunk/target/surefire/surefirebooter2467034823451066433.jar
/x1/jenkins/jenkins-slave/workspace/HBase-0.94-security/trunk/target/surefire/surefire5363930887172191817tmp
/x1/jenkins/jenkins-slave/workspace/HBase-0.94-security/trunk/target/surefire/surefire_953768578654703933632tmp
Running org.apache.hadoop.hbase.TestGlobalMemStoreSize
Tests run: 1, Failures: 0, Errors: 0, Skipped: 0, Time elapsed: 16.168 sec
Forking command line: /bin/sh -c cd /x1/jenkins/jenkins-slave/workspace/HBase-0.94-security/trunk
&& /x1/jenkins/tools/java/jdk1.6.0_32-32/jre/bin/java -enableassertions -Xmx1900m
-Djava.security.egd=file:/dev/./urandom -jar /x1/jenkins/jenkins-slave/workspace/HBase-0.94-security/trunk/target/surefire/surefirebooter7945775516076269230.jar
/x1/jenkins/jenkins-slave/workspace/HBase-0.94-security/trunk/target/surefire/surefire5424763489272855565tmp
/x1/jenkins/jenkins-slave/workspace/HBase-0.94-security/trunk/target/surefire/surefire_96726697517540231819tmp
Running org.apache.hadoop.hbase.constraint.TestConstraint
Tests run: 5, Failures: 0, Errors: 0, Skipped: 0, Time elapsed: 27.264 sec
Forking command line: /bin/sh -c cd /x1/jenkins/jenkins-slave/workspace/HBase-0.94-security/trunk
&& /x1/jenkins/tools/java/jdk1.6.0_32-32/jre/bin/java -enableassertions -Xmx1900m
-Djava.security.egd=file:/dev/./urandom -jar /x1/jenkins/jenkins-slave/workspace/HBase-0.94-security/trunk/target/surefire/surefirebooter7684258060721151339.jar
/x1/jenkins/jenkins-slave/workspace/HBase-0.94-security/trunk/target/surefire/surefire8329003185076950857tmp
/x1/jenkins/jenkins-slave/workspace/HBase-0.94-security/trunk/target/surefire/surefire_973667711413589036343tmp
Running org.apache.hadoop.hbase.rest.TestSchemaResource
Tests run: 2, Failures: 0, Errors: 0, Skipped: 0, Time elapsed: 17.294 sec
Forking command line: /bin/sh -c cd /x1/jenkins/jenkins-slave/workspace/HBase-0.94-security/trunk
&& /x1/jenkins/tools/java/jdk1.6.0_32-32/jre/bin/java -enableassertions -Xmx1900m
-Djava.security.egd=file:/dev/./urandom -jar /x1/jenkins/jenkins-slave/workspace/HBase-0.94-security/trunk/target/surefire/surefirebooter5300203340249268192.jar
/x1/jenkins/jenkins-slave/workspace/HBase-0.94-security/trunk/target/surefire/surefire7222262509494676969tmp
/x1/jenkins/jenkins-slave/workspace/HBase-0.94-security/trunk/target/surefire/surefire_983418492630772946493tmp
Running org.apache.hadoop.hbase.rest.client.TestRemoteAdmin
Tests run: 1, Failures: 0, Errors: 0, Skipped: 0, Time elapsed: 15.075 sec
Forking command line: /bin/sh -c cd /x1/jenkins/jenkins-slave/workspace/HBase-0.94-security/trunk
&& /x1/jenkins/tools/java/jdk1.6.0_32-32/jre/bin/java -enableassertions -Xmx1900m
-Djava.security.egd=file:/dev/./urandom -jar /x1/jenkins/jenkins-slave/workspace/HBase-0.94-security/trunk/target/surefire/surefirebooter7368266417339890747.jar
/x1/jenkins/jenkins-slave/workspace/HBase-0.94-security/trunk/target/surefire/surefire8396032346271187638tmp
/x1/jenkins/jenkins-slave/workspace/HBase-0.94-security/trunk/target/surefire/surefire_997688186510711963601tmp
Running org.apache.hadoop.hbase.rest.client.TestRemoteTable
Tests run: 4, Failures: 0, Errors: 0, Skipped: 0, Time elapsed: 12.366 sec
Forking command line: /bin/sh -c cd /x1/jenkins/jenkins-slave/workspace/HBase-0.94-security/trunk
&& /x1/jenkins/tools/java/jdk1.6.0_32-32/jre/bin/java -enableassertions -Xmx1900m
-Djava.security.egd=file:/dev/./urandom -jar /x1/jenkins/jenkins-slave/workspace/HBase-0.94-security/trunk/target/surefire/surefirebooter3061610841069102491.jar
/x1/jenkins/jenkins-slave/workspace/HBase-0.94-security/trunk/target/surefire/surefire7204246335233841850tmp
/x1/jenkins/jenkins-slave/workspace/HBase-0.94-security/trunk/target/surefire/surefire_1002001699681832490642tmp
Running org.apache.hadoop.hbase.rest.TestTableResource
Tests run: 8, Failures: 0, Errors: 0, Skipped: 0, Time elapsed: 20.425 sec
Forking command line: /bin/sh -c cd /x1/jenkins/jenkins-slave/workspace/HBase-0.94-security/trunk
&& /x1/jenkins/tools/java/jdk1.6.0_32-32/jre/bin/java -enableassertions -Xmx1900m
-Djava.security.egd=file:/dev/./urandom -jar /x1/jenkins/jenkins-slave/workspace/HBase-0.94-security/trunk/target/surefire/surefirebooter7909946220192131670.jar
/x1/jenkins/jenkins-slave/workspace/HBase-0.94-security/trunk/target/surefire/surefire6995784827804606807tmp
/x1/jenkins/jenkins-slave/workspace/HBase-0.94-security/trunk/target/surefire/surefire_1013866682469474330503tmp
Running org.apache.hadoop.hbase.backup.TestHFileArchiving
Tests run: 5, Failures: 0, Errors: 0, Skipped: 0, Time elapsed: 139.928 sec
Forking command line: /bin/sh -c cd /x1/jenkins/jenkins-slave/workspace/HBase-0.94-security/trunk
&& /x1/jenkins/tools/java/jdk1.6.0_32-32/jre/bin/java -enableassertions -Xmx1900m
-Djava.security.egd=file:/dev/./urandom -jar /x1/jenkins/jenkins-slave/workspace/HBase-0.94-security/trunk/target/surefire/surefirebooter6886272525523718652.jar
/x1/jenkins/jenkins-slave/workspace/HBase-0.94-security/trunk/target/surefire/surefire3578290524079559823tmp
/x1/jenkins/jenkins-slave/workspace/HBase-0.94-security/trunk/target/surefire/surefire_1024672143419036681399tmp
Running org.apache.hadoop.hbase.rest.TestMultiRowResource
Tests run: 3, Failures: 0, Errors: 0, Skipped: 0, Time elapsed: 14.059 sec
Forking command line: /bin/sh -c cd /x1/jenkins/jenkins-slave/workspace/HBase-0.94-security/trunk
&& /x1/jenkins/tools/java/jdk1.6.0_32-32/jre/bin/java -enableassertions -Xmx1900m
-Djava.security.egd=file:/dev/./urandom -jar /x1/jenkins/jenkins-slave/workspace/HBase-0.94-security/trunk/target/surefire/surefirebooter2774196822230500134.jar
/x1/jenkins/jenkins-slave/workspace/HBase-0.94-security/trunk/target/surefire/surefire3166747792913747017tmp
/x1/jenkins/jenkins-slave/workspace/HBase-0.94-security/trunk/target/surefire/surefire_1037681969122597237181tmp
Running org.apache.hadoop.hbase.rest.TestGzipFilter
Tests run: 3, Failures: 0, Errors: 0, Skipped: 0, Time elapsed: 13.322 sec
Forking command line: /bin/sh -c cd /x1/jenkins/jenkins-slave/workspace/HBase-0.94-security/trunk
&& /x1/jenkins/tools/java/jdk1.6.0_32-32/jre/bin/java -enableassertions -Xmx1900m
-Djava.security.egd=file:/dev/./urandom -jar /x1/jenkins/jenkins-slave/workspace/HBase-0.94-security/trunk/target/surefire/surefirebooter3814792830529557168.jar
/x1/jenkins/jenkins-slave/workspace/HBase-0.94-security/trunk/target/surefire/surefire2568193513727161586tmp
/x1/jenkins/jenkins-slave/workspace/HBase-0.94-security/trunk/target/surefire/surefire_1046941604533640515783tmp
Running org.apache.hadoop.hbase.rest.TestRowResource
Tests run: 11, Failures: 0, Errors: 0, Skipped: 0, Time elapsed: 14.58 sec
Forking command line: /bin/sh -c cd /x1/jenkins/jenkins-slave/workspace/HBase-0.94-security/trunk
&& /x1/jenkins/tools/java/jdk1.6.0_32-32/jre/bin/java -enableassertions -Xmx1900m
-Djava.security.egd=file:/dev/./urandom -jar /x1/jenkins/jenkins-slave/workspace/HBase-0.94-security/trunk/target/surefire/surefirebooter2986487528449638258.jar
/x1/jenkins/jenkins-slave/workspace/HBase-0.94-security/trunk/target/surefire/surefire2916684529057261305tmp
/x1/jenkins/jenkins-slave/workspace/HBase-0.94-security/trunk/target/surefire/surefire_1053710163887945863455tmp
Running org.apache.hadoop.hbase.rest.TestVersionResource
Tests run: 7, Failures: 0, Errors: 0, Skipped: 0, Time elapsed: 13.555 sec
Forking command line: /bin/sh -c cd /x1/jenkins/jenkins-slave/workspace/HBase-0.94-security/trunk
&& /x1/jenkins/tools/java/jdk1.6.0_32-32/jre/bin/java -enableassertions -Xmx1900m
-Djava.security.egd=file:/dev/./urandom -jar /x1/jenkins/jenkins-slave/workspace/HBase-0.94-security/trunk/target/surefire/surefirebooter22130773795521618.jar
/x1/jenkins/jenkins-slave/workspace/HBase-0.94-security/trunk/target/surefire/surefire4502764077488814765tmp
/x1/jenkins/jenkins-slave/workspace/HBase-0.94-security/trunk/target/surefire/surefire_1064812620939506683446tmp
Running org.apache.hadoop.hbase.rest.TestScannerResource
Tests run: 5, Failures: 0, Errors: 0, Skipped: 0, Time elapsed: 28.289 sec
Forking command line: /bin/sh -c cd /x1/jenkins/jenkins-slave/workspace/HBase-0.94-security/trunk
&& /x1/jenkins/tools/java/jdk1.6.0_32-32/jre/bin/java -enableassertions -Xmx1900m
-Djava.security.egd=file:/dev/./urandom -jar /x1/jenkins/jenkins-slave/workspace/HBase-0.94-security/trunk/target/surefire/surefirebooter891524179929781037.jar
/x1/jenkins/jenkins-slave/workspace/HBase-0.94-security/trunk/target/surefire/surefire2126200050545536043tmp
/x1/jenkins/jenkins-slave/workspace/HBase-0.94-security/trunk/target/surefire/surefire_1077602304528269033892tmp
Running org.apache.hadoop.hbase.rest.TestStatusResource
Tests run: 2, Failures: 0, Errors: 0, Skipped: 0, Time elapsed: 11.531 sec
Forking command line: /bin/sh -c cd /x1/jenkins/jenkins-slave/workspace/HBase-0.94-security/trunk
&& /x1/jenkins/tools/java/jdk1.6.0_32-32/jre/bin/java -enableassertions -Xmx1900m
-Djava.security.egd=file:/dev/./urandom -jar /x1/jenkins/jenkins-slave/workspace/HBase-0.94-security/trunk/target/surefire/surefirebooter4617177910392552030.jar
/x1/jenkins/jenkins-slave/workspace/HBase-0.94-security/trunk/target/surefire/surefire6037350716749720934tmp
/x1/jenkins/jenkins-slave/workspace/HBase-0.94-security/trunk/target/surefire/surefire_1083821913372523814889tmp
Running org.apache.hadoop.hbase.metrics.TestMetricsMBeanBase
Tests run: 3, Failures: 0, Errors: 0, Skipped: 0, Time elapsed: 1.367 sec
Forking command line: /bin/sh -c cd /x1/jenkins/jenkins-slave/workspace/HBase-0.94-security/trunk
&& /x1/jenkins/tools/java/jdk1.6.0_32-32/jre/bin/java -enableassertions -Xmx1900m
-Djava.security.egd=file:/dev/./urandom -jar /x1/jenkins/jenkins-slave/workspace/HBase-0.94-security/trunk/target/surefire/surefirebooter8978166569195307924.jar
/x1/jenkins/jenkins-slave/workspace/HBase-0.94-security/trunk/target/surefire/surefire8704046278609679926tmp
/x1/jenkins/jenkins-slave/workspace/HBase-0.94-security/trunk/target/surefire/surefire_1099171284130224397612tmp
Running org.apache.hadoop.hbase.io.hfile.TestHFileBlockIndex
Tests run: 10, Failures: 0, Errors: 0, Skipped: 0, Time elapsed: 7.89 sec
Running org.apache.hadoop.hbase.rest.TestScannersWithFilters
Tests run: 10, Failures: 0, Errors: 0, Skipped: 0, Time elapsed: 17.053 sec
Forking command line: /bin/sh -c cd /x1/jenkins/jenkins-slave/workspace/HBase-0.94-security/trunk
&& /x1/jenkins/tools/java/jdk1.6.0_32-32/jre/bin/java -enableassertions -Xmx1900m
-Djava.security.egd=file:/dev/./urandom -jar /x1/jenkins/jenkins-slave/workspace/HBase-0.94-security/trunk/target/surefire/surefirebooter7505475323467655614.jar
/x1/jenkins/jenkins-slave/workspace/HBase-0.94-security/trunk/target/surefire/surefire6852729805499735666tmp
/x1/jenkins/jenkins-slave/workspace/HBase-0.94-security/trunk/target/surefire/surefire_1106329756631374721877tmp
Forking command line: /bin/sh -c cd /x1/jenkins/jenkins-slave/workspace/HBase-0.94-security/trunk
&& /x1/jenkins/tools/java/jdk1.6.0_32-32/jre/bin/java -enableassertions -Xmx1900m
-Djava.security.egd=file:/dev/./urandom -jar /x1/jenkins/jenkins-slave/workspace/HBase-0.94-security/trunk/target/surefire/surefirebooter2869449066668556087.jar
/x1/jenkins/jenkins-slave/workspace/HBase-0.94-security/trunk/target/surefire/surefire2554598519725886026tmp
/x1/jenkins/jenkins-slave/workspace/HBase-0.94-security/trunk/target/surefire/surefire_1114911205165095154111tmp
Running org.apache.hadoop.hbase.io.hfile.TestLruBlockCache
Tests run: 16, Failures: 0, Errors: 0, Skipped: 0, Time elapsed: 0.883 sec
Forking command line: /bin/sh -c cd /x1/jenkins/jenkins-slave/workspace/HBase-0.94-security/trunk
&& /x1/jenkins/tools/java/jdk1.6.0_32-32/jre/bin/java -enableassertions -Xmx1900m
-Djava.security.egd=file:/dev/./urandom -jar /x1/jenkins/jenkins-slave/workspace/HBase-0.94-security/trunk/target/surefire/surefirebooter6432197380774450072.jar
/x1/jenkins/jenkins-slave/workspace/HBase-0.94-security/trunk/target/surefire/surefire3058464008742650900tmp
/x1/jenkins/jenkins-slave/workspace/HBase-0.94-security/trunk/target/surefire/surefire_1128708033368457335899tmp
Running org.apache.hadoop.hbase.io.hfile.TestHFileSeek
Tests run: 1, Failures: 0, Errors: 0, Skipped: 0, Time elapsed: 4.731 sec
Forking command line: /bin/sh -c cd /x1/jenkins/jenkins-slave/workspace/HBase-0.94-security/trunk
&& /x1/jenkins/tools/java/jdk1.6.0_32-32/jre/bin/java -enableassertions -Xmx1900m
-Djava.security.egd=file:/dev/./urandom -jar /x1/jenkins/jenkins-slave/workspace/HBase-0.94-security/trunk/target/surefire/surefirebooter4696814999482734170.jar
/x1/jenkins/jenkins-slave/workspace/HBase-0.94-security/trunk/target/surefire/surefire7641604182157613092tmp
/x1/jenkins/jenkins-slave/workspace/HBase-0.94-security/trunk/target/surefire/surefire_1135863808564165244396tmp
Running org.apache.hadoop.hbase.io.hfile.TestFixedFileTrailer
Tests run: 2, Failures: 0, Errors: 0, Skipped: 0, Time elapsed: 0.525 sec
Forking command line: /bin/sh -c cd /x1/jenkins/jenkins-slave/workspace/HBase-0.94-security/trunk
&& /x1/jenkins/tools/java/jdk1.6.0_32-32/jre/bin/java -enableassertions -Xmx1900m
-Djava.security.egd=file:/dev/./urandom -jar /x1/jenkins/jenkins-slave/workspace/HBase-0.94-security/trunk/target/surefire/surefirebooter2140738812904935360.jar
/x1/jenkins/jenkins-slave/workspace/HBase-0.94-security/trunk/target/surefire/surefire7508658255260026306tmp
/x1/jenkins/jenkins-slave/workspace/HBase-0.94-security/trunk/target/surefire/surefire_1143602279687121995557tmp
Running org.apache.hadoop.hbase.io.hfile.TestHFilePerformance
Tests run: 1, Failures: 0, Errors: 0, Skipped: 0, Time elapsed: 4.41 sec
Forking command line: /bin/sh -c cd /x1/jenkins/jenkins-slave/workspace/HBase-0.94-security/trunk
&& /x1/jenkins/tools/java/jdk1.6.0_32-32/jre/bin/java -enableassertions -Xmx1900m
-Djava.security.egd=file:/dev/./urandom -jar /x1/jenkins/jenkins-slave/workspace/HBase-0.94-security/trunk/target/surefire/surefirebooter8961027899135998791.jar
/x1/jenkins/jenkins-slave/workspace/HBase-0.94-security/trunk/target/surefire/surefire8818889635640747981tmp
/x1/jenkins/jenkins-slave/workspace/HBase-0.94-security/trunk/target/surefire/surefire_1154906490135692557572tmp
Running org.apache.hadoop.hbase.io.hfile.TestHFileBlockCompatibility
Tests run: 10, Failures: 0, Errors: 0, Skipped: 0, Time elapsed: 0.949 sec
Forking command line: /bin/sh -c cd /x1/jenkins/jenkins-slave/workspace/HBase-0.94-security/trunk
&& /x1/jenkins/tools/java/jdk1.6.0_32-32/jre/bin/java -enableassertions -Xmx1900m
-Djava.security.egd=file:/dev/./urandom -jar /x1/jenkins/jenkins-slave/workspace/HBase-0.94-security/trunk/target/surefire/surefirebooter4929153769021026017.jar
/x1/jenkins/jenkins-slave/workspace/HBase-0.94-security/trunk/target/surefire/surefire2818778193611578819tmp
/x1/jenkins/jenkins-slave/workspace/HBase-0.94-security/trunk/target/surefire/surefire_1166114322074211633029tmp
Running org.apache.hadoop.hbase.io.hfile.TestForceCacheImportantBlocks
Tests run: 4, Failures: 0, Errors: 0, Skipped: 0, Time elapsed: 32.295 sec
Forking command line: /bin/sh -c cd /x1/jenkins/jenkins-slave/workspace/HBase-0.94-security/trunk
&& /x1/jenkins/tools/java/jdk1.6.0_32-32/jre/bin/java -enableassertions -Xmx1900m
-Djava.security.egd=file:/dev/./urandom -jar /x1/jenkins/jenkins-slave/workspace/HBase-0.94-security/trunk/target/surefire/surefirebooter2671223670244849618.jar
/x1/jenkins/jenkins-slave/workspace/HBase-0.94-security/trunk/target/surefire/surefire6790717163935288075tmp
/x1/jenkins/jenkins-slave/workspace/HBase-0.94-security/trunk/target/surefire/surefire_1175644881882090966754tmp
Running org.apache.hadoop.hbase.io.hfile.TestChecksum
Tests run: 3, Failures: 0, Errors: 0, Skipped: 0, Time elapsed: 0.584 sec
Forking command line: /bin/sh -c cd /x1/jenkins/jenkins-slave/workspace/HBase-0.94-security/trunk
&& /x1/jenkins/tools/java/jdk1.6.0_32-32/jre/bin/java -enableassertions -Xmx1900m
-Djava.security.egd=file:/dev/./urandom -jar /x1/jenkins/jenkins-slave/workspace/HBase-0.94-security/trunk/target/surefire/surefirebooter37248840340326340.jar
/x1/jenkins/jenkins-slave/workspace/HBase-0.94-security/trunk/target/surefire/surefire5396337227826329440tmp
/x1/jenkins/jenkins-slave/workspace/HBase-0.94-security/trunk/target/surefire/surefire_118871970075673860645tmp
Running org.apache.hadoop.hbase.io.hfile.TestCacheOnWrite
Tests run: 36, Failures: 0, Errors: 0, Skipped: 0, Time elapsed: 25.996 sec
Forking command line: /bin/sh -c cd /x1/jenkins/jenkins-slave/workspace/HBase-0.94-security/trunk
&& /x1/jenkins/tools/java/jdk1.6.0_32-32/jre/bin/java -enableassertions -Xmx1900m
-Djava.security.egd=file:/dev/./urandom -jar /x1/jenkins/jenkins-slave/workspace/HBase-0.94-security/trunk/target/surefire/surefirebooter8581585358719869880.jar
/x1/jenkins/jenkins-slave/workspace/HBase-0.94-security/trunk/target/surefire/surefire7676688610886607070tmp
/x1/jenkins/jenkins-slave/workspace/HBase-0.94-security/trunk/target/surefire/surefire_1195419699367397956434tmp
Running org.apache.hadoop.hbase.io.hfile.slab.TestSlabCache
Tests run: 7, Failures: 0, Errors: 0, Skipped: 0, Time elapsed: 15.94 sec
Forking command line: /bin/sh -c cd /x1/jenkins/jenkins-slave/workspace/HBase-0.94-security/trunk
&& /x1/jenkins/tools/java/jdk1.6.0_32-32/jre/bin/java -enableassertions -Xmx1900m
-Djava.security.egd=file:/dev/./urandom -jar /x1/jenkins/jenkins-slave/workspace/HBase-0.94-security/trunk/target/surefire/surefirebooter4681953698144068598.jar
/x1/jenkins/jenkins-slave/workspace/HBase-0.94-security/trunk/target/surefire/surefire8683393143792461234tmp
/x1/jenkins/jenkins-slave/workspace/HBase-0.94-security/trunk/target/surefire/surefire_1208044510365380141084tmp
Running org.apache.hadoop.hbase.io.hfile.slab.TestSingleSizeCache
Tests run: 5, Failures: 0, Errors: 0, Skipped: 0, Time elapsed: 16.338 sec
Forking command line: /bin/sh -c cd /x1/jenkins/jenkins-slave/workspace/HBase-0.94-security/trunk
&& /x1/jenkins/tools/java/jdk1.6.0_32-32/jre/bin/java -enableassertions -Xmx1900m
-Djava.security.egd=file:/dev/./urandom -jar /x1/jenkins/jenkins-slave/workspace/HBase-0.94-security/trunk/target/surefire/surefirebooter2956918762258047154.jar
/x1/jenkins/jenkins-slave/workspace/HBase-0.94-security/trunk/target/surefire/surefire5141920730282832434tmp
/x1/jenkins/jenkins-slave/workspace/HBase-0.94-security/trunk/target/surefire/surefire_1213391240590180571728tmp
Running org.apache.hadoop.hbase.io.hfile.TestHFileBlock
Tests run: 16, Failures: 0, Errors: 0, Skipped: 0, Time elapsed: 48.864 sec
Forking command line: /bin/sh -c cd /x1/jenkins/jenkins-slave/workspace/HBase-0.94-security/trunk
&& /x1/jenkins/tools/java/jdk1.6.0_32-32/jre/bin/java -enableassertions -Xmx1900m
-Djava.security.egd=file:/dev/./urandom -jar /x1/jenkins/jenkins-slave/workspace/HBase-0.94-security/trunk/target/surefire/surefirebooter3031334359918766665.jar
/x1/jenkins/jenkins-slave/workspace/HBase-0.94-security/trunk/target/surefire/surefire6458049378605230137tmp
/x1/jenkins/jenkins-slave/workspace/HBase-0.94-security/trunk/target/surefire/surefire_122292238259997887248tmp
Running org.apache.hadoop.hbase.replication.TestReplicationZookeeper
Tests run: 1, Failures: 0, Errors: 0, Skipped: 0, Time elapsed: 0.663 sec
Forking command line: /bin/sh -c cd /x1/jenkins/jenkins-slave/workspace/HBase-0.94-security/trunk
&& /x1/jenkins/tools/java/jdk1.6.0_32-32/jre/bin/java -enableassertions -Xmx1900m
-Djava.security.egd=file:/dev/./urandom -jar /x1/jenkins/jenkins-slave/workspace/HBase-0.94-security/trunk/target/surefire/surefirebooter4955497711256480955.jar
/x1/jenkins/jenkins-slave/workspace/HBase-0.94-security/trunk/target/surefire/surefire3456512604380277175tmp
/x1/jenkins/jenkins-slave/workspace/HBase-0.94-security/trunk/target/surefire/surefire_1232196806580239502617tmp
Running org.apache.hadoop.hbase.io.encoding.TestLoadAndSwitchEncodeOnDisk
Tests run: 1, Failures: 0, Errors: 0, Skipped: 0, Time elapsed: 25.802 sec
Forking command line: /bin/sh -c cd /x1/jenkins/jenkins-slave/workspace/HBase-0.94-security/trunk
&& /x1/jenkins/tools/java/jdk1.6.0_32-32/jre/bin/java -enableassertions -Xmx1900m
-Djava.security.egd=file:/dev/./urandom -jar /x1/jenkins/jenkins-slave/workspace/HBase-0.94-security/trunk/target/surefire/surefirebooter1444662210423851689.jar
/x1/jenkins/jenkins-slave/workspace/HBase-0.94-security/trunk/target/surefire/surefire7879425879470998838tmp
/x1/jenkins/jenkins-slave/workspace/HBase-0.94-security/trunk/target/surefire/surefire_1241928123571987227045tmp
Running org.apache.hadoop.hbase.replication.regionserver.TestReplicationSourceManager
Tests run: 1, Failures: 0, Errors: 0, Skipped: 0, Time elapsed: 1.007 sec
Forking command line: /bin/sh -c cd /x1/jenkins/jenkins-slave/workspace/HBase-0.94-security/trunk
&& /x1/jenkins/tools/java/jdk1.6.0_32-32/jre/bin/java -enableassertions -Xmx1900m
-Djava.security.egd=file:/dev/./urandom -jar /x1/jenkins/jenkins-slave/workspace/HBase-0.94-security/trunk/target/surefire/surefirebooter575027948883486754.jar
/x1/jenkins/jenkins-slave/workspace/HBase-0.94-security/trunk/target/surefire/surefire5007837927273292053tmp
/x1/jenkins/jenkins-slave/workspace/HBase-0.94-security/trunk/target/surefire/surefire_1258941489218991832447tmp
Running org.apache.hadoop.hbase.replication.regionserver.TestReplicationSink
Tests run: 5, Failures: 0, Errors: 0, Skipped: 0, Time elapsed: 15.004 sec
Forking command line: /bin/sh -c cd /x1/jenkins/jenkins-slave/workspace/HBase-0.94-security/trunk
&& /x1/jenkins/tools/java/jdk1.6.0_32-32/jre/bin/java -enableassertions -Xmx1900m
-Djava.security.egd=file:/dev/./urandom -jar /x1/jenkins/jenkins-slave/workspace/HBase-0.94-security/trunk/target/surefire/surefirebooter1701523475935677185.jar
/x1/jenkins/jenkins-slave/workspace/HBase-0.94-security/trunk/target/surefire/surefire5877301427808899343tmp
/x1/jenkins/jenkins-slave/workspace/HBase-0.94-security/trunk/target/surefire/surefire_1267048895244182103978tmp
Running org.apache.hadoop.hbase.util.TestFSTableDescriptors
Tests run: 11, Failures: 0, Errors: 0, Skipped: 0, Time elapsed: 0.764 sec
Forking command line: /bin/sh -c cd /x1/jenkins/jenkins-slave/workspace/HBase-0.94-security/trunk
&& /x1/jenkins/tools/java/jdk1.6.0_32-32/jre/bin/java -enableassertions -Xmx1900m
-Djava.security.egd=file:/dev/./urandom -jar /x1/jenkins/jenkins-slave/workspace/HBase-0.94-security/trunk/target/surefire/surefirebooter2423951647548469588.jar
/x1/jenkins/jenkins-slave/workspace/HBase-0.94-security/trunk/target/surefire/surefire8760091158116783806tmp
/x1/jenkins/jenkins-slave/workspace/HBase-0.94-security/trunk/target/surefire/surefire_1277199306208832723690tmp
Running org.apache.hadoop.hbase.replication.TestReplicationSource
Tests run: 1, Failures: 0, Errors: 0, Skipped: 0, Time elapsed: 1.943 sec
Forking command line: /bin/sh -c cd /x1/jenkins/jenkins-slave/workspace/HBase-0.94-security/trunk
&& /x1/jenkins/tools/java/jdk1.6.0_32-32/jre/bin/java -enableassertions -Xmx1900m
-Djava.security.egd=file:/dev/./urandom -jar /x1/jenkins/jenkins-slave/workspace/HBase-0.94-security/trunk/target/surefire/surefirebooter8490409496767663945.jar
/x1/jenkins/jenkins-slave/workspace/HBase-0.94-security/trunk/target/surefire/surefire9091135256414024924tmp
/x1/jenkins/jenkins-slave/workspace/HBase-0.94-security/trunk/target/surefire/surefire_1284080306537501522064tmp
Running org.apache.hadoop.hbase.util.TestEnvironmentEdgeManager
Tests run: 2, Failures: 0, Errors: 0, Skipped: 0, Time elapsed: 0.356 sec
Forking command line: /bin/sh -c cd /x1/jenkins/jenkins-slave/workspace/HBase-0.94-security/trunk
&& /x1/jenkins/tools/java/jdk1.6.0_32-32/jre/bin/java -enableassertions -Xmx1900m
-Djava.security.egd=file:/dev/./urandom -jar /x1/jenkins/jenkins-slave/workspace/HBase-0.94-security/trunk/target/surefire/surefirebooter3253938335647610061.jar
/x1/jenkins/jenkins-slave/workspace/HBase-0.94-security/trunk/target/surefire/surefire1010460063530864274tmp
/x1/jenkins/jenkins-slave/workspace/HBase-0.94-security/trunk/target/surefire/surefire_1291386247047066831559tmp
Running org.apache.hadoop.hbase.util.TestIdLock
Tests run: 1, Failures: 0, Errors: 0, Skipped: 0, Time elapsed: 15.503 sec
Forking command line: /bin/sh -c cd /x1/jenkins/jenkins-slave/workspace/HBase-0.94-security/trunk
&& /x1/jenkins/tools/java/jdk1.6.0_32-32/jre/bin/java -enableassertions -Xmx1900m
-Djava.security.egd=file:/dev/./urandom -jar /x1/jenkins/jenkins-slave/workspace/HBase-0.94-security/trunk/target/surefire/surefirebooter417256814091441861.jar
/x1/jenkins/jenkins-slave/workspace/HBase-0.94-security/trunk/target/surefire/surefire2467570266891292238tmp
/x1/jenkins/jenkins-slave/workspace/HBase-0.94-security/trunk/target/surefire/surefire_1303480743180807019216tmp
Running org.apache.hadoop.hbase.util.TestMergeTable
Tests run: 1, Failures: 0, Errors: 0, Skipped: 0, Time elapsed: 23.23 sec
Forking command line: /bin/sh -c cd /x1/jenkins/jenkins-slave/workspace/HBase-0.94-security/trunk
&& /x1/jenkins/tools/java/jdk1.6.0_32-32/jre/bin/java -enableassertions -Xmx1900m
-Djava.security.egd=file:/dev/./urandom -jar /x1/jenkins/jenkins-slave/workspace/HBase-0.94-security/trunk/target/surefire/surefirebooter7601971259092009660.jar
/x1/jenkins/jenkins-slave/workspace/HBase-0.94-security/trunk/target/surefire/surefire5105988896503382206tmp
/x1/jenkins/jenkins-slave/workspace/HBase-0.94-security/trunk/target/surefire/surefire_1312613025194531351976tmp
Running org.apache.hadoop.hbase.util.TestPoolMap$TestRoundRobinPoolType
Tests run: 3, Failures: 0, Errors: 0, Skipped: 0, Time elapsed: 0.009 sec
Running org.apache.hadoop.hbase.util.TestPoolMap$TestThreadLocalPoolType
Tests run: 3, Failures: 0, Errors: 0, Skipped: 0, Time elapsed: 0.006 sec
Running org.apache.hadoop.hbase.util.TestPoolMap$TestReusablePoolType
Tests run: 3, Failures: 0, Errors: 0, Skipped: 0, Time elapsed: 0.034 sec
Forking command line: /bin/sh -c cd /x1/jenkins/jenkins-slave/workspace/HBase-0.94-security/trunk
&& /x1/jenkins/tools/java/jdk1.6.0_32-32/jre/bin/java -enableassertions -Xmx1900m
-Djava.security.egd=file:/dev/./urandom -jar /x1/jenkins/jenkins-slave/workspace/HBase-0.94-security/trunk/target/surefire/surefirebooter1686217768661443181.jar
/x1/jenkins/jenkins-slave/workspace/HBase-0.94-security/trunk/target/surefire/surefire1986659135536294165tmp
/x1/jenkins/jenkins-slave/workspace/HBase-0.94-security/trunk/target/surefire/surefire_1327793218639412894494tmp
Running org.apache.hadoop.hbase.util.TestFSUtils
Tests run: 4, Failures: 0, Errors: 0, Skipped: 0, Time elapsed: 20.239 sec
Forking command line: /bin/sh -c cd /x1/jenkins/jenkins-slave/workspace/HBase-0.94-security/trunk
&& /x1/jenkins/tools/java/jdk1.6.0_32-32/jre/bin/java -enableassertions -Xmx1900m
-Djava.security.egd=file:/dev/./urandom -jar /x1/jenkins/jenkins-slave/workspace/HBase-0.94-security/trunk/target/surefire/surefirebooter5527309073448195407.jar
/x1/jenkins/jenkins-slave/workspace/HBase-0.94-security/trunk/target/surefire/surefire3511167529953237621tmp
/x1/jenkins/jenkins-slave/workspace/HBase-0.94-security/trunk/target/surefire/surefire_1333977948835099787693tmp
Running org.apache.hadoop.hbase.util.TestRegionSplitter
Tests run: 5, Failures: 0, Errors: 0, Skipped: 0, Time elapsed: 18.844 sec
Forking command line: /bin/sh -c cd /x1/jenkins/jenkins-slave/workspace/HBase-0.94-security/trunk
&& /x1/jenkins/tools/java/jdk1.6.0_32-32/jre/bin/java -enableassertions -Xmx1900m
-Djava.security.egd=file:/dev/./urandom -jar /x1/jenkins/jenkins-slave/workspace/HBase-0.94-security/trunk/target/surefire/surefirebooter4552905872382958373.jar
/x1/jenkins/jenkins-slave/workspace/HBase-0.94-security/trunk/target/surefire/surefire5357673565621345678tmp
/x1/jenkins/jenkins-slave/workspace/HBase-0.94-security/trunk/target/surefire/surefire_1345031678991835153331tmp
Running org.apache.hadoop.hbase.util.TestCoprocessorScanPolicy
Tests run: 2, Failures: 0, Errors: 0, Skipped: 0, Time elapsed: 14.443 sec
Forking command line: /bin/sh -c cd /x1/jenkins/jenkins-slave/workspace/HBase-0.94-security/trunk
&& /x1/jenkins/tools/java/jdk1.6.0_32-32/jre/bin/java -enableassertions -Xmx1900m
-Djava.security.egd=file:/dev/./urandom -jar /x1/jenkins/jenkins-slave/workspace/HBase-0.94-security/trunk/target/surefire/surefirebooter6280208721878869398.jar
/x1/jenkins/jenkins-slave/workspace/HBase-0.94-security/trunk/target/surefire/surefire9108327486774126986tmp
/x1/jenkins/jenkins-slave/workspace/HBase-0.94-security/trunk/target/surefire/surefire_1354362502685481951115tmp
Running org.apache.hadoop.hbase.util.hbck.TestOfflineMetaRebuildBase
Tests run: 1, Failures: 0, Errors: 0, Skipped: 0, Time elapsed: 24.553 sec
Forking command line: /bin/sh -c cd /x1/jenkins/jenkins-slave/workspace/HBase-0.94-security/trunk
&& /x1/jenkins/tools/java/jdk1.6.0_32-32/jre/bin/java -enableassertions -Xmx1900m
-Djava.security.egd=file:/dev/./urandom -jar /x1/jenkins/jenkins-slave/workspace/HBase-0.94-security/trunk/target/surefire/surefirebooter1834918806239254801.jar
/x1/jenkins/jenkins-slave/workspace/HBase-0.94-security/trunk/target/surefire/surefire5354343197579540125tmp
/x1/jenkins/jenkins-slave/workspace/HBase-0.94-security/trunk/target/surefire/surefire_1363536193255821559689tmp
Running org.apache.hadoop.hbase.util.hbck.TestOfflineMetaRebuildOverlap
Tests run: 1, Failures: 0, Errors: 0, Skipped: 0, Time elapsed: 22.01 sec
Forking command line: /bin/sh -c cd /x1/jenkins/jenkins-slave/workspace/HBase-0.94-security/trunk
&& /x1/jenkins/tools/java/jdk1.6.0_32-32/jre/bin/java -enableassertions -Xmx1900m
-Djava.security.egd=file:/dev/./urandom -jar /x1/jenkins/jenkins-slave/workspace/HBase-0.94-security/trunk/target/surefire/surefirebooter1476239638429781908.jar
/x1/jenkins/jenkins-slave/workspace/HBase-0.94-security/trunk/target/surefire/surefire2784835494693607339tmp
/x1/jenkins/jenkins-slave/workspace/HBase-0.94-security/trunk/target/surefire/surefire_1375464193497368881694tmp
Running org.apache.hadoop.hbase.util.TestDefaultEnvironmentEdge
Tests run: 1, Failures: 0, Errors: 0, Skipped: 0, Time elapsed: 0.249 sec
Forking command line: /bin/sh -c cd /x1/jenkins/jenkins-slave/workspace/HBase-0.94-security/trunk
&& /x1/jenkins/tools/java/jdk1.6.0_32-32/jre/bin/java -enableassertions -Xmx1900m
-Djava.security.egd=file:/dev/./urandom -jar /x1/jenkins/jenkins-slave/workspace/HBase-0.94-security/trunk/target/surefire/surefirebooter4649581562184179185.jar
/x1/jenkins/jenkins-slave/workspace/HBase-0.94-security/trunk/target/surefire/surefire3584169788865629274tmp
/x1/jenkins/jenkins-slave/workspace/HBase-0.94-security/trunk/target/surefire/surefire_1382343943079712956336tmp
Running org.apache.hadoop.hbase.util.hbck.TestOfflineMetaRebuildHole
Tests run: 1, Failures: 0, Errors: 0, Skipped: 0, Time elapsed: 22.026 sec
Forking command line: /bin/sh -c cd /x1/jenkins/jenkins-slave/workspace/HBase-0.94-security/trunk
&& /x1/jenkins/tools/java/jdk1.6.0_32-32/jre/bin/java -enableassertions -Xmx1900m
-Djava.security.egd=file:/dev/./urandom -jar /x1/jenkins/jenkins-slave/workspace/HBase-0.94-security/trunk/target/surefire/surefirebooter979111599629104105.jar
/x1/jenkins/jenkins-slave/workspace/HBase-0.94-security/trunk/target/surefire/surefire1800371497370413057tmp
/x1/jenkins/jenkins-slave/workspace/HBase-0.94-security/trunk/target/surefire/surefire_1395024709785478997185tmp
Running org.apache.hadoop.hbase.TestInfoServers
Tests run: 3, Failures: 0, Errors: 0, Skipped: 0, Time elapsed: 11.884 sec
Running org.apache.hadoop.hbase.util.TestSizeBasedThrottler
Tests run: 3, Failures: 0, Errors: 0, Skipped: 0, Time elapsed: 47.503 sec

Results :

Tests in error: 
  testTableOperations(org.apache.hadoop.hbase.coprocessor.TestMasterObserver): org.apache.hadoop.hbase.InvalidFamilyOperationException:
Column family 'fam2' does not exist(..)
  testRegionTransitionOperations(org.apache.hadoop.hbase.coprocessor.TestMasterObserver):
org.apache.hadoop.hbase.TableExistsException: observed_table

Tests run: 815, Failures: 0, Errors: 2, Skipped: 2

[INFO] ------------------------------------------------------------------------
[INFO] BUILD FAILURE
[INFO] ------------------------------------------------------------------------
[INFO] Total time: 25:50.751s
[INFO] Finished at: Sun Jan 27 05:41:23 UTC 2013
[INFO] Final Memory: 47M/980M
[INFO] ------------------------------------------------------------------------
[ERROR] Failed to execute goal org.apache.maven.plugins:maven-surefire-plugin:2.12-TRUNK-HBASE-2:test
(secondPartTestsExecution) on project hbase: There are test failures.
[ERROR] 
[ERROR] Please refer to /x1/jenkins/jenkins-slave/workspace/HBase-0.94-security/trunk/target/surefire-reports
for the individual test results.
[ERROR] -> [Help 1]
org.apache.maven.lifecycle.LifecycleExecutionException: Failed to execute goal org.apache.maven.plugins:maven-surefire-plugin:2.12-TRUNK-HBASE-2:test
(secondPartTestsExecution) on project hbase: There are test failures.

Please refer to /x1/jenkins/jenkins-slave/workspace/HBase-0.94-security/trunk/target/surefire-reports
for the individual test results.
	at org.apache.maven.lifecycle.internal.MojoExecutor.execute(MojoExecutor.java:213)
	at org.apache.maven.lifecycle.internal.MojoExecutor.execute(MojoExecutor.java:153)
	at org.apache.maven.lifecycle.internal.MojoExecutor.execute(MojoExecutor.java:145)
	at org.apache.maven.lifecycle.internal.MojoExecutor.executeForkedExecutions(MojoExecutor.java:365)
	at org.apache.maven.lifecycle.internal.MojoExecutor.execute(MojoExecutor.java:199)
	at org.apache.maven.lifecycle.internal.MojoExecutor.execute(MojoExecutor.java:153)
	at org.apache.maven.lifecycle.internal.MojoExecutor.execute(MojoExecutor.java:145)
	at org.apache.maven.lifecycle.internal.LifecycleModuleBuilder.buildProject(LifecycleModuleBuilder.java:84)
	at org.apache.maven.lifecycle.internal.LifecycleModuleBuilder.buildProject(LifecycleModuleBuilder.java:59)
	at org.apache.maven.lifecycle.internal.LifecycleStarter.singleThreadedBuild(LifecycleStarter.java:183)
	at org.apache.maven.lifecycle.internal.LifecycleStarter.execute(LifecycleStarter.java:161)
	at org.apache.maven.DefaultMaven.doExecute(DefaultMaven.java:320)
	at org.apache.maven.DefaultMaven.execute(DefaultMaven.java:156)
	at org.apache.maven.cli.MavenCli.execute(MavenCli.java:537)
	at org.apache.maven.cli.MavenCli.doMain(MavenCli.java:196)
	at org.apache.maven.cli.MavenCli.main(MavenCli.java:141)
	at sun.reflect.NativeMethodAccessorImpl.invoke0(Native Method)
	at sun.reflect.NativeMethodAccessorImpl.invoke(NativeMethodAccessorImpl.java:39)
	at sun.reflect.DelegatingMethodAccessorImpl.invoke(DelegatingMethodAccessorImpl.java:25)
	at java.lang.reflect.Method.invoke(Method.java:597)
	at org.codehaus.plexus.classworlds.launcher.Launcher.launchEnhanced(Launcher.java:290)
	at org.codehaus.plexus.classworlds.launcher.Launcher.launch(Launcher.java:230)
	at org.codehaus.plexus.classworlds.launcher.Launcher.mainWithExitCode(Launcher.java:409)
	at org.codehaus.plexus.classworlds.launcher.Launcher.main(Launcher.java:352)
Caused by: org.apache.maven.plugin.MojoFailureException: There are test failures.

Please refer to /x1/jenkins/jenkins-slave/workspace/HBase-0.94-security/trunk/target/surefire-reports
for the individual test results.
	at org.apache.maven.plugin.surefire.SurefireHelper.reportExecution(SurefireHelper.java:87)
	at org.apache.maven.plugin.surefire.SurefirePlugin.writeSummary(SurefirePlugin.java:651)
	at org.apache.maven.plugin.surefire.SurefirePlugin.handleSummary(SurefirePlugin.java:625)
	at org.apache.maven.plugin.surefire.AbstractSurefireMojo.executeAfterPreconditionsChecked(AbstractSurefireMojo.java:137)
	at org.apache.maven.plugin.surefire.AbstractSurefireMojo.execute(AbstractSurefireMojo.java:98)
	at org.apache.maven.plugin.DefaultBuildPluginManager.executeMojo(DefaultBuildPluginManager.java:101)
	at org.apache.maven.lifecycle.internal.MojoExecutor.execute(MojoExecutor.java:209)
	... 23 more
[ERROR] 
[ERROR] 
[ERROR] For more information about the errors and possible solutions, please read the following
articles:
[ERROR] [Help 1] http://cwiki.apache.org/confluence/display/MAVEN/MojoFailureException
Build step 'Invoke top-level Maven targets' marked build as failure
Archiving artifacts
Updating HBASE-7681
Updating HBASE-7669
Updating HBASE-7643
Updating HBASE-7654
Recording test results

Mime
View raw message