hbase-dev mailing list archives

Site index · List index
Message view « Date » · « Thread »
Top « Date » · « Thread »
From Stack <st...@duboce.net>
Subject Re: Build failed in Jenkins: HBase-TRUNK #3638
Date Wed, 19 Dec 2012 16:19:04 GMT
These examples fail locally for me too.
St.Ack


On Wed, Dec 19, 2012 at 12:58 AM, Apache Jenkins Server <
jenkins@builds.apache.org> wrote:

> See <https://builds.apache.org/job/HBase-TRUNK/3638/changes>
>
> Changes:
>
> [stack] HBASE-6585 Audit log messages should contain info about the higher
> level operation being executed
>
> ------------------------------------------
> [...truncated 3453 lines...]
> Tests run: 1, Failures: 0, Errors: 0, Skipped: 0, Time elapsed: 0.004 sec
> Running org.apache.hadoop.hbase.regionserver.TestMetricsRegionSourceImpl
> Tests run: 2, Failures: 0, Errors: 0, Skipped: 0, Time elapsed: 0.006 sec
> Running
> org.apache.hadoop.hbase.replication.regionserver.TestMetricsReplicationSourceImpl
> Tests run: 1, Failures: 0, Errors: 0, Skipped: 0, Time elapsed: 0.004 sec
> Running org.apache.hadoop.hbase.master.TestMetricsMasterSourceImpl
> Tests run: 1, Failures: 0, Errors: 0, Skipped: 0, Time elapsed: 0.721 sec
>
> Results :
>
> Tests run: 16, Failures: 0, Errors: 0, Skipped: 0
>
> [INFO]
> [INFO] --- maven-surefire-plugin:2.12-TRUNK-HBASE-2:test
> (secondPartTestsExecution) @ hbase-hadoop2-compat ---
> [INFO] Tests are skipped.
> [INFO]
> [INFO] --- maven-jar-plugin:2.3:test-jar (default) @ hbase-hadoop2-compat
> ---
> [INFO] Building jar: <
> https://builds.apache.org/job/HBase-TRUNK/ws/trunk/hbase-hadoop2-compat/target/hbase-hadoop2-compat-0.95-SNAPSHOT-tests.jar
> >
> [INFO]
> [INFO] --- maven-jar-plugin:2.3:jar (default-jar) @ hbase-hadoop2-compat
> ---
> [INFO] Building jar: <
> https://builds.apache.org/job/HBase-TRUNK/ws/trunk/hbase-hadoop2-compat/target/hbase-hadoop2-compat-0.95-SNAPSHOT.jar
> >
> [INFO]
> [INFO] --- apache-rat-plugin:0.8:check (default) @ hbase-hadoop2-compat ---
> [INFO] Exclude: **/*.log
> [INFO] Exclude: **/.*
> [INFO] Exclude: **/*.tgz
> [INFO] Exclude: **/*.orig
> [INFO] Exclude: **/test/**
> [INFO] Exclude: **/8e8ab58dcf39412da19833fcd8f687ac
> [INFO] Exclude: **/.git/**
> [INFO] Exclude: **/.idea/**
> [INFO] Exclude: **/target/**
> [INFO] Exclude: **/CHANGES.txt
> [INFO] Exclude: **/generated/**
> [INFO] Exclude: **/gen-*/**
> [INFO] Exclude: **/conf/*
> [INFO] Exclude: **/*.avpr
> [INFO] Exclude: **/*.svg
> [INFO] Exclude: **/META-INF/services/**
> [INFO] Exclude: **/html5shiv.js
> [INFO] Exclude: **/jquery.min.js
> [INFO] Exclude: **/*.vm
> [INFO] Exclude: **/control
> [INFO] Exclude: **/conffile
> [INFO] Exclude: docs/*
> [INFO] Exclude: **/src/site/resources/css/freebsd_docbook.css
> [INFO] Exclude: .git/**
> [INFO] Exclude: .svn/**
> [INFO]
> [INFO]
> ------------------------------------------------------------------------
> [INFO] Building HBase - Integration Tests 0.95-SNAPSHOT
> [INFO]
> ------------------------------------------------------------------------
> [INFO]
> [INFO] --- maven-remote-resources-plugin:1.1:process (default) @ hbase-it
> ---
> [INFO]
> [INFO] --- maven-resources-plugin:2.5:resources (default-resources) @
> hbase-it ---
> [debug] execute contextualize
> [INFO] Using 'UTF-8' encoding to copy filtered resources.
> [INFO] skip non existing resourceDirectory <
> https://builds.apache.org/job/HBase-TRUNK/ws/trunk/hbase-it/src/main/resources
> >
> [INFO] Copying 3 resources
> [INFO]
> [INFO] --- maven-compiler-plugin:2.5.1:compile (default-compile) @
> hbase-it ---
> [INFO] No sources to compile
> [INFO]
> [INFO] --- maven-dependency-plugin:2.1:build-classpath
> (create-hbase-generated-classpath) @ hbase-it ---
> [INFO] Wrote classpath file '<
> https://builds.apache.org/job/HBase-TRUNK/ws/trunk/hbase-it/target/../../target/cached_classpath.txt'
> .>
> [INFO]
> [INFO] --- maven-resources-plugin:2.5:testResources
> (default-testResources) @ hbase-it ---
> [debug] execute contextualize
> [INFO] Using 'UTF-8' encoding to copy filtered resources.
> [INFO] Copying 6 resources
> [INFO] Copying 3 resources
> [INFO]
> [INFO] --- maven-compiler-plugin:2.5.1:testCompile (default-testCompile) @
> hbase-it ---
> [INFO] Compiling 10 source files to <
> https://builds.apache.org/job/HBase-TRUNK/ws/trunk/hbase-it/target/test-classes
> >
> [INFO]
> [INFO] --- maven-surefire-plugin:2.12-TRUNK-HBASE-2:test (default-test) @
> hbase-it ---
> [INFO] Surefire report directory: <
> https://builds.apache.org/job/HBase-TRUNK/ws/trunk/hbase-it/target/surefire-reports
> >
> [INFO] Using configured provider
> org.apache.maven.surefire.junitcore.JUnitCoreProvider
>
> -------------------------------------------------------
>  T E S T S
> -------------------------------------------------------
>
> Results :
>
> Tests run: 0, Failures: 0, Errors: 0, Skipped: 0
>
> [INFO]
> [INFO] --- maven-surefire-plugin:2.12-TRUNK-HBASE-2:test
> (secondPartTestsExecution) @ hbase-it ---
> [INFO] Surefire report directory: <
> https://builds.apache.org/job/HBase-TRUNK/ws/trunk/hbase-it/target/surefire-reports
> >
> [INFO] Using configured provider
> org.apache.maven.surefire.junitcore.JUnitCoreProvider
>
> -------------------------------------------------------
>  T E S T S
> -------------------------------------------------------
>
> -------------------------------------------------------
>  T E S T S
> -------------------------------------------------------
>
> Results :
>
> Tests run: 0, Failures: 0, Errors: 0, Skipped: 0
>
> [INFO]
> [INFO] --- maven-jar-plugin:2.3:test-jar (default) @ hbase-it ---
> [INFO] Building jar: <
> https://builds.apache.org/job/HBase-TRUNK/ws/trunk/hbase-it/target/hbase-it-0.95-SNAPSHOT-tests.jar
> >
> [INFO]
> [INFO] --- maven-jar-plugin:2.3:jar (default-jar) @ hbase-it ---
> [INFO] Building jar: <
> https://builds.apache.org/job/HBase-TRUNK/ws/trunk/hbase-it/target/hbase-it-0.95-SNAPSHOT.jar
> >
> [INFO]
> [INFO] --- apache-rat-plugin:0.8:check (default) @ hbase-it ---
> [INFO] Exclude: **/*.log
> [INFO] Exclude: **/.*
> [INFO] Exclude: **/*.tgz
> [INFO] Exclude: **/*.orig
> [INFO] Exclude: **/test/**
> [INFO] Exclude: **/8e8ab58dcf39412da19833fcd8f687ac
> [INFO] Exclude: **/.git/**
> [INFO] Exclude: **/.idea/**
> [INFO] Exclude: **/target/**
> [INFO] Exclude: **/CHANGES.txt
> [INFO] Exclude: **/generated/**
> [INFO] Exclude: **/gen-*/**
> [INFO] Exclude: **/conf/*
> [INFO] Exclude: **/*.avpr
> [INFO] Exclude: **/*.svg
> [INFO] Exclude: **/META-INF/services/**
> [INFO] Exclude: **/html5shiv.js
> [INFO] Exclude: **/jquery.min.js
> [INFO] Exclude: **/*.vm
> [INFO] Exclude: **/control
> [INFO] Exclude: **/conffile
> [INFO] Exclude: docs/*
> [INFO] Exclude: **/src/site/resources/css/freebsd_docbook.css
> [INFO] Exclude: .git/**
> [INFO] Exclude: .svn/**
> [INFO]
> [INFO]
> ------------------------------------------------------------------------
> [INFO] Building HBase - Examples 0.95-SNAPSHOT
> [INFO]
> ------------------------------------------------------------------------
> [INFO]
> [INFO] --- maven-remote-resources-plugin:1.1:process (default) @
> hbase-examples ---
> [INFO]
> [INFO] --- maven-resources-plugin:2.5:resources (default-resources) @
> hbase-examples ---
> [debug] execute contextualize
> [INFO] Using 'UTF-8' encoding to copy filtered resources.
> [INFO] skip non existing resourceDirectory <
> https://builds.apache.org/job/HBase-TRUNK/ws/trunk/hbase-examples/src/main/resources
> >
> [INFO] Copying 3 resources
> [INFO]
> [INFO] --- maven-compiler-plugin:2.5.1:compile (default-compile) @
> hbase-examples ---
> [INFO] Compiling 20 source files to <
> https://builds.apache.org/job/HBase-TRUNK/ws/trunk/hbase-examples/target/classes
> >
> [INFO]
> [INFO] --- maven-resources-plugin:2.5:testResources
> (default-testResources) @ hbase-examples ---
> [debug] execute contextualize
> [INFO] Using 'UTF-8' encoding to copy filtered resources.
> [INFO] skip non existing resourceDirectory <
> https://builds.apache.org/job/HBase-TRUNK/ws/trunk/hbase-examples/src/test/resources
> >
> [INFO] Copying 3 resources
> [INFO]
> [INFO] --- maven-compiler-plugin:2.5.1:testCompile (default-testCompile) @
> hbase-examples ---
> [INFO] Compiling 3 source files to <
> https://builds.apache.org/job/HBase-TRUNK/ws/trunk/hbase-examples/target/test-classes
> >
> [INFO]
> [INFO] --- maven-surefire-plugin:2.12-TRUNK-HBASE-2:test (default-test) @
> hbase-examples ---
> [INFO] Surefire report directory: <
> https://builds.apache.org/job/HBase-TRUNK/ws/trunk/hbase-examples/target/surefire-reports
> >
> [INFO] Using configured provider
> org.apache.maven.surefire.junitcore.JUnitCoreProvider
>
> -------------------------------------------------------
>  T E S T S
> -------------------------------------------------------
>
> Results :
>
> Tests run: 0, Failures: 0, Errors: 0, Skipped: 0
>
> [INFO]
> [INFO] --- maven-surefire-plugin:2.12-TRUNK-HBASE-2:test
> (secondPartTestsExecution) @ hbase-examples ---
> [INFO] Surefire report directory: <
> https://builds.apache.org/job/HBase-TRUNK/ws/trunk/hbase-examples/target/surefire-reports
> >
> [INFO] Using configured provider
> org.apache.maven.surefire.junitcore.JUnitCoreProvider
>
> -------------------------------------------------------
>  T E S T S
> -------------------------------------------------------
>
> -------------------------------------------------------
>  T E S T S
> -------------------------------------------------------
> Running org.apache.hadoop.hbase.coprocessor.example.TestRowCountEndpoint
> Tests run: 1, Failures: 0, Errors: 0, Skipped: 0, Time elapsed: 17.184 sec
> Running
> org.apache.hadoop.hbase.coprocessor.example.TestZooKeeperScanPolicyObserver
> Tests run: 1, Failures: 0, Errors: 1, Skipped: 0, Time elapsed: 220.849
> sec <<< FAILURE!
> Running org.apache.hadoop.hbase.coprocessor.example.TestBulkDeleteProtocol
> Tests run: 1, Failures: 0, Errors: 1, Skipped: 0, Time elapsed: 222.051
> sec <<< FAILURE!
>
> Results :
>
> Tests in error:
>
> org.apache.hadoop.hbase.coprocessor.example.TestZooKeeperScanPolicyObserver:
> Shutting down
>   org.apache.hadoop.hbase.coprocessor.example.TestBulkDeleteProtocol:
> Shutting down
>
> Tests run: 3, Failures: 0, Errors: 2, Skipped: 0
>
> [INFO]
> [INFO]
> ------------------------------------------------------------------------
> [INFO] Skipping HBase
> [INFO] This project has been banned from the build due to previous
> failures.
> [INFO]
> ------------------------------------------------------------------------
> [INFO]
> [INFO]
> ------------------------------------------------------------------------
> [INFO] Skipping HBase
> [INFO] This project has been banned from the build due to previous
> failures.
> [INFO]
> ------------------------------------------------------------------------
> [INFO]
> ------------------------------------------------------------------------
> [INFO] Reactor Summary:
> [INFO]
> [INFO] HBase ............................................. SUCCESS [7.419s]
> [INFO] HBase - Common .................................... SUCCESS
> [15.555s]
> [INFO] HBase - Protocol .................................. SUCCESS [7.813s]
> [INFO] HBase - Client .................................... SUCCESS [1.092s]
> [INFO] HBase - Hadoop Compatibility ...................... SUCCESS [0.651s]
> [INFO] HBase - Hadoop One Compatibility .................. SUCCESS [1.963s]
> [INFO] HBase - Server .................................... SUCCESS
> [33:48.469s]
> [INFO] HBase - Hadoop Two Compatibility .................. SUCCESS
> [10.769s]
> [INFO] HBase - Integration Tests ......................... SUCCESS [4.474s]
> [INFO] HBase - Examples .................................. FAILURE
> [3:47.460s]
> [INFO]
> ------------------------------------------------------------------------
> [INFO] BUILD FAILURE
> [INFO]
> ------------------------------------------------------------------------
> [INFO] Total time: 38:26.800s
> [INFO] Finished at: Wed Dec 19 08:57:43 UTC 2012
> [INFO] Final Memory: 77M/1004M
> [INFO]
> ------------------------------------------------------------------------
> [ERROR] Failed to execute goal
> org.apache.maven.plugins:maven-surefire-plugin:2.12-TRUNK-HBASE-2:test
> (secondPartTestsExecution) on project hbase-examples: There are test
> failures.
> [ERROR]
> [ERROR] Please refer to <
> https://builds.apache.org/job/HBase-TRUNK/ws/trunk/hbase-examples/target/surefire-reports>
> for the individual test results.
> [ERROR] -> [Help 1]
> [ERROR]
> [ERROR] To see the full stack trace of the errors, re-run Maven with the
> -e switch.
> [ERROR] Re-run Maven using the -X switch to enable full debug logging.
> [ERROR]
> [ERROR] For more information about the errors and possible solutions,
> please read the following articles:
> [ERROR] [Help 1]
> http://cwiki.apache.org/confluence/display/MAVEN/MojoFailureException
> [ERROR]
> [ERROR] After correcting the problems, you can resume the build with the
> command
> [ERROR]   mvn <goals> -rf :hbase-examples
> Build step 'Invoke top-level Maven targets' marked build as failure
> Archiving artifacts
> Recording test results
> Updating HBASE-6585
>

Mime
  • Unnamed multipart/alternative (inline, None, 0 bytes)
View raw message