hbase-dev mailing list archives

Site index · List index
Message view « Date » · « Thread »
Top « Date » · « Thread »
From Apache Jenkins Server <jenk...@builds.apache.org>
Subject Build failed in Jenkins: HBase-TRUNK #3606
Date Mon, 10 Dec 2012 22:23:42 GMT
See <https://builds.apache.org/job/HBase-TRUNK/3606/changes>

Changes:

[enis] HBASE-6367 List backup masters in ui.

------------------------------------------
[...truncated 2013 lines...]
A         hbase-hadoop-compat/src/test/java
A         hbase-hadoop-compat/src/test/java/org
A         hbase-hadoop-compat/src/test/java/org/apache
A         hbase-hadoop-compat/src/test/java/org/apache/hadoop
A         hbase-hadoop-compat/src/test/java/org/apache/hadoop/hbase
A         hbase-hadoop-compat/src/test/java/org/apache/hadoop/hbase/test
A         hbase-hadoop-compat/src/test/java/org/apache/hadoop/hbase/test/MetricsAssertHelper.java
A         hbase-hadoop-compat/src/test/java/org/apache/hadoop/hbase/thrift
A         hbase-hadoop-compat/src/test/java/org/apache/hadoop/hbase/thrift/metrics
A         hbase-hadoop-compat/src/test/java/org/apache/hadoop/hbase/thrift/TestMetricsThriftServerSourceFactory.java
A         hbase-hadoop-compat/src/test/java/org/apache/hadoop/hbase/replication
A         hbase-hadoop-compat/src/test/java/org/apache/hadoop/hbase/replication/regionserver
A         hbase-hadoop-compat/src/test/java/org/apache/hadoop/hbase/replication/regionserver/metrics
A         hbase-hadoop-compat/src/test/java/org/apache/hadoop/hbase/replication/regionserver/TestMetricsReplicationSourceFactory.java
A         hbase-hadoop-compat/src/test/java/org/apache/hadoop/hbase/regionserver
A         hbase-hadoop-compat/src/test/java/org/apache/hadoop/hbase/regionserver/wal
A         hbase-hadoop-compat/src/test/java/org/apache/hadoop/hbase/regionserver/wal/TestMetricsHLogSource.java
A         hbase-hadoop-compat/src/test/java/org/apache/hadoop/hbase/regionserver/TestMetricsRegionServerSourceFactory.java
A         hbase-hadoop-compat/src/test/java/org/apache/hadoop/hbase/master
A         hbase-hadoop-compat/src/test/java/org/apache/hadoop/hbase/master/metrics
A         hbase-hadoop-compat/src/test/java/org/apache/hadoop/hbase/master/TestMetricsMasterSourceFactory.java
A         hbase-hadoop-compat/src/test/java/org/apache/hadoop/hbase/rest
A         hbase-hadoop-compat/src/test/java/org/apache/hadoop/hbase/rest/TestMetricsRESTSource.java
A         hbase-hadoop-compat/src/test/java/org/apache/hadoop/hbase/rest/metrics
A         hbase-hadoop-compat/src/test/java/org/apache/hadoop/hbase/HadoopShims.java
A         hbase-hadoop-compat/src/main
A         hbase-hadoop-compat/src/main/java
A         hbase-hadoop-compat/src/main/java/org
A         hbase-hadoop-compat/src/main/java/org/apache
A         hbase-hadoop-compat/src/main/java/org/apache/hadoop
A         hbase-hadoop-compat/src/main/java/org/apache/hadoop/hbase
A         hbase-hadoop-compat/src/main/java/org/apache/hadoop/hbase/thrift
A         hbase-hadoop-compat/src/main/java/org/apache/hadoop/hbase/thrift/MetricsThriftServerSource.java
A         hbase-hadoop-compat/src/main/java/org/apache/hadoop/hbase/thrift/metrics
A         hbase-hadoop-compat/src/main/java/org/apache/hadoop/hbase/thrift/MetricsThriftServerSourceFactory.java
A         hbase-hadoop-compat/src/main/java/org/apache/hadoop/hbase/CompatibilityFactory.java
A         hbase-hadoop-compat/src/main/java/org/apache/hadoop/hbase/CompatibilitySingletonFactory.java
A         hbase-hadoop-compat/src/main/java/org/apache/hadoop/hbase/metrics
A         hbase-hadoop-compat/src/main/java/org/apache/hadoop/hbase/metrics/MBeanSource.java
A         hbase-hadoop-compat/src/main/java/org/apache/hadoop/hbase/metrics/BaseSource.java
A         hbase-hadoop-compat/src/main/java/org/apache/hadoop/hbase/replication
A         hbase-hadoop-compat/src/main/java/org/apache/hadoop/hbase/replication/regionserver
A         hbase-hadoop-compat/src/main/java/org/apache/hadoop/hbase/replication/regionserver/MetricsReplicationSource.java
A         hbase-hadoop-compat/src/main/java/org/apache/hadoop/hbase/replication/regionserver/metrics
A         hbase-hadoop-compat/src/main/java/org/apache/hadoop/hbase/regionserver
A         hbase-hadoop-compat/src/main/java/org/apache/hadoop/hbase/regionserver/MetricsRegionAggregateSource.java
A         hbase-hadoop-compat/src/main/java/org/apache/hadoop/hbase/regionserver/MetricsRegionServerSource.java
A         hbase-hadoop-compat/src/main/java/org/apache/hadoop/hbase/regionserver/MetricsRegionServerWrapper.java
A         hbase-hadoop-compat/src/main/java/org/apache/hadoop/hbase/regionserver/wal
A         hbase-hadoop-compat/src/main/java/org/apache/hadoop/hbase/regionserver/wal/MetricsWALSource.java
A         hbase-hadoop-compat/src/main/java/org/apache/hadoop/hbase/regionserver/MetricsRegionServerSourceFactory.java
A         hbase-hadoop-compat/src/main/java/org/apache/hadoop/hbase/regionserver/MetricsRegionSource.java
A         hbase-hadoop-compat/src/main/java/org/apache/hadoop/hbase/regionserver/MetricsRegionWrapper.java
A         hbase-hadoop-compat/src/main/java/org/apache/hadoop/hbase/master
A         hbase-hadoop-compat/src/main/java/org/apache/hadoop/hbase/master/MetricsMasterSource.java
A         hbase-hadoop-compat/src/main/java/org/apache/hadoop/hbase/master/MetricsMasterWrapper.java
A         hbase-hadoop-compat/src/main/java/org/apache/hadoop/hbase/master/metrics
A         hbase-hadoop-compat/src/main/java/org/apache/hadoop/hbase/master/MetricsMasterSourceFactory.java
A         hbase-hadoop-compat/src/main/java/org/apache/hadoop/hbase/rest
A         hbase-hadoop-compat/src/main/java/org/apache/hadoop/hbase/rest/MetricsRESTSource.java
A         hbase-hadoop-compat/src/main/java/org/apache/hadoop/hbase/rest/metrics
A         hbase-hadoop-compat/src/main/java/org/apache/hadoop/metrics
A         hbase-hadoop-compat/src/main/java/org/apache/hadoop/metrics2
A         hbase-hadoop-compat/src/main/java/org/apache/hadoop/metrics2/MetricHistogram.java
A         hbase-hadoop-compat/src/main/java/org/apache/hadoop/metrics2/MetricsExecutor.java
A         hbase-hadoop-compat/pom.xml
A         README.txt
 U        .
At revision 1419839
[HBase-TRUNK] $ /bin/bash -xe /tmp/hudson8743805215132429686.sh
+ ulimit -a
core file size          (blocks, -c) 0
data seg size           (kbytes, -d) unlimited
scheduling priority             (-e) 0
file size               (blocks, -f) unlimited
pending signals                 (-i) 128228
max locked memory       (kbytes, -l) 64
max memory size         (kbytes, -m) unlimited
open files                      (-n) 40000
pipe size            (512 bytes, -p) 8
POSIX message queues     (bytes, -q) 819200
real-time priority              (-r) 0
stack size              (kbytes, -s) 8192
cpu time               (seconds, -t) unlimited
max user processes              (-u) 128228
virtual memory          (kbytes, -v) unlimited
file locks                      (-x) unlimited
+ java -version
java version "1.7.0_04"
Java(TM) SE Runtime Environment (build 1.7.0_04-b20)
Java HotSpot(TM) 64-Bit Server VM (build 23.0-b21, mixed mode)
[trunk] $ /home/hudson/tools/maven/latest3/bin/mvn -PrunAllTests -Dmaven.test.redirectTestOutputToFile=true
package assembly:assembly site -Prelease
[INFO] Scanning for projects...
[INFO] ------------------------------------------------------------------------
[INFO] Reactor Build Order:
[INFO] 
[INFO] HBase
[INFO] HBase - Common
[INFO] HBase - Protocol
[INFO] HBase - Client
[INFO] HBase - Hadoop Compatibility
[INFO] HBase - Hadoop One Compatibility
[INFO] HBase - Server
[INFO] HBase - Hadoop Two Compatibility
[INFO] HBase - Integration Tests
[INFO] HBase - Examples
[INFO]                                                                         
[INFO] ------------------------------------------------------------------------
[INFO] Building HBase 0.95-SNAPSHOT
[INFO] ------------------------------------------------------------------------
[INFO] 
[INFO] --- maven-remote-resources-plugin:1.1:process (default) @ hbase ---
[INFO] Setting property: classpath.resource.loader.class => 'org.codehaus.plexus.velocity.ContextClassLoaderResourceLoader'.
[INFO] Setting property: velocimacro.messages.on => 'false'.
[INFO] Setting property: resource.loader => 'classpath'.
[INFO] Setting property: resource.manager.logwhenfound => 'false'.
[INFO] 
[INFO] --- findbugs-maven-plugin:2.4.0:findbugs (default) @ hbase ---
[INFO] 
[INFO] --- apache-rat-plugin:0.8:check (default) @ hbase ---
[INFO] Exclude: **/*.log
[INFO] Exclude: **/.*
[INFO] Exclude: **/*.tgz
[INFO] Exclude: **/*.orig
[INFO] Exclude: **/test/**
[INFO] Exclude: **/8e8ab58dcf39412da19833fcd8f687ac
[INFO] Exclude: **/.git/**
[INFO] Exclude: **/.idea/**
[INFO] Exclude: **/target/**
[INFO] Exclude: **/CHANGES.txt
[INFO] Exclude: **/generated/**
[INFO] Exclude: **/gen-*/**
[INFO] Exclude: **/conf/*
[INFO] Exclude: **/*.avpr
[INFO] Exclude: **/*.svg
[INFO] Exclude: **/META-INF/services/**
[INFO] Exclude: **/html5shiv.js
[INFO] Exclude: **/jquery.min.js
[INFO] Exclude: **/*.vm
[INFO] Exclude: **/control
[INFO] Exclude: **/conffile
[INFO] Exclude: docs/*
[INFO] Exclude: **/src/site/resources/css/freebsd_docbook.css
[INFO] Exclude: .git/**
[INFO] Exclude: .svn/**
[INFO]                                                                         
[INFO] ------------------------------------------------------------------------
[INFO] Building HBase - Common 0.95-SNAPSHOT
[INFO] ------------------------------------------------------------------------
[INFO] 
[INFO] --- maven-remote-resources-plugin:1.1:process (default) @ hbase-common ---
[INFO] 
[INFO] --- maven-resources-plugin:2.5:resources (default-resources) @ hbase-common ---
[debug] execute contextualize
[INFO] Using 'UTF-8' encoding to copy filtered resources.
[INFO] skip non existing resourceDirectory <https://builds.apache.org/job/HBase-TRUNK/ws/trunk/hbase-common/src/main/resources>
[INFO] Copying 3 resources
[INFO] 
[INFO] --- maven-compiler-plugin:2.5.1:compile (default-compile) @ hbase-common ---
[INFO] Compiling 41 source files to <https://builds.apache.org/job/HBase-TRUNK/ws/trunk/hbase-common/target/classes>
[WARNING] <https://builds.apache.org/job/HBase-TRUNK/ws/trunk/hbase-common/src/main/java/org/apache/hadoop/hbase/util/Bytes.java>:[43,15]
Unsafe is internal proprietary API and may be removed in a future release
[WARNING] <https://builds.apache.org/job/HBase-TRUNK/ws/trunk/hbase-common/src/main/java/org/apache/hadoop/hbase/util/Bytes.java>:[1032,19]
Unsafe is internal proprietary API and may be removed in a future release
[WARNING] <https://builds.apache.org/job/HBase-TRUNK/ws/trunk/hbase-common/src/main/java/org/apache/hadoop/hbase/util/Bytes.java>:[1038,21]
Unsafe is internal proprietary API and may be removed in a future release
[WARNING] <https://builds.apache.org/job/HBase-TRUNK/ws/trunk/hbase-common/src/main/java/org/apache/hadoop/hbase/util/Bytes.java>:[1043,28]
Unsafe is internal proprietary API and may be removed in a future release
[INFO] 
[INFO] --- maven-resources-plugin:2.5:testResources (default-testResources) @ hbase-common
---
[debug] execute contextualize
[INFO] Using 'UTF-8' encoding to copy filtered resources.
[INFO] skip non existing resourceDirectory <https://builds.apache.org/job/HBase-TRUNK/ws/trunk/hbase-common/src/test/resources>
[INFO] Copying 3 resources
[INFO] 
[INFO] --- maven-compiler-plugin:2.5.1:testCompile (default-testCompile) @ hbase-common ---
[INFO] Compiling 17 source files to <https://builds.apache.org/job/HBase-TRUNK/ws/trunk/hbase-common/target/test-classes>
[INFO] 
[INFO] --- maven-surefire-plugin:2.12-TRUNK-HBASE-2:test (default-test) @ hbase-common ---
[INFO] Surefire report directory: <https://builds.apache.org/job/HBase-TRUNK/ws/trunk/hbase-common/target/surefire-reports>
[INFO] Using configured provider org.apache.maven.surefire.junitcore.JUnitCoreProvider

-------------------------------------------------------
 T E S T S
-------------------------------------------------------
Running org.apache.hadoop.hbase.TestKeyValue
Tests run: 16, Failures: 0, Errors: 0, Skipped: 0, Time elapsed: 0.05 sec
Running org.apache.hadoop.hbase.util.TestLoadTestKVGenerator
Tests run: 3, Failures: 0, Errors: 0, Skipped: 0, Time elapsed: 0.822 sec
Running org.apache.hadoop.hbase.util.TestBytes
Tests run: 24, Failures: 0, Errors: 0, Skipped: 0, Time elapsed: 1.312 sec
Running org.apache.hadoop.hbase.util.TestByteRange
Tests run: 2, Failures: 0, Errors: 0, Skipped: 0, Time elapsed: 0.006 sec
Running org.apache.hadoop.hbase.util.TestEnvironmentEdgeManager
Tests run: 2, Failures: 0, Errors: 0, Skipped: 0, Time elapsed: 0.497 sec
Running org.apache.hadoop.hbase.TestClassFinder
Tests run: 11, Failures: 0, Errors: 0, Skipped: 0, Time elapsed: 9.524 sec
Running org.apache.hadoop.hbase.util.TestThreads
Tests run: 1, Failures: 1, Errors: 0, Skipped: 0, Time elapsed: 9.524 sec <<< FAILURE!

Results :

Failed tests:   testSleepWithoutInterrupt(org.apache.hadoop.hbase.util.TestThreads): Elapsed
time 5531 ms is out of the expected range of the sleep time 5000

Tests run: 59, Failures: 1, Errors: 0, Skipped: 0

[INFO]                                                                         
[INFO] ------------------------------------------------------------------------
[INFO] Skipping HBase
[INFO] This project has been banned from the build due to previous failures.
[INFO] ------------------------------------------------------------------------
[INFO]                                                                         
[INFO] ------------------------------------------------------------------------
[INFO] Skipping HBase
[INFO] This project has been banned from the build due to previous failures.
[INFO] ------------------------------------------------------------------------
[INFO] ------------------------------------------------------------------------
[INFO] Reactor Summary:
[INFO] 
[INFO] HBase ............................................. SUCCESS [9.568s]
[INFO] HBase - Common .................................... FAILURE [17.973s]
[INFO] HBase - Protocol .................................. SKIPPED
[INFO] HBase - Client .................................... SKIPPED
[INFO] HBase - Hadoop Compatibility ...................... SKIPPED
[INFO] HBase - Hadoop One Compatibility .................. SKIPPED
[INFO] HBase - Server .................................... SKIPPED
[INFO] HBase - Hadoop Two Compatibility .................. SKIPPED
[INFO] HBase - Integration Tests ......................... SKIPPED
[INFO] HBase - Examples .................................. SKIPPED
[INFO] ------------------------------------------------------------------------
[INFO] BUILD FAILURE
[INFO] ------------------------------------------------------------------------
[INFO] Total time: 28.711s
[INFO] Finished at: Mon Dec 10 22:23:40 UTC 2012
[INFO] Final Memory: 32M/414M
[INFO] ------------------------------------------------------------------------
[ERROR] Failed to execute goal org.apache.maven.plugins:maven-surefire-plugin:2.12-TRUNK-HBASE-2:test
(default-test) on project hbase-common: There are test failures.
[ERROR] 
[ERROR] Please refer to <https://builds.apache.org/job/HBase-TRUNK/ws/trunk/hbase-common/target/surefire-reports>
for the individual test results.
[ERROR] -> [Help 1]
[ERROR] 
[ERROR] To see the full stack trace of the errors, re-run Maven with the -e switch.
[ERROR] Re-run Maven using the -X switch to enable full debug logging.
[ERROR] 
[ERROR] For more information about the errors and possible solutions, please read the following
articles:
[ERROR] [Help 1] http://cwiki.apache.org/confluence/display/MAVEN/MojoFailureException
[ERROR] 
[ERROR] After correcting the problems, you can resume the build with the command
[ERROR]   mvn <goals> -rf :hbase-common
Build step 'Invoke top-level Maven targets' marked build as failure
Archiving artifacts
Recording test results
Updating HBASE-6367

Mime
View raw message