hbase-dev mailing list archives

Site index · List index
Message view « Date » · « Thread »
Top « Date » · « Thread »
From Apache Jenkins Server <jenk...@builds.apache.org>
Subject Build failed in Jenkins: HBase-0.92-security #146
Date Mon, 05 Nov 2012 03:57:18 GMT
See <https://builds.apache.org/job/HBase-0.92-security/146/changes>

Changes:

[stack] HBASE-7087 Add to NOTICE.txt a note on jamon being MPL

[tedyu] HBASE-7072 HBase-5256 breaks 0.92-0.94 compatibility (Himanshu)

[tedyu] HBASE-5257 Addendum fixes typo in ColumnCountGetFilter.java

[tedyu] HBASE-5257 Allow INCLUDE_AND_NEXT_COL in filters and use it in ColumnPaginationFilter (Varun)

[eclark] HBASE-6951 Allow the master info server to be started in a read only mode.

[apurtell] Update affiliation

------------------------------------------
[...truncated 7223 lines...]
Forking command line: /bin/sh -c cd <https://builds.apache.org/job/HBase-0.92-security/ws/trunk> && /home/jenkins/tools/java/jdk1.6.0_27-32/jre/bin/java -enableassertions -Xmx1400m -Djava.security.egd=file:/dev/./urandom -jar <https://builds.apache.org/job/HBase-0.92-security/ws/trunk/target/surefire/surefirebooter5264221277426898621.jar> <https://builds.apache.org/job/HBase-0.92-security/ws/trunk/target/surefire/surefire5997521661679905171tmp> <https://builds.apache.org/job/HBase-0.92-security/ws/trunk/target/surefire/surefire5971026696897711356tmp>
Running org.apache.hadoop.hbase.executor.TestExecutorService
Tests run: 1, Failures: 0, Errors: 0, Skipped: 0, Time elapsed: 2.473 sec
Forking command line: /bin/sh -c cd <https://builds.apache.org/job/HBase-0.92-security/ws/trunk> && /home/jenkins/tools/java/jdk1.6.0_27-32/jre/bin/java -enableassertions -Xmx1400m -Djava.security.egd=file:/dev/./urandom -jar <https://builds.apache.org/job/HBase-0.92-security/ws/trunk/target/surefire/surefirebooter6329006340438966900.jar> <https://builds.apache.org/job/HBase-0.92-security/ws/trunk/target/surefire/surefire9052721241805040400tmp> <https://builds.apache.org/job/HBase-0.92-security/ws/trunk/target/surefire/surefire1474608947458536673tmp>
Running org.apache.hadoop.hbase.rest.TestGzipFilter
Tests run: 3, Failures: 0, Errors: 0, Skipped: 0, Time elapsed: 32.442 sec
Forking command line: /bin/sh -c cd <https://builds.apache.org/job/HBase-0.92-security/ws/trunk> && /home/jenkins/tools/java/jdk1.6.0_27-32/jre/bin/java -enableassertions -Xmx1400m -Djava.security.egd=file:/dev/./urandom -jar <https://builds.apache.org/job/HBase-0.92-security/ws/trunk/target/surefire/surefirebooter6091910322822603685.jar> <https://builds.apache.org/job/HBase-0.92-security/ws/trunk/target/surefire/surefire6075679253933313262tmp> <https://builds.apache.org/job/HBase-0.92-security/ws/trunk/target/surefire/surefire7276653619448412001tmp>
Running org.apache.hadoop.hbase.rest.TestMultiRowResource
Tests run: 3, Failures: 0, Errors: 0, Skipped: 0, Time elapsed: 30.206 sec
Forking command line: /bin/sh -c cd <https://builds.apache.org/job/HBase-0.92-security/ws/trunk> && /home/jenkins/tools/java/jdk1.6.0_27-32/jre/bin/java -enableassertions -Xmx1400m -Djava.security.egd=file:/dev/./urandom -jar <https://builds.apache.org/job/HBase-0.92-security/ws/trunk/target/surefire/surefirebooter3644340785310762956.jar> <https://builds.apache.org/job/HBase-0.92-security/ws/trunk/target/surefire/surefire488396551521463730tmp> <https://builds.apache.org/job/HBase-0.92-security/ws/trunk/target/surefire/surefire4262492198217723621tmp>
Running org.apache.hadoop.hbase.rest.TestScannersWithFilters
Tests run: 10, Failures: 0, Errors: 0, Skipped: 0, Time elapsed: 28.776 sec
Forking command line: /bin/sh -c cd <https://builds.apache.org/job/HBase-0.92-security/ws/trunk> && /home/jenkins/tools/java/jdk1.6.0_27-32/jre/bin/java -enableassertions -Xmx1400m -Djava.security.egd=file:/dev/./urandom -jar <https://builds.apache.org/job/HBase-0.92-security/ws/trunk/target/surefire/surefirebooter1262339799483013744.jar> <https://builds.apache.org/job/HBase-0.92-security/ws/trunk/target/surefire/surefire5896101511003292311tmp> <https://builds.apache.org/job/HBase-0.92-security/ws/trunk/target/surefire/surefire2243400803075069075tmp>
Running org.apache.hadoop.hbase.rest.TestRowResource
Tests run: 11, Failures: 0, Errors: 0, Skipped: 0, Time elapsed: 31.904 sec
Forking command line: /bin/sh -c cd <https://builds.apache.org/job/HBase-0.92-security/ws/trunk> && /home/jenkins/tools/java/jdk1.6.0_27-32/jre/bin/java -enableassertions -Xmx1400m -Djava.security.egd=file:/dev/./urandom -jar <https://builds.apache.org/job/HBase-0.92-security/ws/trunk/target/surefire/surefirebooter6646155755092900715.jar> <https://builds.apache.org/job/HBase-0.92-security/ws/trunk/target/surefire/surefire367873222841552307tmp> <https://builds.apache.org/job/HBase-0.92-security/ws/trunk/target/surefire/surefire7254153192587012887tmp>
Running org.apache.hadoop.hbase.rest.model.TestCellModel
Tests run: 3, Failures: 0, Errors: 0, Skipped: 0, Time elapsed: 0.38 sec
Forking command line: /bin/sh -c cd <https://builds.apache.org/job/HBase-0.92-security/ws/trunk> && /home/jenkins/tools/java/jdk1.6.0_27-32/jre/bin/java -enableassertions -Xmx1400m -Djava.security.egd=file:/dev/./urandom -jar <https://builds.apache.org/job/HBase-0.92-security/ws/trunk/target/surefire/surefirebooter3021075178752614445.jar> <https://builds.apache.org/job/HBase-0.92-security/ws/trunk/target/surefire/surefire1925041716393675137tmp> <https://builds.apache.org/job/HBase-0.92-security/ws/trunk/target/surefire/surefire1486938963265839561tmp>
Running org.apache.hadoop.hbase.rest.model.TestCellSetModel
Tests run: 3, Failures: 0, Errors: 0, Skipped: 0, Time elapsed: 0.426 sec
Forking command line: /bin/sh -c cd <https://builds.apache.org/job/HBase-0.92-security/ws/trunk> && /home/jenkins/tools/java/jdk1.6.0_27-32/jre/bin/java -enableassertions -Xmx1400m -Djava.security.egd=file:/dev/./urandom -jar <https://builds.apache.org/job/HBase-0.92-security/ws/trunk/target/surefire/surefirebooter8226011364232958701.jar> <https://builds.apache.org/job/HBase-0.92-security/ws/trunk/target/surefire/surefire293897403175985269tmp> <https://builds.apache.org/job/HBase-0.92-security/ws/trunk/target/surefire/surefire4704991321509252854tmp>
Running org.apache.hadoop.hbase.rest.model.TestTableListModel
Tests run: 3, Failures: 0, Errors: 0, Skipped: 0, Time elapsed: 0.39 sec
Forking command line: /bin/sh -c cd <https://builds.apache.org/job/HBase-0.92-security/ws/trunk> && /home/jenkins/tools/java/jdk1.6.0_27-32/jre/bin/java -enableassertions -Xmx1400m -Djava.security.egd=file:/dev/./urandom -jar <https://builds.apache.org/job/HBase-0.92-security/ws/trunk/target/surefire/surefirebooter5274325655213596139.jar> <https://builds.apache.org/job/HBase-0.92-security/ws/trunk/target/surefire/surefire1073005938212642492tmp> <https://builds.apache.org/job/HBase-0.92-security/ws/trunk/target/surefire/surefire166038977512291058tmp>
Running org.apache.hadoop.hbase.rest.model.TestVersionModel
Tests run: 3, Failures: 0, Errors: 0, Skipped: 0, Time elapsed: 0.374 sec
Forking command line: /bin/sh -c cd <https://builds.apache.org/job/HBase-0.92-security/ws/trunk> && /home/jenkins/tools/java/jdk1.6.0_27-32/jre/bin/java -enableassertions -Xmx1400m -Djava.security.egd=file:/dev/./urandom -jar <https://builds.apache.org/job/HBase-0.92-security/ws/trunk/target/surefire/surefirebooter5902562479273495289.jar> <https://builds.apache.org/job/HBase-0.92-security/ws/trunk/target/surefire/surefire1014568807662911106tmp> <https://builds.apache.org/job/HBase-0.92-security/ws/trunk/target/surefire/surefire1852585970004475733tmp>
Running org.apache.hadoop.hbase.rest.model.TestColumnSchemaModel
Tests run: 2, Failures: 0, Errors: 0, Skipped: 0, Time elapsed: 0.279 sec
Forking command line: /bin/sh -c cd <https://builds.apache.org/job/HBase-0.92-security/ws/trunk> && /home/jenkins/tools/java/jdk1.6.0_27-32/jre/bin/java -enableassertions -Xmx1400m -Djava.security.egd=file:/dev/./urandom -jar <https://builds.apache.org/job/HBase-0.92-security/ws/trunk/target/surefire/surefirebooter1162035033134515432.jar> <https://builds.apache.org/job/HBase-0.92-security/ws/trunk/target/surefire/surefire5125960791170528947tmp> <https://builds.apache.org/job/HBase-0.92-security/ws/trunk/target/surefire/surefire3672312341376855204tmp>
Running org.apache.hadoop.hbase.rest.model.TestTableInfoModel
Tests run: 3, Failures: 0, Errors: 0, Skipped: 0, Time elapsed: 0.411 sec
Forking command line: /bin/sh -c cd <https://builds.apache.org/job/HBase-0.92-security/ws/trunk> && /home/jenkins/tools/java/jdk1.6.0_27-32/jre/bin/java -enableassertions -Xmx1400m -Djava.security.egd=file:/dev/./urandom -jar <https://builds.apache.org/job/HBase-0.92-security/ws/trunk/target/surefire/surefirebooter6662072371756102480.jar> <https://builds.apache.org/job/HBase-0.92-security/ws/trunk/target/surefire/surefire3201660147647036282tmp> <https://builds.apache.org/job/HBase-0.92-security/ws/trunk/target/surefire/surefire2711936818774802742tmp>
Running org.apache.hadoop.hbase.rest.model.TestRowModel
Tests run: 2, Failures: 0, Errors: 0, Skipped: 0, Time elapsed: 0.376 sec
Forking command line: /bin/sh -c cd <https://builds.apache.org/job/HBase-0.92-security/ws/trunk> && /home/jenkins/tools/java/jdk1.6.0_27-32/jre/bin/java -enableassertions -Xmx1400m -Djava.security.egd=file:/dev/./urandom -jar <https://builds.apache.org/job/HBase-0.92-security/ws/trunk/target/surefire/surefirebooter3496096992315590308.jar> <https://builds.apache.org/job/HBase-0.92-security/ws/trunk/target/surefire/surefire4524272155505668792tmp> <https://builds.apache.org/job/HBase-0.92-security/ws/trunk/target/surefire/surefire907287285827358425tmp>
Running org.apache.hadoop.hbase.rest.model.TestTableSchemaModel
Tests run: 3, Failures: 0, Errors: 0, Skipped: 0, Time elapsed: 0.414 sec
Forking command line: /bin/sh -c cd <https://builds.apache.org/job/HBase-0.92-security/ws/trunk> && /home/jenkins/tools/java/jdk1.6.0_27-32/jre/bin/java -enableassertions -Xmx1400m -Djava.security.egd=file:/dev/./urandom -jar <https://builds.apache.org/job/HBase-0.92-security/ws/trunk/target/surefire/surefirebooter5810021526819880556.jar> <https://builds.apache.org/job/HBase-0.92-security/ws/trunk/target/surefire/surefire6024093462743515733tmp> <https://builds.apache.org/job/HBase-0.92-security/ws/trunk/target/surefire/surefire1296499576796230527tmp>
Running org.apache.hadoop.hbase.rest.model.TestStorageClusterVersionModel
Tests run: 2, Failures: 0, Errors: 0, Skipped: 0, Time elapsed: 0.276 sec
Forking command line: /bin/sh -c cd <https://builds.apache.org/job/HBase-0.92-security/ws/trunk> && /home/jenkins/tools/java/jdk1.6.0_27-32/jre/bin/java -enableassertions -Xmx1400m -Djava.security.egd=file:/dev/./urandom -jar <https://builds.apache.org/job/HBase-0.92-security/ws/trunk/target/surefire/surefirebooter7886240308097119455.jar> <https://builds.apache.org/job/HBase-0.92-security/ws/trunk/target/surefire/surefire3816491781202181545tmp> <https://builds.apache.org/job/HBase-0.92-security/ws/trunk/target/surefire/surefire793212606262117570tmp>
Running org.apache.hadoop.hbase.rest.model.TestTableRegionModel
Tests run: 4, Failures: 0, Errors: 0, Skipped: 0, Time elapsed: 0.486 sec
Forking command line: /bin/sh -c cd <https://builds.apache.org/job/HBase-0.92-security/ws/trunk> && /home/jenkins/tools/java/jdk1.6.0_27-32/jre/bin/java -enableassertions -Xmx1400m -Djava.security.egd=file:/dev/./urandom -jar <https://builds.apache.org/job/HBase-0.92-security/ws/trunk/target/surefire/surefirebooter8947399813011937094.jar> <https://builds.apache.org/job/HBase-0.92-security/ws/trunk/target/surefire/surefire8968417660913918519tmp> <https://builds.apache.org/job/HBase-0.92-security/ws/trunk/target/surefire/surefire1371067379945342459tmp>
Running org.apache.hadoop.hbase.rest.model.TestStorageClusterStatusModel
Tests run: 3, Failures: 0, Errors: 0, Skipped: 0, Time elapsed: 0.454 sec
Forking command line: /bin/sh -c cd <https://builds.apache.org/job/HBase-0.92-security/ws/trunk> && /home/jenkins/tools/java/jdk1.6.0_27-32/jre/bin/java -enableassertions -Xmx1400m -Djava.security.egd=file:/dev/./urandom -jar <https://builds.apache.org/job/HBase-0.92-security/ws/trunk/target/surefire/surefirebooter8644127261935560456.jar> <https://builds.apache.org/job/HBase-0.92-security/ws/trunk/target/surefire/surefire4102274821945891298tmp> <https://builds.apache.org/job/HBase-0.92-security/ws/trunk/target/surefire/surefire7254812891492451523tmp>
Running org.apache.hadoop.hbase.rest.model.TestScannerModel
Tests run: 3, Failures: 0, Errors: 0, Skipped: 0, Time elapsed: 0.415 sec
Forking command line: /bin/sh -c cd <https://builds.apache.org/job/HBase-0.92-security/ws/trunk> && /home/jenkins/tools/java/jdk1.6.0_27-32/jre/bin/java -enableassertions -Xmx1400m -Djava.security.egd=file:/dev/./urandom -jar <https://builds.apache.org/job/HBase-0.92-security/ws/trunk/target/surefire/surefirebooter1990960304163160157.jar> <https://builds.apache.org/job/HBase-0.92-security/ws/trunk/target/surefire/surefire251925364759798944tmp> <https://builds.apache.org/job/HBase-0.92-security/ws/trunk/target/surefire/surefire8745374364759728900tmp>
Running org.apache.hadoop.hbase.rest.client.TestRemoteAdmin
Tests run: 1, Failures: 0, Errors: 0, Skipped: 0, Time elapsed: 27.213 sec
Forking command line: /bin/sh -c cd <https://builds.apache.org/job/HBase-0.92-security/ws/trunk> && /home/jenkins/tools/java/jdk1.6.0_27-32/jre/bin/java -enableassertions -Xmx1400m -Djava.security.egd=file:/dev/./urandom -jar <https://builds.apache.org/job/HBase-0.92-security/ws/trunk/target/surefire/surefirebooter6222187403927188669.jar> <https://builds.apache.org/job/HBase-0.92-security/ws/trunk/target/surefire/surefire3035642219228943648tmp> <https://builds.apache.org/job/HBase-0.92-security/ws/trunk/target/surefire/surefire3753045286252019325tmp>
Running org.apache.hadoop.hbase.rest.client.TestRemoteTable
Tests run: 3, Failures: 0, Errors: 0, Skipped: 0, Time elapsed: 26.561 sec
Forking command line: /bin/sh -c cd <https://builds.apache.org/job/HBase-0.92-security/ws/trunk> && /home/jenkins/tools/java/jdk1.6.0_27-32/jre/bin/java -enableassertions -Xmx1400m -Djava.security.egd=file:/dev/./urandom -jar <https://builds.apache.org/job/HBase-0.92-security/ws/trunk/target/surefire/surefirebooter2846654845748401998.jar> <https://builds.apache.org/job/HBase-0.92-security/ws/trunk/target/surefire/surefire4515609663848622559tmp> <https://builds.apache.org/job/HBase-0.92-security/ws/trunk/target/surefire/surefire1769619749271904204tmp>
Running org.apache.hadoop.hbase.rest.TestVersionResource
Tests run: 7, Failures: 0, Errors: 0, Skipped: 0, Time elapsed: 20.935 sec
Forking command line: /bin/sh -c cd <https://builds.apache.org/job/HBase-0.92-security/ws/trunk> && /home/jenkins/tools/java/jdk1.6.0_27-32/jre/bin/java -enableassertions -Xmx1400m -Djava.security.egd=file:/dev/./urandom -jar <https://builds.apache.org/job/HBase-0.92-security/ws/trunk/target/surefire/surefirebooter2244135774332524405.jar> <https://builds.apache.org/job/HBase-0.92-security/ws/trunk/target/surefire/surefire4442200693716539978tmp> <https://builds.apache.org/job/HBase-0.92-security/ws/trunk/target/surefire/surefire8646032609231824175tmp>
Running org.apache.hadoop.hbase.rest.TestScannerResource
Tests run: 5, Failures: 0, Errors: 0, Skipped: 0, Time elapsed: 37.312 sec
Forking command line: /bin/sh -c cd <https://builds.apache.org/job/HBase-0.92-security/ws/trunk> && /home/jenkins/tools/java/jdk1.6.0_27-32/jre/bin/java -enableassertions -Xmx1400m -Djava.security.egd=file:/dev/./urandom -jar <https://builds.apache.org/job/HBase-0.92-security/ws/trunk/target/surefire/surefirebooter227988161452697153.jar> <https://builds.apache.org/job/HBase-0.92-security/ws/trunk/target/surefire/surefire8734930940690200174tmp> <https://builds.apache.org/job/HBase-0.92-security/ws/trunk/target/surefire/surefire8586096382055492467tmp>
Running org.apache.hadoop.hbase.rest.TestTableResource
Tests run: 8, Failures: 0, Errors: 0, Skipped: 0, Time elapsed: 38.757 sec
Forking command line: /bin/sh -c cd <https://builds.apache.org/job/HBase-0.92-security/ws/trunk> && /home/jenkins/tools/java/jdk1.6.0_27-32/jre/bin/java -enableassertions -Xmx1400m -Djava.security.egd=file:/dev/./urandom -jar <https://builds.apache.org/job/HBase-0.92-security/ws/trunk/target/surefire/surefirebooter1128858367196473060.jar> <https://builds.apache.org/job/HBase-0.92-security/ws/trunk/target/surefire/surefire2290283613019435125tmp> <https://builds.apache.org/job/HBase-0.92-security/ws/trunk/target/surefire/surefire5728208530162117142tmp>
Running org.apache.hadoop.hbase.rest.TestStatusResource
Tests run: 2, Failures: 0, Errors: 0, Skipped: 0, Time elapsed: 24.734 sec
Forking command line: /bin/sh -c cd <https://builds.apache.org/job/HBase-0.92-security/ws/trunk> && /home/jenkins/tools/java/jdk1.6.0_27-32/jre/bin/java -enableassertions -Xmx1400m -Djava.security.egd=file:/dev/./urandom -jar <https://builds.apache.org/job/HBase-0.92-security/ws/trunk/target/surefire/surefirebooter2694841530983845446.jar> <https://builds.apache.org/job/HBase-0.92-security/ws/trunk/target/surefire/surefire6983574468017545704tmp> <https://builds.apache.org/job/HBase-0.92-security/ws/trunk/target/surefire/surefire8783460189196158793tmp>
Running org.apache.hadoop.hbase.rest.TestSchemaResource
Tests run: 2, Failures: 0, Errors: 0, Skipped: 0, Time elapsed: 32.994 sec
Forking command line: /bin/sh -c cd <https://builds.apache.org/job/HBase-0.92-security/ws/trunk> && /home/jenkins/tools/java/jdk1.6.0_27-32/jre/bin/java -enableassertions -Xmx1400m -Djava.security.egd=file:/dev/./urandom -jar <https://builds.apache.org/job/HBase-0.92-security/ws/trunk/target/surefire/surefirebooter720779476107054292.jar> <https://builds.apache.org/job/HBase-0.92-security/ws/trunk/target/surefire/surefire7800100988650918036tmp> <https://builds.apache.org/job/HBase-0.92-security/ws/trunk/target/surefire/surefire7224576380200461111tmp>
Running org.apache.hadoop.hbase.thrift.TestThriftServer
Tests run: 1, Failures: 0, Errors: 0, Skipped: 0, Time elapsed: 31.106 sec
Forking command line: /bin/sh -c cd <https://builds.apache.org/job/HBase-0.92-security/ws/trunk> && /home/jenkins/tools/java/jdk1.6.0_27-32/jre/bin/java -enableassertions -Xmx1400m -Djava.security.egd=file:/dev/./urandom -jar <https://builds.apache.org/job/HBase-0.92-security/ws/trunk/target/surefire/surefirebooter7267664097829288950.jar> <https://builds.apache.org/job/HBase-0.92-security/ws/trunk/target/surefire/surefire1922832106742194762tmp> <https://builds.apache.org/job/HBase-0.92-security/ws/trunk/target/surefire/surefire2685146542630930012tmp>
Running org.apache.hadoop.hbase.io.TestHeapSize
Tests run: 2, Failures: 0, Errors: 0, Skipped: 0, Time elapsed: 0.162 sec
Forking command line: /bin/sh -c cd <https://builds.apache.org/job/HBase-0.92-security/ws/trunk> && /home/jenkins/tools/java/jdk1.6.0_27-32/jre/bin/java -enableassertions -Xmx1400m -Djava.security.egd=file:/dev/./urandom -jar <https://builds.apache.org/job/HBase-0.92-security/ws/trunk/target/surefire/surefirebooter5364257482172293527.jar> <https://builds.apache.org/job/HBase-0.92-security/ws/trunk/target/surefire/surefire2714752107329419606tmp> <https://builds.apache.org/job/HBase-0.92-security/ws/trunk/target/surefire/surefire446483724559481622tmp>
Running org.apache.hadoop.hbase.io.hfile.TestHFileInlineToRootChunkConversion
Tests run: 1, Failures: 0, Errors: 0, Skipped: 0, Time elapsed: 0.621 sec
Forking command line: /bin/sh -c cd <https://builds.apache.org/job/HBase-0.92-security/ws/trunk> && /home/jenkins/tools/java/jdk1.6.0_27-32/jre/bin/java -enableassertions -Xmx1400m -Djava.security.egd=file:/dev/./urandom -jar <https://builds.apache.org/job/HBase-0.92-security/ws/trunk/target/surefire/surefirebooter6293264368485356198.jar> <https://builds.apache.org/job/HBase-0.92-security/ws/trunk/target/surefire/surefire7601503260944083502tmp> <https://builds.apache.org/job/HBase-0.92-security/ws/trunk/target/surefire/surefire8499811669815093630tmp>
Running org.apache.hadoop.hbase.io.hfile.TestHFileSeek
Tests run: 1, Failures: 0, Errors: 0, Skipped: 0, Time elapsed: 5.708 sec
Forking command line: /bin/sh -c cd <https://builds.apache.org/job/HBase-0.92-security/ws/trunk> && /home/jenkins/tools/java/jdk1.6.0_27-32/jre/bin/java -enableassertions -Xmx1400m -Djava.security.egd=file:/dev/./urandom -jar <https://builds.apache.org/job/HBase-0.92-security/ws/trunk/target/surefire/surefirebooter1213866749566087360.jar> <https://builds.apache.org/job/HBase-0.92-security/ws/trunk/target/surefire/surefire1447317909859863715tmp> <https://builds.apache.org/job/HBase-0.92-security/ws/trunk/target/surefire/surefire1466434802521628546tmp>
Running org.apache.hadoop.hbase.io.hfile.slab.TestSlab
Tests run: 1, Failures: 0, Errors: 0, Skipped: 0, Time elapsed: 0.146 sec
Forking command line: /bin/sh -c cd <https://builds.apache.org/job/HBase-0.92-security/ws/trunk> && /home/jenkins/tools/java/jdk1.6.0_27-32/jre/bin/java -enableassertions -Xmx1400m -Djava.security.egd=file:/dev/./urandom -jar <https://builds.apache.org/job/HBase-0.92-security/ws/trunk/target/surefire/surefirebooter5755688937321011989.jar> <https://builds.apache.org/job/HBase-0.92-security/ws/trunk/target/surefire/surefire2852169956301721473tmp> <https://builds.apache.org/job/HBase-0.92-security/ws/trunk/target/surefire/surefire3737913482444031673tmp>
Running org.apache.hadoop.hbase.io.hfile.slab.TestSlabCache
Tests run: 7, Failures: 0, Errors: 0, Skipped: 0, Time elapsed: 22.043 sec
Forking command line: /bin/sh -c cd <https://builds.apache.org/job/HBase-0.92-security/ws/trunk> && /home/jenkins/tools/java/jdk1.6.0_27-32/jre/bin/java -enableassertions -Xmx1400m -Djava.security.egd=file:/dev/./urandom -jar <https://builds.apache.org/job/HBase-0.92-security/ws/trunk/target/surefire/surefirebooter2555262751667584900.jar> <https://builds.apache.org/job/HBase-0.92-security/ws/trunk/target/surefire/surefire2933116241739160052tmp> <https://builds.apache.org/job/HBase-0.92-security/ws/trunk/target/surefire/surefire5149102241517679196tmp>
Running org.apache.hadoop.hbase.io.hfile.slab.TestSingleSizeCache
Tests run: 5, Failures: 0, Errors: 0, Skipped: 0, Time elapsed: 25.344 sec
Forking command line: /bin/sh -c cd <https://builds.apache.org/job/HBase-0.92-security/ws/trunk> && /home/jenkins/tools/java/jdk1.6.0_27-32/jre/bin/java -enableassertions -Xmx1400m -Djava.security.egd=file:/dev/./urandom -jar <https://builds.apache.org/job/HBase-0.92-security/ws/trunk/target/surefire/surefirebooter3415887905069131834.jar> <https://builds.apache.org/job/HBase-0.92-security/ws/trunk/target/surefire/surefire916474681845512952tmp> <https://builds.apache.org/job/HBase-0.92-security/ws/trunk/target/surefire/surefire8252399878201223290tmp>
Running org.apache.hadoop.hbase.io.hfile.TestCachedBlockQueue
Tests run: 2, Failures: 0, Errors: 0, Skipped: 0, Time elapsed: 0.13 sec
Forking command line: /bin/sh -c cd <https://builds.apache.org/job/HBase-0.92-security/ws/trunk> && /home/jenkins/tools/java/jdk1.6.0_27-32/jre/bin/java -enableassertions -Xmx1400m -Djava.security.egd=file:/dev/./urandom -jar <https://builds.apache.org/job/HBase-0.92-security/ws/trunk/target/surefire/surefirebooter5203223665617988306.jar> <https://builds.apache.org/job/HBase-0.92-security/ws/trunk/target/surefire/surefire2923658339347564639tmp> <https://builds.apache.org/job/HBase-0.92-security/ws/trunk/target/surefire/surefire5591327292041088026tmp>
Running org.apache.hadoop.hbase.io.hfile.TestHFileBlockIndex
Tests run: 10, Failures: 0, Errors: 0, Skipped: 0, Time elapsed: 10.247 sec
Forking command line: /bin/sh -c cd <https://builds.apache.org/job/HBase-0.92-security/ws/trunk> && /home/jenkins/tools/java/jdk1.6.0_27-32/jre/bin/java -enableassertions -Xmx1400m -Djava.security.egd=file:/dev/./urandom -jar <https://builds.apache.org/job/HBase-0.92-security/ws/trunk/target/surefire/surefirebooter322621581445048322.jar> <https://builds.apache.org/job/HBase-0.92-security/ws/trunk/target/surefire/surefire3745387091006370345tmp> <https://builds.apache.org/job/HBase-0.92-security/ws/trunk/target/surefire/surefire2256709516064818366tmp>
Running org.apache.hadoop.hbase.io.hfile.TestLruBlockCache
Tests run: 7, Failures: 0, Errors: 0, Skipped: 0, Time elapsed: 0.462 sec
Forking command line: /bin/sh -c cd <https://builds.apache.org/job/HBase-0.92-security/ws/trunk> && /home/jenkins/tools/java/jdk1.6.0_27-32/jre/bin/java -enableassertions -Xmx1400m -Djava.security.egd=file:/dev/./urandom -jar <https://builds.apache.org/job/HBase-0.92-security/ws/trunk/target/surefire/surefirebooter5645720715043715638.jar> <https://builds.apache.org/job/HBase-0.92-security/ws/trunk/target/surefire/surefire3058379972723625839tmp> <https://builds.apache.org/job/HBase-0.92-security/ws/trunk/target/surefire/surefire8660001547672182813tmp>
Running org.apache.hadoop.hbase.io.hfile.TestHFilePerformance
Tests run: 1, Failures: 0, Errors: 0, Skipped: 0, Time elapsed: 5.878 sec
Forking command line: /bin/sh -c cd <https://builds.apache.org/job/HBase-0.92-security/ws/trunk> && /home/jenkins/tools/java/jdk1.6.0_27-32/jre/bin/java -enableassertions -Xmx1400m -Djava.security.egd=file:/dev/./urandom -jar <https://builds.apache.org/job/HBase-0.92-security/ws/trunk/target/surefire/surefirebooter3778897706159020171.jar> <https://builds.apache.org/job/HBase-0.92-security/ws/trunk/target/surefire/surefire3061320610905265916tmp> <https://builds.apache.org/job/HBase-0.92-security/ws/trunk/target/surefire/surefire43120759142613296tmp>
Running org.apache.hadoop.hbase.io.hfile.TestFixedFileTrailer
Tests run: 2, Failures: 0, Errors: 0, Skipped: 0, Time elapsed: 0.623 sec
Forking command line: /bin/sh -c cd <https://builds.apache.org/job/HBase-0.92-security/ws/trunk> && /home/jenkins/tools/java/jdk1.6.0_27-32/jre/bin/java -enableassertions -Xmx1400m -Djava.security.egd=file:/dev/./urandom -jar <https://builds.apache.org/job/HBase-0.92-security/ws/trunk/target/surefire/surefirebooter8130450084730461420.jar> <https://builds.apache.org/job/HBase-0.92-security/ws/trunk/target/surefire/surefire1168216541314777739tmp> <https://builds.apache.org/job/HBase-0.92-security/ws/trunk/target/surefire/surefire5535331477494646774tmp>
Running org.apache.hadoop.hbase.io.hfile.TestHFileWriterV2
Tests run: 1, Failures: 0, Errors: 0, Skipped: 0, Time elapsed: 1.021 sec
Forking command line: /bin/sh -c cd <https://builds.apache.org/job/HBase-0.92-security/ws/trunk> && /home/jenkins/tools/java/jdk1.6.0_27-32/jre/bin/java -enableassertions -Xmx1400m -Djava.security.egd=file:/dev/./urandom -jar <https://builds.apache.org/job/HBase-0.92-security/ws/trunk/target/surefire/surefirebooter848510805491395020.jar> <https://builds.apache.org/job/HBase-0.92-security/ws/trunk/target/surefire/surefire6259654157432405365tmp> <https://builds.apache.org/job/HBase-0.92-security/ws/trunk/target/surefire/surefire3205028678233171447tmp>
Running org.apache.hadoop.hbase.io.hfile.TestBlockCacheColumnFamilySummary
Tests run: 4, Failures: 0, Errors: 0, Skipped: 0, Time elapsed: 0.058 sec
Forking command line: /bin/sh -c cd <https://builds.apache.org/job/HBase-0.92-security/ws/trunk> && /home/jenkins/tools/java/jdk1.6.0_27-32/jre/bin/java -enableassertions -Xmx1400m -Djava.security.egd=file:/dev/./urandom -jar <https://builds.apache.org/job/HBase-0.92-security/ws/trunk/target/surefire/surefirebooter1288556143139022153.jar> <https://builds.apache.org/job/HBase-0.92-security/ws/trunk/target/surefire/surefire3827858426513846610tmp> <https://builds.apache.org/job/HBase-0.92-security/ws/trunk/target/surefire/surefire4287930533226955057tmp>
Running org.apache.hadoop.hbase.io.hfile.TestHFileReaderV1
Tests run: 1, Failures: 0, Errors: 0, Skipped: 0, Time elapsed: 0.618 sec
Forking command line: /bin/sh -c cd <https://builds.apache.org/job/HBase-0.92-security/ws/trunk> && /home/jenkins/tools/java/jdk1.6.0_27-32/jre/bin/java -enableassertions -Xmx1400m -Djava.security.egd=file:/dev/./urandom -jar <https://builds.apache.org/job/HBase-0.92-security/ws/trunk/target/surefire/surefirebooter7282554021874019913.jar> <https://builds.apache.org/job/HBase-0.92-security/ws/trunk/target/surefire/surefire5702433028517843638tmp> <https://builds.apache.org/job/HBase-0.92-security/ws/trunk/target/surefire/surefire318107621067323840tmp>
Running org.apache.hadoop.hbase.io.hfile.TestHFile
Tests run: 8, Failures: 0, Errors: 0, Skipped: 0, Time elapsed: 0.902 sec
Forking command line: /bin/sh -c cd <https://builds.apache.org/job/HBase-0.92-security/ws/trunk> && /home/jenkins/tools/java/jdk1.6.0_27-32/jre/bin/java -enableassertions -Xmx1400m -Djava.security.egd=file:/dev/./urandom -jar <https://builds.apache.org/job/HBase-0.92-security/ws/trunk/target/surefire/surefirebooter5183286788871572250.jar> <https://builds.apache.org/job/HBase-0.92-security/ws/trunk/target/surefire/surefire5445552333369172949tmp> <https://builds.apache.org/job/HBase-0.92-security/ws/trunk/target/surefire/surefire2837990913389786317tmp>
Running org.apache.hadoop.hbase.io.hfile.TestReseekTo
Tests run: 1, Failures: 0, Errors: 0, Skipped: 0, Time elapsed: 0.713 sec
Forking command line: /bin/sh -c cd <https://builds.apache.org/job/HBase-0.92-security/ws/trunk> && /home/jenkins/tools/java/jdk1.6.0_27-32/jre/bin/java -enableassertions -Xmx1400m -Djava.security.egd=file:/dev/./urandom -jar <https://builds.apache.org/job/HBase-0.92-security/ws/trunk/target/surefire/surefirebooter1008637635488858894.jar> <https://builds.apache.org/job/HBase-0.92-security/ws/trunk/target/surefire/surefire4311001880074081296tmp> <https://builds.apache.org/job/HBase-0.92-security/ws/trunk/target/surefire/surefire5709246526299843360tmp>
Running org.apache.hadoop.hbase.io.hfile.TestHFileBlock
Tests run: 7, Failures: 0, Errors: 0, Skipped: 0, Time elapsed: 26.06 sec
Forking command line: /bin/sh -c cd <https://builds.apache.org/job/HBase-0.92-security/ws/trunk> && /home/jenkins/tools/java/jdk1.6.0_27-32/jre/bin/java -enableassertions -Xmx1400m -Djava.security.egd=file:/dev/./urandom -jar <https://builds.apache.org/job/HBase-0.92-security/ws/trunk/target/surefire/surefirebooter2904534101355202902.jar> <https://builds.apache.org/job/HBase-0.92-security/ws/trunk/target/surefire/surefire2823373659363973920tmp> <https://builds.apache.org/job/HBase-0.92-security/ws/trunk/target/surefire/surefire3800124462152604791tmp>
Running org.apache.hadoop.hbase.io.hfile.TestSeekTo
Tests run: 3, Failures: 0, Errors: 0, Skipped: 0, Time elapsed: 0.737 sec
Forking command line: /bin/sh -c cd <https://builds.apache.org/job/HBase-0.92-security/ws/trunk> && /home/jenkins/tools/java/jdk1.6.0_27-32/jre/bin/java -enableassertions -Xmx1400m -Djava.security.egd=file:/dev/./urandom -jar <https://builds.apache.org/job/HBase-0.92-security/ws/trunk/target/surefire/surefirebooter7142406894469490146.jar> <https://builds.apache.org/job/HBase-0.92-security/ws/trunk/target/surefire/surefire7912435757196589520tmp> <https://builds.apache.org/job/HBase-0.92-security/ws/trunk/target/surefire/surefire7130330359074065246tmp>
Running org.apache.hadoop.hbase.io.hfile.TestCacheOnWrite
Tests run: 6, Failures: 0, Errors: 0, Skipped: 0, Time elapsed: 7.197 sec
Forking command line: /bin/sh -c cd <https://builds.apache.org/job/HBase-0.92-security/ws/trunk> && /home/jenkins/tools/java/jdk1.6.0_27-32/jre/bin/java -enableassertions -Xmx1400m -Djava.security.egd=file:/dev/./urandom -jar <https://builds.apache.org/job/HBase-0.92-security/ws/trunk/target/surefire/surefirebooter8472334389283291451.jar> <https://builds.apache.org/job/HBase-0.92-security/ws/trunk/target/surefire/surefire8794840260895371398tmp> <https://builds.apache.org/job/HBase-0.92-security/ws/trunk/target/surefire/surefire2857004284049976172tmp>
Running org.apache.hadoop.hbase.io.TestHbaseObjectWritable
Tests run: 5, Failures: 0, Errors: 0, Skipped: 0, Time elapsed: 0.523 sec
Forking command line: /bin/sh -c cd <https://builds.apache.org/job/HBase-0.92-security/ws/trunk> && /home/jenkins/tools/java/jdk1.6.0_27-32/jre/bin/java -enableassertions -Xmx1400m -Djava.security.egd=file:/dev/./urandom -jar <https://builds.apache.org/job/HBase-0.92-security/ws/trunk/target/surefire/surefirebooter6513261030050671333.jar> <https://builds.apache.org/job/HBase-0.92-security/ws/trunk/target/surefire/surefire6316672511374529598tmp> <https://builds.apache.org/job/HBase-0.92-security/ws/trunk/target/surefire/surefire9100218609630768676tmp>
Running org.apache.hadoop.hbase.io.TestImmutableBytesWritable
Tests run: 3, Failures: 0, Errors: 0, Skipped: 0, Time elapsed: 0.11 sec
Forking command line: /bin/sh -c cd <https://builds.apache.org/job/HBase-0.92-security/ws/trunk> && /home/jenkins/tools/java/jdk1.6.0_27-32/jre/bin/java -enableassertions -Xmx1400m -Djava.security.egd=file:/dev/./urandom -jar <https://builds.apache.org/job/HBase-0.92-security/ws/trunk/target/surefire/surefirebooter8768194867659666124.jar> <https://builds.apache.org/job/HBase-0.92-security/ws/trunk/target/surefire/surefire148519842788182903tmp> <https://builds.apache.org/job/HBase-0.92-security/ws/trunk/target/surefire/surefire5732124890350346594tmp>
Running org.apache.hadoop.hbase.io.TestHalfStoreFileReader
Tests run: 1, Failures: 0, Errors: 0, Skipped: 0, Time elapsed: 0.742 sec
Forking command line: /bin/sh -c cd <https://builds.apache.org/job/HBase-0.92-security/ws/trunk> && /home/jenkins/tools/java/jdk1.6.0_27-32/jre/bin/java -enableassertions -Xmx1400m -Djava.security.egd=file:/dev/./urandom -jar <https://builds.apache.org/job/HBase-0.92-security/ws/trunk/target/surefire/surefirebooter8288243600478063574.jar> <https://builds.apache.org/job/HBase-0.92-security/ws/trunk/target/surefire/surefire6875978998058668529tmp> <https://builds.apache.org/job/HBase-0.92-security/ws/trunk/target/surefire/surefire3324076165003204078tmp>
Running org.apache.hadoop.hbase.TestClusterBootOrder
Tests run: 2, Failures: 0, Errors: 0, Skipped: 0, Time elapsed: 43.359 sec
Forking command line: /bin/sh -c cd <https://builds.apache.org/job/HBase-0.92-security/ws/trunk> && /home/jenkins/tools/java/jdk1.6.0_27-32/jre/bin/java -enableassertions -Xmx1400m -Djava.security.egd=file:/dev/./urandom -jar <https://builds.apache.org/job/HBase-0.92-security/ws/trunk/target/surefire/surefirebooter909686336271265883.jar> <https://builds.apache.org/job/HBase-0.92-security/ws/trunk/target/surefire/surefire3792682559819989480tmp> <https://builds.apache.org/job/HBase-0.92-security/ws/trunk/target/surefire/surefire4058941257888845916tmp>
Running org.apache.hadoop.hbase.migration.TestMigrationFrom090To092
Tests run: 1, Failures: 0, Errors: 0, Skipped: 0, Time elapsed: 0.285 sec
Forking command line: /bin/sh -c cd <https://builds.apache.org/job/HBase-0.92-security/ws/trunk> && /home/jenkins/tools/java/jdk1.6.0_27-32/jre/bin/java -enableassertions -Xmx1400m -Djava.security.egd=file:/dev/./urandom -jar <https://builds.apache.org/job/HBase-0.92-security/ws/trunk/target/surefire/surefirebooter2988647038764946915.jar> <https://builds.apache.org/job/HBase-0.92-security/ws/trunk/target/surefire/surefire2777724065549365826tmp> <https://builds.apache.org/job/HBase-0.92-security/ws/trunk/target/surefire/surefire8487290997592955643tmp>
Running org.apache.hadoop.hbase.TestFSTableDescriptorForceCreation
Tests run: 3, Failures: 0, Errors: 0, Skipped: 0, Time elapsed: 0.606 sec
Forking command line: /bin/sh -c cd <https://builds.apache.org/job/HBase-0.92-security/ws/trunk> && /home/jenkins/tools/java/jdk1.6.0_27-32/jre/bin/java -enableassertions -Xmx1400m -Djava.security.egd=file:/dev/./urandom -jar <https://builds.apache.org/job/HBase-0.92-security/ws/trunk/target/surefire/surefirebooter8259211875376550519.jar> <https://builds.apache.org/job/HBase-0.92-security/ws/trunk/target/surefire/surefire2378370945069267746tmp> <https://builds.apache.org/job/HBase-0.92-security/ws/trunk/target/surefire/surefire5843993992802511179tmp>
Running org.apache.hadoop.hbase.avro.TestAvroUtil
Tests run: 1, Failures: 0, Errors: 0, Skipped: 0, Time elapsed: 0.462 sec
Forking command line: /bin/sh -c cd <https://builds.apache.org/job/HBase-0.92-security/ws/trunk> && /home/jenkins/tools/java/jdk1.6.0_27-32/jre/bin/java -enableassertions -Xmx1400m -Djava.security.egd=file:/dev/./urandom -jar <https://builds.apache.org/job/HBase-0.92-security/ws/trunk/target/surefire/surefirebooter6499403107570559683.jar> <https://builds.apache.org/job/HBase-0.92-security/ws/trunk/target/surefire/surefire2519689524224353342tmp> <https://builds.apache.org/job/HBase-0.92-security/ws/trunk/target/surefire/surefire3762661178376258657tmp>
Running org.apache.hadoop.hbase.avro.TestAvroServer
Tests run: 3, Failures: 0, Errors: 0, Skipped: 0, Time elapsed: 43.01 sec
Forking command line: /bin/sh -c cd <https://builds.apache.org/job/HBase-0.92-security/ws/trunk> && /home/jenkins/tools/java/jdk1.6.0_27-32/jre/bin/java -enableassertions -Xmx1400m -Djava.security.egd=file:/dev/./urandom -jar <https://builds.apache.org/job/HBase-0.92-security/ws/trunk/target/surefire/surefirebooter3788175269633196617.jar> <https://builds.apache.org/job/HBase-0.92-security/ws/trunk/target/surefire/surefire369838449152958304tmp> <https://builds.apache.org/job/HBase-0.92-security/ws/trunk/target/surefire/surefire4935459838212082403tmp>
Running org.apache.hadoop.hbase.TestKeyValue
Tests run: 15, Failures: 0, Errors: 0, Skipped: 0, Time elapsed: 0.134 sec
Forking command line: /bin/sh -c cd <https://builds.apache.org/job/HBase-0.92-security/ws/trunk> && /home/jenkins/tools/java/jdk1.6.0_27-32/jre/bin/java -enableassertions -Xmx1400m -Djava.security.egd=file:/dev/./urandom -jar <https://builds.apache.org/job/HBase-0.92-security/ws/trunk/target/surefire/surefirebooter822301111911537755.jar> <https://builds.apache.org/job/HBase-0.92-security/ws/trunk/target/surefire/surefire5263157391739155967tmp> <https://builds.apache.org/job/HBase-0.92-security/ws/trunk/target/surefire/surefire4845114269703511353tmp>
Running org.apache.hadoop.hbase.replication.TestMultiSlaveReplication
Tests run: 1, Failures: 0, Errors: 0, Skipped: 0, Time elapsed: 115.263 sec
Forking command line: /bin/sh -c cd <https://builds.apache.org/job/HBase-0.92-security/ws/trunk> && /home/jenkins/tools/java/jdk1.6.0_27-32/jre/bin/java -enableassertions -Xmx1400m -Djava.security.egd=file:/dev/./urandom -jar <https://builds.apache.org/job/HBase-0.92-security/ws/trunk/target/surefire/surefirebooter6168929799480661604.jar> <https://builds.apache.org/job/HBase-0.92-security/ws/trunk/target/surefire/surefire3366607350881683928tmp> <https://builds.apache.org/job/HBase-0.92-security/ws/trunk/target/surefire/surefire2622781213591369610tmp>
Running org.apache.hadoop.hbase.replication.regionserver.TestReplicationSourceManager
Tests run: 1, Failures: 0, Errors: 0, Skipped: 0, Time elapsed: 1.741 sec
Forking command line: /bin/sh -c cd <https://builds.apache.org/job/HBase-0.92-security/ws/trunk> && /home/jenkins/tools/java/jdk1.6.0_27-32/jre/bin/java -enableassertions -Xmx1400m -Djava.security.egd=file:/dev/./urandom -jar <https://builds.apache.org/job/HBase-0.92-security/ws/trunk/target/surefire/surefirebooter5882574643294660306.jar> <https://builds.apache.org/job/HBase-0.92-security/ws/trunk/target/surefire/surefire5755023933082547159tmp> <https://builds.apache.org/job/HBase-0.92-security/ws/trunk/target/surefire/surefire3050577543808831860tmp>
Running org.apache.hadoop.hbase.replication.regionserver.TestReplicationSink
Tests run: 6, Failures: 0, Errors: 0, Skipped: 0, Time elapsed: 44.669 sec
Forking command line: /bin/sh -c cd <https://builds.apache.org/job/HBase-0.92-security/ws/trunk> && /home/jenkins/tools/java/jdk1.6.0_27-32/jre/bin/java -enableassertions -Xmx1400m -Djava.security.egd=file:/dev/./urandom -jar <https://builds.apache.org/job/HBase-0.92-security/ws/trunk/target/surefire/surefirebooter8695621763167431224.jar> <https://builds.apache.org/job/HBase-0.92-security/ws/trunk/target/surefire/surefire5145907743222664283tmp> <https://builds.apache.org/job/HBase-0.92-security/ws/trunk/target/surefire/surefire716956959406350646tmp>
Running org.apache.hadoop.hbase.replication.TestMasterReplication
Tests run: 2, Failures: 0, Errors: 0, Skipped: 0, Time elapsed: 135.435 sec
Forking command line: /bin/sh -c cd <https://builds.apache.org/job/HBase-0.92-security/ws/trunk> && /home/jenkins/tools/java/jdk1.6.0_27-32/jre/bin/java -enableassertions -Xmx1400m -Djava.security.egd=file:/dev/./urandom -jar <https://builds.apache.org/job/HBase-0.92-security/ws/trunk/target/surefire/surefirebooter3460691447637297597.jar> <https://builds.apache.org/job/HBase-0.92-security/ws/trunk/target/surefire/surefire6959077140885539359tmp> <https://builds.apache.org/job/HBase-0.92-security/ws/trunk/target/surefire/surefire8130363508824928649tmp>
Running org.apache.hadoop.hbase.replication.TestReplicationSource
Tests run: 1, Failures: 0, Errors: 0, Skipped: 0, Time elapsed: 4.652 sec
Forking command line: /bin/sh -c cd <https://builds.apache.org/job/HBase-0.92-security/ws/trunk> && /home/jenkins/tools/java/jdk1.6.0_27-32/jre/bin/java -enableassertions -Xmx1400m -Djava.security.egd=file:/dev/./urandom -jar <https://builds.apache.org/job/HBase-0.92-security/ws/trunk/target/surefire/surefirebooter343074539504957746.jar> <https://builds.apache.org/job/HBase-0.92-security/ws/trunk/target/surefire/surefire3248236242662740880tmp> <https://builds.apache.org/job/HBase-0.92-security/ws/trunk/target/surefire/surefire4578373691605108561tmp>
Running org.apache.hadoop.hbase.replication.TestReplicationPeer
Tests run: 1, Failures: 0, Errors: 0, Skipped: 0, Time elapsed: 1.049 sec
Forking command line: /bin/sh -c cd <https://builds.apache.org/job/HBase-0.92-security/ws/trunk> && /home/jenkins/tools/java/jdk1.6.0_27-32/jre/bin/java -enableassertions -Xmx1400m -Djava.security.egd=file:/dev/./urandom -jar <https://builds.apache.org/job/HBase-0.92-security/ws/trunk/target/surefire/surefirebooter8188154266403074430.jar> <https://builds.apache.org/job/HBase-0.92-security/ws/trunk/target/surefire/surefire6152672468446751808tmp> <https://builds.apache.org/job/HBase-0.92-security/ws/trunk/target/surefire/surefire9033248445503220184tmp>
Running org.apache.hadoop.hbase.replication.TestReplicationZookeeper
Tests run: 1, Failures: 0, Errors: 0, Skipped: 0, Time elapsed: 0.796 sec
Forking command line: /bin/sh -c cd <https://builds.apache.org/job/HBase-0.92-security/ws/trunk> && /home/jenkins/tools/java/jdk1.6.0_27-32/jre/bin/java -enableassertions -Xmx1400m -Djava.security.egd=file:/dev/./urandom -jar <https://builds.apache.org/job/HBase-0.92-security/ws/trunk/target/surefire/surefirebooter2579033203083170253.jar> <https://builds.apache.org/job/HBase-0.92-security/ws/trunk/target/surefire/surefire5842317102243707023tmp> <https://builds.apache.org/job/HBase-0.92-security/ws/trunk/target/surefire/surefire393747532618745524tmp>
Running org.apache.hadoop.hbase.replication.TestReplication
Tests run: 8, Failures: 0, Errors: 0, Skipped: 0, Time elapsed: 167.987 sec
Forking command line: /bin/sh -c cd <https://builds.apache.org/job/HBase-0.92-security/ws/trunk> && /home/jenkins/tools/java/jdk1.6.0_27-32/jre/bin/java -enableassertions -Xmx1400m -Djava.security.egd=file:/dev/./urandom -jar <https://builds.apache.org/job/HBase-0.92-security/ws/trunk/target/surefire/surefirebooter7779798746728976323.jar> <https://builds.apache.org/job/HBase-0.92-security/ws/trunk/target/surefire/surefire2871756025937208511tmp> <https://builds.apache.org/job/HBase-0.92-security/ws/trunk/target/surefire/surefire733261630102410367tmp>
Running org.apache.hadoop.hbase.ipc.TestDelayedRpc
Tests run: 4, Failures: 0, Errors: 0, Skipped: 0, Time elapsed: 2.336 sec
Forking command line: /bin/sh -c cd <https://builds.apache.org/job/HBase-0.92-security/ws/trunk> && /home/jenkins/tools/java/jdk1.6.0_27-32/jre/bin/java -enableassertions -Xmx1400m -Djava.security.egd=file:/dev/./urandom -jar <https://builds.apache.org/job/HBase-0.92-security/ws/trunk/target/surefire/surefirebooter8422231147793632084.jar> <https://builds.apache.org/job/HBase-0.92-security/ws/trunk/target/surefire/surefire8645458208998741055tmp> <https://builds.apache.org/job/HBase-0.92-security/ws/trunk/target/surefire/surefire387406485784958333tmp>
Running org.apache.hadoop.hbase.TestCompare
Tests run: 1, Failures: 0, Errors: 0, Skipped: 0, Time elapsed: 0.24 sec
Forking command line: /bin/sh -c cd <https://builds.apache.org/job/HBase-0.92-security/ws/trunk> && /home/jenkins/tools/java/jdk1.6.0_27-32/jre/bin/java -enableassertions -Xmx1400m -Djava.security.egd=file:/dev/./urandom -jar <https://builds.apache.org/job/HBase-0.92-security/ws/trunk/target/surefire/surefirebooter3093868616326350863.jar> <https://builds.apache.org/job/HBase-0.92-security/ws/trunk/target/surefire/surefire2032345091628886386tmp> <https://builds.apache.org/job/HBase-0.92-security/ws/trunk/target/surefire/surefire1736028398438480383tmp>
Running org.apache.hadoop.hbase.TestZooKeeper
Tests run: 6, Failures: 0, Errors: 0, Skipped: 0, Time elapsed: 79.337 sec
Forking command line: /bin/sh -c cd <https://builds.apache.org/job/HBase-0.92-security/ws/trunk> && /home/jenkins/tools/java/jdk1.6.0_27-32/jre/bin/java -enableassertions -Xmx1400m -Djava.security.egd=file:/dev/./urandom -jar <https://builds.apache.org/job/HBase-0.92-security/ws/trunk/target/surefire/surefirebooter2672853672933110422.jar> <https://builds.apache.org/job/HBase-0.92-security/ws/trunk/target/surefire/surefire3595497974737836166tmp> <https://builds.apache.org/job/HBase-0.92-security/ws/trunk/target/surefire/surefire5968985523246219922tmp>
Running org.apache.hadoop.hbase.TestHBaseTestingUtility
Tests run: 7, Failures: 0, Errors: 0, Skipped: 0, Time elapsed: 169.679 sec

Results :

Tests run: 1187, Failures: 0, Errors: 0, Skipped: 8

[INFO] ------------------------------------------------------------------------
[INFO] BUILD FAILURE
[INFO] ------------------------------------------------------------------------
[INFO] Total time: 2:48:24.188s
[INFO] Finished at: Mon Nov 05 03:56:59 UTC 2012
[INFO] Final Memory: 50M/398M
[INFO] ------------------------------------------------------------------------
[ERROR] Failed to execute goal org.apache.maven.plugins:maven-surefire-plugin:2.10:test (default-test) on project hbase: Failure or timeout -> [Help 1]
org.apache.maven.lifecycle.LifecycleExecutionException: Failed to execute goal org.apache.maven.plugins:maven-surefire-plugin:2.10:test (default-test) on project hbase: Failure or timeout
	at org.apache.maven.lifecycle.internal.MojoExecutor.execute(MojoExecutor.java:217)
	at org.apache.maven.lifecycle.internal.MojoExecutor.execute(MojoExecutor.java:153)
	at org.apache.maven.lifecycle.internal.MojoExecutor.execute(MojoExecutor.java:145)
	at org.apache.maven.lifecycle.internal.LifecycleModuleBuilder.buildProject(LifecycleModuleBuilder.java:84)
	at org.apache.maven.lifecycle.internal.LifecycleModuleBuilder.buildProject(LifecycleModuleBuilder.java:59)
	at org.apache.maven.lifecycle.internal.LifecycleStarter.singleThreadedBuild(LifecycleStarter.java:183)
	at org.apache.maven.lifecycle.internal.LifecycleStarter.execute(LifecycleStarter.java:161)
	at org.apache.maven.DefaultMaven.doExecute(DefaultMaven.java:319)
	at org.apache.maven.DefaultMaven.execute(DefaultMaven.java:156)
	at org.apache.maven.cli.MavenCli.execute(MavenCli.java:537)
	at org.apache.maven.cli.MavenCli.doMain(MavenCli.java:196)
	at org.apache.maven.cli.MavenCli.main(MavenCli.java:141)
	at sun.reflect.NativeMethodAccessorImpl.invoke0(Native Method)
	at sun.reflect.NativeMethodAccessorImpl.invoke(NativeMethodAccessorImpl.java:39)
	at sun.reflect.DelegatingMethodAccessorImpl.invoke(DelegatingMethodAccessorImpl.java:25)
	at java.lang.reflect.Method.invoke(Method.java:597)
	at org.codehaus.plexus.classworlds.launcher.Launcher.launchEnhanced(Launcher.java:290)
	at org.codehaus.plexus.classworlds.launcher.Launcher.launch(Launcher.java:230)
	at org.codehaus.plexus.classworlds.launcher.Launcher.mainWithExitCode(Launcher.java:409)
	at org.codehaus.plexus.classworlds.launcher.Launcher.main(Launcher.java:352)
Caused by: org.apache.maven.plugin.MojoExecutionException: Failure or timeout
	at org.apache.maven.plugin.surefire.SurefirePlugin.assertNoFailureOrTimeout(SurefirePlugin.java:633)
	at org.apache.maven.plugin.surefire.SurefirePlugin.handleSummary(SurefirePlugin.java:614)
	at org.apache.maven.plugin.surefire.AbstractSurefireMojo.executeAfterPreconditionsChecked(AbstractSurefireMojo.java:137)
	at org.apache.maven.plugin.surefire.AbstractSurefireMojo.execute(AbstractSurefireMojo.java:98)
	at org.apache.maven.plugin.DefaultBuildPluginManager.executeMojo(DefaultBuildPluginManager.java:101)
	at org.apache.maven.lifecycle.internal.MojoExecutor.execute(MojoExecutor.java:209)
	... 19 more
[ERROR] 
[ERROR] 
[ERROR] For more information about the errors and possible solutions, please read the following articles:
[ERROR] [Help 1] http://cwiki.apache.org/confluence/display/MAVEN/MojoExecutionException
Build step 'Invoke top-level Maven targets' marked build as failure
Archiving artifacts
Updating HBASE-5257
Updating HBASE-5256
Updating HBASE-6951
Updating HBASE-7072
Updating HBASE-7087
Recording test results

Mime
View raw message