hbase-dev mailing list archives

Site index · List index
Message view « Date » · « Thread »
Top « Date » · « Thread »
From Apache Jenkins Server <jenk...@builds.apache.org>
Subject Build failed in Jenkins: HBase-0.94-security-on-Hadoop-23 #9
Date Mon, 05 Nov 2012 01:35:56 GMT
See <https://builds.apache.org/job/HBase-0.94-security-on-Hadoop-23/9/changes>

Changes:

[larsh] HBASE-7095 Cannot set 'lenAsVal' for KeyOnlyFilter from shell (Aditya Kishore)

[larsh] HBASE-6389 Modify the conditions to ensure that Master waits for sufficient number
of Region Servers before starting region assignments (Aditya Kishore)

[larsh] HBASE-6305 TestLocalHBaseCluster hangs with hadoop 2.0/0.23 builds. (Himanshu)

[larsh] HBASE-6796 ADDENDUM, remove spurious time limit from testHFileCleaning

[tedyu] HBASE-7086 Enhance ResourceChecker to log stack trace for potentially hanging threads,
addendum

[larsh] HBASE-6852 RE-REAPPLY, Cheng worked tirelessly to fix the issues.

[tedyu] HBASE-7086 Enhance ResourceChecker to log stack trace for potentially hanging threads

[stack] HBASE-7087 Add to NOTICE.txt a note on jamon being MPL

[larsh] HBASE-6925 Change socket write size from 8K to 64K for HBaseServer (Karthik)

[larsh] HBASE-7017 Backport '[replication] The replication-executor should make sure the file
that it is replicating is closed before declaring success on that file' to 0.94 (Devaraj Das)

[larsh] HBASE-6796 Backport HBASE-5547, Don't delete HFiles in backup mode. (Jesse Yates)

[larsh] HBASE-6852, REVERT again, due to unexplained test failures that only occur on the
jenkins machines

[larsh] HBASE-7077 ADDENDUM, add TestCategory

[larsh] HBASE-6852 SchemaMetrics.updateOnCacheHit costs too much while full scanning a table
with all of its fields (Cheng Hao and LarsH) - REAPPLY

[gchanan] HBASE-6904 In the HBase shell, an error is thrown that states replication-related
znodes already exist

[larsh] HBASE-7077 Test for: CheckAndPut should properly read MVCC (Ram)

[larsh] HBASE-7051 CheckAndPut should properly read MVCC

[eclark] HBASE-7073 OperationMetrics needs to cache the value of hbase.metrics.exposeOperationTimes

[larsh] HBASE-7069

[tedyu] HBASE-7060 Region load balancing by table does not handle the case where a table's
region count is lower than the number of the RS in the cluster (Ted Yu and Tianying)

[tedyu] HBASE-7038 Port HBASE-5970 Improve the AssignmentManager#updateTimer and speed up
handling opened event to 0.94 (Sergey Shelukhin)

[jdcryans] HBASE-6700  [replication] empty znodes created during queue failovers aren't
            deleted (Terry Zhang via JD)

[larsh] HBASE-6846 BitComparator bug - ArrayIndexOutOfBoundsException (Lucian George Iordache)

[larsh] HBASE-6852 REVERT due to test failures.

[larsh] HBASE-6852 SchemaMetrics.updateOnCacheHit costs too much while full scanning a table
with all of its fields (Cheng Hao and LarsH)

[larsh] HBASE-7053 port blockcache configurability (part of HBASE-6312, and HBASE-7033) to
0.94 (Sergey Shelukhin)

[larsh] HBASE-7040 Port HBASE-5867 Improve Compaction Throttle Default to 0.94 (Sergey Shelukhin)

[tedyu] HBASE-5257 Allow INCLUDE_AND_NEXT_COL in filters and use it in ColumnPaginationFilter
(Varun)

[tedyu] HBASE-7048 Regionsplitter requires the hadoop config path to be in hbase classpath
(Ming Ma)

[stack] HBASE-7037 ReplicationPeer logs at WARN level aborting server instead of at FATAL

[larsh] HBASE-6843 loading lzo error when using coprocessor (Andy)

[gchanan] HBASE-7018 Fix and Improve TableDescriptor caching for bulk assignment

[tedyu] HBASE-6728 prevent OOM possibility due to per connection responseQueue being unbounded

[tedyu] HBASE-6942 Endpoint implementation for bulk delete rows (Anoop)

[enis] HBASE-6733 TestReplication.queueFailover occasionally fails [Part-2]

[enis] HBASE-7016 port HBASE-6518 'Bytes.toBytesBinary() incorrect trailing backslash escape'
to 0.94

[tedyu] HBASE-5314 Gracefully rolling restart region servers in rolling-restart.sh (Yifeng)

[apurtell] HBASE-6583. Enhance LoadTestTool to automatically create column families if not
present (Sergey Shelukhin)

[eclark] HBASE-6951 Allow the master info server to be started in a read only mode.

[larsh] HBASE-7021 Default to Hadoop 1.0.4 in 0.94 and add Hadoop 1.1 profile

[larsh] HBASE-7020 Backport HBASE-6336 Split point should not be equal to start row or end
row (Sergey Shelukhin)

[apurtell] Update affiliation

[larsh] HBASE-6974 Metric for blocked updates (Michael Drzal)

[larsh] HBASE-6032 Addendum, forgot to add two files

[larsh] HBASE-6032 Port HFileBlockIndex improvement from HBASE-5987 (Liyin, Ted, Stack)

[larsh] HBASE-6996 HRegion.mutateRowsWithLocks should call checkResources/checkReadOnl

[stack] Move the version on past 0.94.2 not its released to 0.94.3-SNAPSHOT

[stack] HBASE-6978 Minor typo in ReplicationSource SocketTimeoutException error handling

[ramkrishna] HBASE-6853 IllegalArgument Exception is thrown when an empty region is spliitted(Ram)
: Addendum for testcase failure

[larsh] New CHANGES.txt for 0.94.2RC3 - add jira that committed but not tagged as such

[larsh] HBASE-6920 Addendum2. Remove test code which does not work for the Secure build

[larsh] HBASE-6920 Addendum - fix SecureRpcEngine

[larsh] New CHANGES.txt for 0.94.2RC3

[gchanan] HBASE-6920 On timeout connecting to master, client can get stuck and never make
progress

[jdcryans] HBASE-5582  "No HServerInfo found for" should be a WARNING message (Kevin Odell
via JD)

[larsh] HBASE-6889 Ignore source control files with apache-rat (Jesse Yates)

[larsh] HBASE-6900 RegionScanner.reseek() creates NPE when a flush or compaction happens before
the reseek.

------------------------------------------
[...truncated 12388 lines...]
Running org.apache.hadoop.hbase.coprocessor.TestRegionObserverInterface
Tests run: 7, Failures: 0, Errors: 0, Skipped: 0, Time elapsed: 30.86 sec
Forking command line: /bin/sh -c cd <https://builds.apache.org/job/HBase-0.94-security-on-Hadoop-23/ws/trunk>
&& /home/jenkins/tools/java/jdk1.6.0_27-32/jre/bin/java -enableassertions -Xmx1900m
-Djava.security.egd=file:/dev/./urandom -jar <https://builds.apache.org/job/HBase-0.94-security-on-Hadoop-23/ws/trunk/target/surefire/surefirebooter8691384815370739229.jar>
<https://builds.apache.org/job/HBase-0.94-security-on-Hadoop-23/ws/trunk/target/surefire/surefire1223812961750625790tmp>
<https://builds.apache.org/job/HBase-0.94-security-on-Hadoop-23/ws/trunk/target/surefire/surefire_877668374385200839980tmp>
Running org.apache.hadoop.hbase.coprocessor.TestMasterCoprocessorExceptionWithRemove
Tests run: 1, Failures: 0, Errors: 0, Skipped: 0, Time elapsed: 14.161 sec
Forking command line: /bin/sh -c cd <https://builds.apache.org/job/HBase-0.94-security-on-Hadoop-23/ws/trunk>
&& /home/jenkins/tools/java/jdk1.6.0_27-32/jre/bin/java -enableassertions -Xmx1900m
-Djava.security.egd=file:/dev/./urandom -jar <https://builds.apache.org/job/HBase-0.94-security-on-Hadoop-23/ws/trunk/target/surefire/surefirebooter141755770712987420.jar>
<https://builds.apache.org/job/HBase-0.94-security-on-Hadoop-23/ws/trunk/target/surefire/surefire3060354574994731695tmp>
<https://builds.apache.org/job/HBase-0.94-security-on-Hadoop-23/ws/trunk/target/surefire/surefire_882095595937631731405tmp>
Running org.apache.hadoop.hbase.coprocessor.TestRegionServerCoprocessorExceptionWithRemove
Tests run: 1, Failures: 0, Errors: 0, Skipped: 0, Time elapsed: 16.771 sec
Forking command line: /bin/sh -c cd <https://builds.apache.org/job/HBase-0.94-security-on-Hadoop-23/ws/trunk>
&& /home/jenkins/tools/java/jdk1.6.0_27-32/jre/bin/java -enableassertions -Xmx1900m
-Djava.security.egd=file:/dev/./urandom -jar <https://builds.apache.org/job/HBase-0.94-security-on-Hadoop-23/ws/trunk/target/surefire/surefirebooter284266936374691858.jar>
<https://builds.apache.org/job/HBase-0.94-security-on-Hadoop-23/ws/trunk/target/surefire/surefire2639196846238034102tmp>
<https://builds.apache.org/job/HBase-0.94-security-on-Hadoop-23/ws/trunk/target/surefire/surefire_892693109574299782278tmp>
Running org.apache.hadoop.hbase.coprocessor.TestWALObserver
Tests run: 3, Failures: 0, Errors: 0, Skipped: 0, Time elapsed: 12.767 sec
Forking command line: /bin/sh -c cd <https://builds.apache.org/job/HBase-0.94-security-on-Hadoop-23/ws/trunk>
&& /home/jenkins/tools/java/jdk1.6.0_27-32/jre/bin/java -enableassertions -Xmx1900m
-Djava.security.egd=file:/dev/./urandom -jar <https://builds.apache.org/job/HBase-0.94-security-on-Hadoop-23/ws/trunk/target/surefire/surefirebooter4977280851448384073.jar>
<https://builds.apache.org/job/HBase-0.94-security-on-Hadoop-23/ws/trunk/target/surefire/surefire1933501365774971194tmp>
<https://builds.apache.org/job/HBase-0.94-security-on-Hadoop-23/ws/trunk/target/surefire/surefire_903515893901112875152tmp>
Running org.apache.hadoop.hbase.coprocessor.TestMasterCoprocessorExceptionWithAbort
Tests run: 1, Failures: 0, Errors: 0, Skipped: 0, Time elapsed: 24.023 sec
Forking command line: /bin/sh -c cd <https://builds.apache.org/job/HBase-0.94-security-on-Hadoop-23/ws/trunk>
&& /home/jenkins/tools/java/jdk1.6.0_27-32/jre/bin/java -enableassertions -Xmx1900m
-Djava.security.egd=file:/dev/./urandom -jar <https://builds.apache.org/job/HBase-0.94-security-on-Hadoop-23/ws/trunk/target/surefire/surefirebooter8269029976647504852.jar>
<https://builds.apache.org/job/HBase-0.94-security-on-Hadoop-23/ws/trunk/target/surefire/surefire8192737052261735325tmp>
<https://builds.apache.org/job/HBase-0.94-security-on-Hadoop-23/ws/trunk/target/surefire/surefire_915058978450342850387tmp>
Running org.apache.hadoop.hbase.coprocessor.example.TestZooKeeperScanPolicyObserver
Tests run: 1, Failures: 0, Errors: 0, Skipped: 0, Time elapsed: 14.196 sec
Forking command line: /bin/sh -c cd <https://builds.apache.org/job/HBase-0.94-security-on-Hadoop-23/ws/trunk>
&& /home/jenkins/tools/java/jdk1.6.0_27-32/jre/bin/java -enableassertions -Xmx1900m
-Djava.security.egd=file:/dev/./urandom -jar <https://builds.apache.org/job/HBase-0.94-security-on-Hadoop-23/ws/trunk/target/surefire/surefirebooter2276784492265639930.jar>
<https://builds.apache.org/job/HBase-0.94-security-on-Hadoop-23/ws/trunk/target/surefire/surefire3043451202826538359tmp>
<https://builds.apache.org/job/HBase-0.94-security-on-Hadoop-23/ws/trunk/target/surefire/surefire_926980498424637893800tmp>
Running org.apache.hadoop.hbase.coprocessor.example.TestBulkDeleteProtocol
Tests run: 8, Failures: 0, Errors: 0, Skipped: 0, Time elapsed: 33.511 sec
Forking command line: /bin/sh -c cd <https://builds.apache.org/job/HBase-0.94-security-on-Hadoop-23/ws/trunk>
&& /home/jenkins/tools/java/jdk1.6.0_27-32/jre/bin/java -enableassertions -Xmx1900m
-Djava.security.egd=file:/dev/./urandom -jar <https://builds.apache.org/job/HBase-0.94-security-on-Hadoop-23/ws/trunk/target/surefire/surefirebooter3927874464149706593.jar>
<https://builds.apache.org/job/HBase-0.94-security-on-Hadoop-23/ws/trunk/target/surefire/surefire4111152940303680815tmp>
<https://builds.apache.org/job/HBase-0.94-security-on-Hadoop-23/ws/trunk/target/surefire/surefire_934243885361975924280tmp>
Running org.apache.hadoop.hbase.coprocessor.TestRegionServerCoprocessorExceptionWithAbort
Tests run: 1, Failures: 0, Errors: 0, Skipped: 0, Time elapsed: 14.969 sec
Forking command line: /bin/sh -c cd <https://builds.apache.org/job/HBase-0.94-security-on-Hadoop-23/ws/trunk>
&& /home/jenkins/tools/java/jdk1.6.0_27-32/jre/bin/java -enableassertions -Xmx1900m
-Djava.security.egd=file:/dev/./urandom -jar <https://builds.apache.org/job/HBase-0.94-security-on-Hadoop-23/ws/trunk/target/surefire/surefirebooter7377762725548785283.jar>
<https://builds.apache.org/job/HBase-0.94-security-on-Hadoop-23/ws/trunk/target/surefire/surefire2205142004765546404tmp>
<https://builds.apache.org/job/HBase-0.94-security-on-Hadoop-23/ws/trunk/target/surefire/surefire_9418653693836499250tmp>
Running org.apache.hadoop.hbase.coprocessor.TestRegionObserverBypass
Tests run: 2, Failures: 0, Errors: 0, Skipped: 0, Time elapsed: 11.596 sec
Forking command line: /bin/sh -c cd <https://builds.apache.org/job/HBase-0.94-security-on-Hadoop-23/ws/trunk>
&& /home/jenkins/tools/java/jdk1.6.0_27-32/jre/bin/java -enableassertions -Xmx1900m
-Djava.security.egd=file:/dev/./urandom -jar <https://builds.apache.org/job/HBase-0.94-security-on-Hadoop-23/ws/trunk/target/surefire/surefirebooter1513499103308606001.jar>
<https://builds.apache.org/job/HBase-0.94-security-on-Hadoop-23/ws/trunk/target/surefire/surefire3510939216341016366tmp>
<https://builds.apache.org/job/HBase-0.94-security-on-Hadoop-23/ws/trunk/target/surefire/surefire_952540206090330448450tmp>
Running org.apache.hadoop.hbase.thrift2.TestThriftHBaseServiceHandler
Tests run: 12, Failures: 0, Errors: 0, Skipped: 0, Time elapsed: 11.299 sec
Forking command line: /bin/sh -c cd <https://builds.apache.org/job/HBase-0.94-security-on-Hadoop-23/ws/trunk>
&& /home/jenkins/tools/java/jdk1.6.0_27-32/jre/bin/java -enableassertions -Xmx1900m
-Djava.security.egd=file:/dev/./urandom -jar <https://builds.apache.org/job/HBase-0.94-security-on-Hadoop-23/ws/trunk/target/surefire/surefirebooter1876610220486537814.jar>
<https://builds.apache.org/job/HBase-0.94-security-on-Hadoop-23/ws/trunk/target/surefire/surefire2957749005138509292tmp>
<https://builds.apache.org/job/HBase-0.94-security-on-Hadoop-23/ws/trunk/target/surefire/surefire_964711315112857230394tmp>
Running org.apache.hadoop.hbase.avro.TestAvroServer
Tests run: 3, Failures: 0, Errors: 0, Skipped: 0, Time elapsed: 23.039 sec
Forking command line: /bin/sh -c cd <https://builds.apache.org/job/HBase-0.94-security-on-Hadoop-23/ws/trunk>
&& /home/jenkins/tools/java/jdk1.6.0_27-32/jre/bin/java -enableassertions -Xmx1900m
-Djava.security.egd=file:/dev/./urandom -jar <https://builds.apache.org/job/HBase-0.94-security-on-Hadoop-23/ws/trunk/target/surefire/surefirebooter2937383375142546788.jar>
<https://builds.apache.org/job/HBase-0.94-security-on-Hadoop-23/ws/trunk/target/surefire/surefire2585916255750904611tmp>
<https://builds.apache.org/job/HBase-0.94-security-on-Hadoop-23/ws/trunk/target/surefire/surefire_972377611520893065237tmp>
Running org.apache.hadoop.hbase.monitoring.TestTaskMonitor
Tests run: 3, Failures: 0, Errors: 0, Skipped: 0, Time elapsed: 0.304 sec
Forking command line: /bin/sh -c cd <https://builds.apache.org/job/HBase-0.94-security-on-Hadoop-23/ws/trunk>
&& /home/jenkins/tools/java/jdk1.6.0_27-32/jre/bin/java -enableassertions -Xmx1900m
-Djava.security.egd=file:/dev/./urandom -jar <https://builds.apache.org/job/HBase-0.94-security-on-Hadoop-23/ws/trunk/target/surefire/surefirebooter8397882055529615364.jar>
<https://builds.apache.org/job/HBase-0.94-security-on-Hadoop-23/ws/trunk/target/surefire/surefire608821670123035364tmp>
<https://builds.apache.org/job/HBase-0.94-security-on-Hadoop-23/ws/trunk/target/surefire/surefire_988356474243129349912tmp>
Running org.apache.hadoop.hbase.monitoring.TestMemoryBoundedLogMessageBuffer
Tests run: 2, Failures: 0, Errors: 0, Skipped: 0, Time elapsed: 0.244 sec
Forking command line: /bin/sh -c cd <https://builds.apache.org/job/HBase-0.94-security-on-Hadoop-23/ws/trunk>
&& /home/jenkins/tools/java/jdk1.6.0_27-32/jre/bin/java -enableassertions -Xmx1900m
-Djava.security.egd=file:/dev/./urandom -jar <https://builds.apache.org/job/HBase-0.94-security-on-Hadoop-23/ws/trunk/target/surefire/surefirebooter7919446582161325722.jar>
<https://builds.apache.org/job/HBase-0.94-security-on-Hadoop-23/ws/trunk/target/surefire/surefire656158997095360214tmp>
<https://builds.apache.org/job/HBase-0.94-security-on-Hadoop-23/ws/trunk/target/surefire/surefire_99574110049670856175tmp>
Running org.apache.hadoop.hbase.thrift.TestThriftServer
Tests run: 1, Failures: 0, Errors: 0, Skipped: 0, Time elapsed: 37.992 sec
Forking command line: /bin/sh -c cd <https://builds.apache.org/job/HBase-0.94-security-on-Hadoop-23/ws/trunk>
&& /home/jenkins/tools/java/jdk1.6.0_27-32/jre/bin/java -enableassertions -Xmx1900m
-Djava.security.egd=file:/dev/./urandom -jar <https://builds.apache.org/job/HBase-0.94-security-on-Hadoop-23/ws/trunk/target/surefire/surefirebooter2678285792004666602.jar>
<https://builds.apache.org/job/HBase-0.94-security-on-Hadoop-23/ws/trunk/target/surefire/surefire5112391179808336493tmp>
<https://builds.apache.org/job/HBase-0.94-security-on-Hadoop-23/ws/trunk/target/surefire/surefire_1003107220689171586642tmp>
Running org.apache.hadoop.hbase.regionserver.TestHRegionOnCluster
Tests run: 1, Failures: 0, Errors: 0, Skipped: 0, Time elapsed: 21.287 sec
Forking command line: /bin/sh -c cd <https://builds.apache.org/job/HBase-0.94-security-on-Hadoop-23/ws/trunk>
&& /home/jenkins/tools/java/jdk1.6.0_27-32/jre/bin/java -enableassertions -Xmx1900m
-Djava.security.egd=file:/dev/./urandom -jar <https://builds.apache.org/job/HBase-0.94-security-on-Hadoop-23/ws/trunk/target/surefire/surefirebooter3526127455597823316.jar>
<https://builds.apache.org/job/HBase-0.94-security-on-Hadoop-23/ws/trunk/target/surefire/surefire7958066279501144325tmp>
<https://builds.apache.org/job/HBase-0.94-security-on-Hadoop-23/ws/trunk/target/surefire/surefire_1016780987238009178468tmp>
Running org.apache.hadoop.hbase.regionserver.TestMasterAddressManager
Tests run: 1, Failures: 0, Errors: 0, Skipped: 0, Time elapsed: 0.946 sec
Forking command line: /bin/sh -c cd <https://builds.apache.org/job/HBase-0.94-security-on-Hadoop-23/ws/trunk>
&& /home/jenkins/tools/java/jdk1.6.0_27-32/jre/bin/java -enableassertions -Xmx1900m
-Djava.security.egd=file:/dev/./urandom -jar <https://builds.apache.org/job/HBase-0.94-security-on-Hadoop-23/ws/trunk/target/surefire/surefirebooter6504369889849515028.jar>
<https://builds.apache.org/job/HBase-0.94-security-on-Hadoop-23/ws/trunk/target/surefire/surefire3556846704724960091tmp>
<https://builds.apache.org/job/HBase-0.94-security-on-Hadoop-23/ws/trunk/target/surefire/surefire_1028512748559099107907tmp>
Running org.apache.hadoop.hbase.regionserver.TestHRegion
Tests run: 69, Failures: 0, Errors: 0, Skipped: 0, Time elapsed: 38.663 sec
Forking command line: /bin/sh -c cd <https://builds.apache.org/job/HBase-0.94-security-on-Hadoop-23/ws/trunk>
&& /home/jenkins/tools/java/jdk1.6.0_27-32/jre/bin/java -enableassertions -Xmx1900m
-Djava.security.egd=file:/dev/./urandom -jar <https://builds.apache.org/job/HBase-0.94-security-on-Hadoop-23/ws/trunk/target/surefire/surefirebooter725594798482509550.jar>
<https://builds.apache.org/job/HBase-0.94-security-on-Hadoop-23/ws/trunk/target/surefire/surefire7681940036445795864tmp>
<https://builds.apache.org/job/HBase-0.94-security-on-Hadoop-23/ws/trunk/target/surefire/surefire_1035341997616826893421tmp>
Running org.apache.hadoop.hbase.regionserver.TestRegionServerMetrics
Tests run: 4, Failures: 0, Errors: 0, Skipped: 0, Time elapsed: 49.093 sec
Forking command line: /bin/sh -c cd <https://builds.apache.org/job/HBase-0.94-security-on-Hadoop-23/ws/trunk>
&& /home/jenkins/tools/java/jdk1.6.0_27-32/jre/bin/java -enableassertions -Xmx1900m
-Djava.security.egd=file:/dev/./urandom -jar <https://builds.apache.org/job/HBase-0.94-security-on-Hadoop-23/ws/trunk/target/surefire/surefirebooter8516192155556530529.jar>
<https://builds.apache.org/job/HBase-0.94-security-on-Hadoop-23/ws/trunk/target/surefire/surefire5604068460832421468tmp>
<https://builds.apache.org/job/HBase-0.94-security-on-Hadoop-23/ws/trunk/target/surefire/surefire_1044609280025364513577tmp>
Running org.apache.hadoop.hbase.regionserver.TestSplitLogWorker
Tests run: 5, Failures: 0, Errors: 0, Skipped: 0, Time elapsed: 2.887 sec
Forking command line: /bin/sh -c cd <https://builds.apache.org/job/HBase-0.94-security-on-Hadoop-23/ws/trunk>
&& /home/jenkins/tools/java/jdk1.6.0_27-32/jre/bin/java -enableassertions -Xmx1900m
-Djava.security.egd=file:/dev/./urandom -jar <https://builds.apache.org/job/HBase-0.94-security-on-Hadoop-23/ws/trunk/target/surefire/surefirebooter6028187991390100600.jar>
<https://builds.apache.org/job/HBase-0.94-security-on-Hadoop-23/ws/trunk/target/surefire/surefire6883126216767631813tmp>
<https://builds.apache.org/job/HBase-0.94-security-on-Hadoop-23/ws/trunk/target/surefire/surefire_105297295486084785320tmp>
Running org.apache.hadoop.hbase.regionserver.TestServerCustomProtocol
Tests run: 7, Failures: 0, Errors: 0, Skipped: 0, Time elapsed: 12.615 sec
Forking command line: /bin/sh -c cd <https://builds.apache.org/job/HBase-0.94-security-on-Hadoop-23/ws/trunk>
&& /home/jenkins/tools/java/jdk1.6.0_27-32/jre/bin/java -enableassertions -Xmx1900m
-Djava.security.egd=file:/dev/./urandom -jar <https://builds.apache.org/job/HBase-0.94-security-on-Hadoop-23/ws/trunk/target/surefire/surefirebooter6837840134460184009.jar>
<https://builds.apache.org/job/HBase-0.94-security-on-Hadoop-23/ws/trunk/target/surefire/surefire8476038095517392694tmp>
<https://builds.apache.org/job/HBase-0.94-security-on-Hadoop-23/ws/trunk/target/surefire/surefire_1067920158302639943710tmp>
Running org.apache.hadoop.hbase.regionserver.TestCompactionWithCoprocessor
Tests run: 15, Failures: 0, Errors: 0, Skipped: 0, Time elapsed: 35.943 sec
Forking command line: /bin/sh -c cd <https://builds.apache.org/job/HBase-0.94-security-on-Hadoop-23/ws/trunk>
&& /home/jenkins/tools/java/jdk1.6.0_27-32/jre/bin/java -enableassertions -Xmx1900m
-Djava.security.egd=file:/dev/./urandom -jar <https://builds.apache.org/job/HBase-0.94-security-on-Hadoop-23/ws/trunk/target/surefire/surefirebooter8994049026236940021.jar>
<https://builds.apache.org/job/HBase-0.94-security-on-Hadoop-23/ws/trunk/target/surefire/surefire2177867994864533784tmp>
<https://builds.apache.org/job/HBase-0.94-security-on-Hadoop-23/ws/trunk/target/surefire/surefire_1077831451865356106035tmp>
Running org.apache.hadoop.hbase.regionserver.TestStoreFileBlockCacheSummary
Tests run: 1, Failures: 0, Errors: 0, Skipped: 0, Time elapsed: 12.86 sec
Forking command line: /bin/sh -c cd <https://builds.apache.org/job/HBase-0.94-security-on-Hadoop-23/ws/trunk>
&& /home/jenkins/tools/java/jdk1.6.0_27-32/jre/bin/java -enableassertions -Xmx1900m
-Djava.security.egd=file:/dev/./urandom -jar <https://builds.apache.org/job/HBase-0.94-security-on-Hadoop-23/ws/trunk/target/surefire/surefirebooter176467810698224451.jar>
<https://builds.apache.org/job/HBase-0.94-security-on-Hadoop-23/ws/trunk/target/surefire/surefire8955935187811114000tmp>
<https://builds.apache.org/job/HBase-0.94-security-on-Hadoop-23/ws/trunk/target/surefire/surefire_1084298451728539358114tmp>
Running org.apache.hadoop.hbase.regionserver.TestStore
Tests run: 12, Failures: 0, Errors: 0, Skipped: 0, Time elapsed: 9.816 sec
Forking command line: /bin/sh -c cd <https://builds.apache.org/job/HBase-0.94-security-on-Hadoop-23/ws/trunk>
&& /home/jenkins/tools/java/jdk1.6.0_27-32/jre/bin/java -enableassertions -Xmx1900m
-Djava.security.egd=file:/dev/./urandom -jar <https://builds.apache.org/job/HBase-0.94-security-on-Hadoop-23/ws/trunk/target/surefire/surefirebooter5570546105121702372.jar>
<https://builds.apache.org/job/HBase-0.94-security-on-Hadoop-23/ws/trunk/target/surefire/surefire6508974914852455064tmp>
<https://builds.apache.org/job/HBase-0.94-security-on-Hadoop-23/ws/trunk/target/surefire/surefire_109590099996388848461tmp>
Running org.apache.hadoop.hbase.regionserver.TestBlocksRead
Tests run: 4, Failures: 0, Errors: 0, Skipped: 0, Time elapsed: 2.563 sec
Forking command line: /bin/sh -c cd <https://builds.apache.org/job/HBase-0.94-security-on-Hadoop-23/ws/trunk>
&& /home/jenkins/tools/java/jdk1.6.0_27-32/jre/bin/java -enableassertions -Xmx1900m
-Djava.security.egd=file:/dev/./urandom -jar <https://builds.apache.org/job/HBase-0.94-security-on-Hadoop-23/ws/trunk/target/surefire/surefirebooter8764522893835148166.jar>
<https://builds.apache.org/job/HBase-0.94-security-on-Hadoop-23/ws/trunk/target/surefire/surefire4945177943023397575tmp>
<https://builds.apache.org/job/HBase-0.94-security-on-Hadoop-23/ws/trunk/target/surefire/surefire_1106760521410674358197tmp>
Running org.apache.hadoop.hbase.regionserver.TestAtomicOperation
Tests run: 5, Failures: 0, Errors: 0, Skipped: 0, Time elapsed: 19.001 sec
Forking command line: /bin/sh -c cd <https://builds.apache.org/job/HBase-0.94-security-on-Hadoop-23/ws/trunk>
&& /home/jenkins/tools/java/jdk1.6.0_27-32/jre/bin/java -enableassertions -Xmx1900m
-Djava.security.egd=file:/dev/./urandom -jar <https://builds.apache.org/job/HBase-0.94-security-on-Hadoop-23/ws/trunk/target/surefire/surefirebooter2291985218543500810.jar>
<https://builds.apache.org/job/HBase-0.94-security-on-Hadoop-23/ws/trunk/target/surefire/surefire5187929586535773341tmp>
<https://builds.apache.org/job/HBase-0.94-security-on-Hadoop-23/ws/trunk/target/surefire/surefire_1111031776717209524704tmp>
Running org.apache.hadoop.hbase.regionserver.TestSeekOptimizations
Tests run: 6, Failures: 0, Errors: 0, Skipped: 0, Time elapsed: 3.393 sec
Forking command line: /bin/sh -c cd <https://builds.apache.org/job/HBase-0.94-security-on-Hadoop-23/ws/trunk>
&& /home/jenkins/tools/java/jdk1.6.0_27-32/jre/bin/java -enableassertions -Xmx1900m
-Djava.security.egd=file:/dev/./urandom -jar <https://builds.apache.org/job/HBase-0.94-security-on-Hadoop-23/ws/trunk/target/surefire/surefirebooter272886757012029830.jar>
<https://builds.apache.org/job/HBase-0.94-security-on-Hadoop-23/ws/trunk/target/surefire/surefire6191357226936686435tmp>
<https://builds.apache.org/job/HBase-0.94-security-on-Hadoop-23/ws/trunk/target/surefire/surefire_112809582779507550023tmp>
Running org.apache.hadoop.hbase.regionserver.metrics.TestSchemaMetrics
Running org.apache.hadoop.hbase.regionserver.TestFSErrorsExposed
Tests run: 3, Failures: 0, Errors: 0, Skipped: 0, Time elapsed: 33.524 sec
Forking command line: /bin/sh -c cd <https://builds.apache.org/job/HBase-0.94-security-on-Hadoop-23/ws/trunk>
&& /home/jenkins/tools/java/jdk1.6.0_27-32/jre/bin/java -enableassertions -Xmx1900m
-Djava.security.egd=file:/dev/./urandom -jar <https://builds.apache.org/job/HBase-0.94-security-on-Hadoop-23/ws/trunk/target/surefire/surefirebooter5360605164013596585.jar>
<https://builds.apache.org/job/HBase-0.94-security-on-Hadoop-23/ws/trunk/target/surefire/surefire6634906325922630453tmp>
<https://builds.apache.org/job/HBase-0.94-security-on-Hadoop-23/ws/trunk/target/surefire/surefire_1137919375116240008266tmp>
Tests run: 6, Failures: 0, Errors: 0, Skipped: 0, Time elapsed: 14.724 sec
Forking command line: /bin/sh -c cd <https://builds.apache.org/job/HBase-0.94-security-on-Hadoop-23/ws/trunk>
&& /home/jenkins/tools/java/jdk1.6.0_27-32/jre/bin/java -enableassertions -Xmx1900m
-Djava.security.egd=file:/dev/./urandom -jar <https://builds.apache.org/job/HBase-0.94-security-on-Hadoop-23/ws/trunk/target/surefire/surefirebooter6657831494296862688.jar>
<https://builds.apache.org/job/HBase-0.94-security-on-Hadoop-23/ws/trunk/target/surefire/surefire6999875467988579283tmp>
<https://builds.apache.org/job/HBase-0.94-security-on-Hadoop-23/ws/trunk/target/surefire/surefire_1145697818557385084539tmp>
Running org.apache.hadoop.hbase.regionserver.handler.TestCloseRegionHandler
Tests run: 3, Failures: 0, Errors: 0, Skipped: 0, Time elapsed: 1.853 sec
Running org.apache.hadoop.hbase.regionserver.handler.TestOpenRegionHandler
Tests run: 3, Failures: 0, Errors: 0, Skipped: 0, Time elapsed: 1.519 sec
Forking command line: /bin/sh -c cd <https://builds.apache.org/job/HBase-0.94-security-on-Hadoop-23/ws/trunk>
&& /home/jenkins/tools/java/jdk1.6.0_27-32/jre/bin/java -enableassertions -Xmx1900m
-Djava.security.egd=file:/dev/./urandom -jar <https://builds.apache.org/job/HBase-0.94-security-on-Hadoop-23/ws/trunk/target/surefire/surefirebooter169356656353640227.jar>
<https://builds.apache.org/job/HBase-0.94-security-on-Hadoop-23/ws/trunk/target/surefire/surefire8599241322000172889tmp>
<https://builds.apache.org/job/HBase-0.94-security-on-Hadoop-23/ws/trunk/target/surefire/surefire_1154885717294108941642tmp>
Forking command line: /bin/sh -c cd <https://builds.apache.org/job/HBase-0.94-security-on-Hadoop-23/ws/trunk>
&& /home/jenkins/tools/java/jdk1.6.0_27-32/jre/bin/java -enableassertions -Xmx1900m
-Djava.security.egd=file:/dev/./urandom -jar <https://builds.apache.org/job/HBase-0.94-security-on-Hadoop-23/ws/trunk/target/surefire/surefirebooter8560280516910453253.jar>
<https://builds.apache.org/job/HBase-0.94-security-on-Hadoop-23/ws/trunk/target/surefire/surefire1236338123051909773tmp>
<https://builds.apache.org/job/HBase-0.94-security-on-Hadoop-23/ws/trunk/target/surefire/surefire_1165990641608888465910tmp>
Running org.apache.hadoop.hbase.regionserver.TestCacheOnWriteInSchema
Tests run: 3, Failures: 0, Errors: 0, Skipped: 0, Time elapsed: 2.171 sec
Forking command line: /bin/sh -c cd <https://builds.apache.org/job/HBase-0.94-security-on-Hadoop-23/ws/trunk>
&& /home/jenkins/tools/java/jdk1.6.0_27-32/jre/bin/java -enableassertions -Xmx1900m
-Djava.security.egd=file:/dev/./urandom -jar <https://builds.apache.org/job/HBase-0.94-security-on-Hadoop-23/ws/trunk/target/surefire/surefirebooter4382980094525946781.jar>
<https://builds.apache.org/job/HBase-0.94-security-on-Hadoop-23/ws/trunk/target/surefire/surefire6644721516140611232tmp>
<https://builds.apache.org/job/HBase-0.94-security-on-Hadoop-23/ws/trunk/target/surefire/surefire_1174738040761415922024tmp>
Running org.apache.hadoop.hbase.regionserver.wal.TestHLogBench
Tests run: 1, Failures: 0, Errors: 0, Skipped: 0, Time elapsed: 1.788 sec
Forking command line: /bin/sh -c cd <https://builds.apache.org/job/HBase-0.94-security-on-Hadoop-23/ws/trunk>
&& /home/jenkins/tools/java/jdk1.6.0_27-32/jre/bin/java -enableassertions -Xmx1900m
-Djava.security.egd=file:/dev/./urandom -jar <https://builds.apache.org/job/HBase-0.94-security-on-Hadoop-23/ws/trunk/target/surefire/surefirebooter8907881036194780226.jar>
<https://builds.apache.org/job/HBase-0.94-security-on-Hadoop-23/ws/trunk/target/surefire/surefire827568815272397496tmp>
<https://builds.apache.org/job/HBase-0.94-security-on-Hadoop-23/ws/trunk/target/surefire/surefire_1186019702877150849533tmp>
Running org.apache.hadoop.hbase.regionserver.TestParallelPut
Tests run: 2, Failures: 0, Errors: 0, Skipped: 0, Time elapsed: 5.499 sec
Forking command line: /bin/sh -c cd <https://builds.apache.org/job/HBase-0.94-security-on-Hadoop-23/ws/trunk>
&& /home/jenkins/tools/java/jdk1.6.0_27-32/jre/bin/java -enableassertions -Xmx1900m
-Djava.security.egd=file:/dev/./urandom -jar <https://builds.apache.org/job/HBase-0.94-security-on-Hadoop-23/ws/trunk/target/surefire/surefirebooter3514718110181329589.jar>
<https://builds.apache.org/job/HBase-0.94-security-on-Hadoop-23/ws/trunk/target/surefire/surefire6434383801803569323tmp>
<https://builds.apache.org/job/HBase-0.94-security-on-Hadoop-23/ws/trunk/target/surefire/surefire_1198704601278737785916tmp>
Running org.apache.hadoop.hbase.regionserver.wal.TestLogRollingNoCluster
Tests run: 1, Failures: 0, Errors: 0, Skipped: 0, Time elapsed: 6.805 sec
Forking command line: /bin/sh -c cd <https://builds.apache.org/job/HBase-0.94-security-on-Hadoop-23/ws/trunk>
&& /home/jenkins/tools/java/jdk1.6.0_27-32/jre/bin/java -enableassertions -Xmx1900m
-Djava.security.egd=file:/dev/./urandom -jar <https://builds.apache.org/job/HBase-0.94-security-on-Hadoop-23/ws/trunk/target/surefire/surefirebooter7847926945979436301.jar>
<https://builds.apache.org/job/HBase-0.94-security-on-Hadoop-23/ws/trunk/target/surefire/surefire4549658616234990357tmp>
<https://builds.apache.org/job/HBase-0.94-security-on-Hadoop-23/ws/trunk/target/surefire/surefire_1202884211635186908802tmp>
Running org.apache.hadoop.hbase.regionserver.wal.TestLogRollAbort
Tests run: 1, Failures: 0, Errors: 0, Skipped: 0, Time elapsed: 17.541 sec
Forking command line: /bin/sh -c cd <https://builds.apache.org/job/HBase-0.94-security-on-Hadoop-23/ws/trunk>
&& /home/jenkins/tools/java/jdk1.6.0_27-32/jre/bin/java -enableassertions -Xmx1900m
-Djava.security.egd=file:/dev/./urandom -jar <https://builds.apache.org/job/HBase-0.94-security-on-Hadoop-23/ws/trunk/target/surefire/surefirebooter1115106950725497314.jar>
<https://builds.apache.org/job/HBase-0.94-security-on-Hadoop-23/ws/trunk/target/surefire/surefire6214398892291829739tmp>
<https://builds.apache.org/job/HBase-0.94-security-on-Hadoop-23/ws/trunk/target/surefire/surefire_1213515383598004444421tmp>
Running org.apache.hadoop.hbase.regionserver.wal.TestWALReplay
Tests run: 6, Failures: 0, Errors: 0, Skipped: 0, Time elapsed: 30.693 sec
Forking command line: /bin/sh -c cd <https://builds.apache.org/job/HBase-0.94-security-on-Hadoop-23/ws/trunk>
&& /home/jenkins/tools/java/jdk1.6.0_27-32/jre/bin/java -enableassertions -Xmx1900m
-Djava.security.egd=file:/dev/./urandom -jar <https://builds.apache.org/job/HBase-0.94-security-on-Hadoop-23/ws/trunk/target/surefire/surefirebooter7459995690706959228.jar>
<https://builds.apache.org/job/HBase-0.94-security-on-Hadoop-23/ws/trunk/target/surefire/surefire3028858308283975404tmp>
<https://builds.apache.org/job/HBase-0.94-security-on-Hadoop-23/ws/trunk/target/surefire/surefire_1226667382563882402236tmp>
Running org.apache.hadoop.hbase.regionserver.TestStoreScanner
Tests run: 16, Failures: 0, Errors: 0, Skipped: 0, Time elapsed: 0.052 sec
Forking command line: /bin/sh -c cd <https://builds.apache.org/job/HBase-0.94-security-on-Hadoop-23/ws/trunk>
&& /home/jenkins/tools/java/jdk1.6.0_27-32/jre/bin/java -enableassertions -Xmx1900m
-Djava.security.egd=file:/dev/./urandom -jar <https://builds.apache.org/job/HBase-0.94-security-on-Hadoop-23/ws/trunk/target/surefire/surefirebooter6924582812421371816.jar>
<https://builds.apache.org/job/HBase-0.94-security-on-Hadoop-23/ws/trunk/target/surefire/surefire8532920358255269877tmp>
<https://builds.apache.org/job/HBase-0.94-security-on-Hadoop-23/ws/trunk/target/surefire/surefire_1238184430106673418727tmp>
Running org.apache.hadoop.hbase.regionserver.TestRpcMetrics
Tests run: 1, Failures: 0, Errors: 0, Skipped: 0, Time elapsed: 2.048 sec
Forking command line: /bin/sh -c cd <https://builds.apache.org/job/HBase-0.94-security-on-Hadoop-23/ws/trunk>
&& /home/jenkins/tools/java/jdk1.6.0_27-32/jre/bin/java -enableassertions -Xmx1900m
-Djava.security.egd=file:/dev/./urandom -jar <https://builds.apache.org/job/HBase-0.94-security-on-Hadoop-23/ws/trunk/target/surefire/surefirebooter193951302457873794.jar>
<https://builds.apache.org/job/HBase-0.94-security-on-Hadoop-23/ws/trunk/target/surefire/surefire2832490348461446380tmp>
<https://builds.apache.org/job/HBase-0.94-security-on-Hadoop-23/ws/trunk/target/surefire/surefire_1245528795933666952881tmp>
Running org.apache.hadoop.hbase.regionserver.wal.TestWALReplayCompressed
Tests run: 6, Failures: 0, Errors: 0, Skipped: 0, Time elapsed: 27.964 sec
Forking command line: /bin/sh -c cd <https://builds.apache.org/job/HBase-0.94-security-on-Hadoop-23/ws/trunk>
&& /home/jenkins/tools/java/jdk1.6.0_27-32/jre/bin/java -enableassertions -Xmx1900m
-Djava.security.egd=file:/dev/./urandom -jar <https://builds.apache.org/job/HBase-0.94-security-on-Hadoop-23/ws/trunk/target/surefire/surefirebooter8733886757183721454.jar>
<https://builds.apache.org/job/HBase-0.94-security-on-Hadoop-23/ws/trunk/target/surefire/surefire7156701447760256721tmp>
<https://builds.apache.org/job/HBase-0.94-security-on-Hadoop-23/ws/trunk/target/surefire/surefire_1258036218618918911741tmp>
Running org.apache.hadoop.hbase.TestClusterBootOrder
Tests run: 2, Failures: 0, Errors: 0, Skipped: 0, Time elapsed: 30.281 sec
Forking command line: /bin/sh -c cd <https://builds.apache.org/job/HBase-0.94-security-on-Hadoop-23/ws/trunk>
&& /home/jenkins/tools/java/jdk1.6.0_27-32/jre/bin/java -enableassertions -Xmx1900m
-Djava.security.egd=file:/dev/./urandom -jar <https://builds.apache.org/job/HBase-0.94-security-on-Hadoop-23/ws/trunk/target/surefire/surefirebooter7474673259673533753.jar>
<https://builds.apache.org/job/HBase-0.94-security-on-Hadoop-23/ws/trunk/target/surefire/surefire7798799707098025765tmp>
<https://builds.apache.org/job/HBase-0.94-security-on-Hadoop-23/ws/trunk/target/surefire/surefire_1263605287301684055936tmp>
Running org.apache.hadoop.hbase.regionserver.TestMultiColumnScanner
Tests run: 12, Failures: 0, Errors: 0, Skipped: 0, Time elapsed: 41.402 sec
Forking command line: /bin/sh -c cd <https://builds.apache.org/job/HBase-0.94-security-on-Hadoop-23/ws/trunk>
&& /home/jenkins/tools/java/jdk1.6.0_27-32/jre/bin/java -enableassertions -Xmx1900m
-Djava.security.egd=file:/dev/./urandom -jar <https://builds.apache.org/job/HBase-0.94-security-on-Hadoop-23/ws/trunk/target/surefire/surefirebooter1043920509658427850.jar>
<https://builds.apache.org/job/HBase-0.94-security-on-Hadoop-23/ws/trunk/target/surefire/surefire7599303821236804360tmp>
<https://builds.apache.org/job/HBase-0.94-security-on-Hadoop-23/ws/trunk/target/surefire/surefire_1273660867489409045727tmp>
Running org.apache.hadoop.hbase.TestDrainingServer
Tests run: 2, Failures: 0, Errors: 0, Skipped: 0, Time elapsed: 20.363 sec
Forking command line: /bin/sh -c cd <https://builds.apache.org/job/HBase-0.94-security-on-Hadoop-23/ws/trunk>
&& /home/jenkins/tools/java/jdk1.6.0_27-32/jre/bin/java -enableassertions -Xmx1900m
-Djava.security.egd=file:/dev/./urandom -jar <https://builds.apache.org/job/HBase-0.94-security-on-Hadoop-23/ws/trunk/target/surefire/surefirebooter9036763516990251746.jar>
<https://builds.apache.org/job/HBase-0.94-security-on-Hadoop-23/ws/trunk/target/surefire/surefire4519223800136171890tmp>
<https://builds.apache.org/job/HBase-0.94-security-on-Hadoop-23/ws/trunk/target/surefire/surefire_128850809337429097398tmp>
Running org.apache.hadoop.hbase.mapreduce.TestImportExport
Tests run: 1, Failures: 0, Errors: 1, Skipped: 0, Time elapsed: 99.814 sec <<< FAILURE!
Forking command line: /bin/sh -c cd <https://builds.apache.org/job/HBase-0.94-security-on-Hadoop-23/ws/trunk>
&& /home/jenkins/tools/java/jdk1.6.0_27-32/jre/bin/java -enableassertions -Xmx1900m
-Djava.security.egd=file:/dev/./urandom -jar <https://builds.apache.org/job/HBase-0.94-security-on-Hadoop-23/ws/trunk/target/surefire/surefirebooter527021115818035156.jar>
<https://builds.apache.org/job/HBase-0.94-security-on-Hadoop-23/ws/trunk/target/surefire/surefire197027967517551269tmp>
<https://builds.apache.org/job/HBase-0.94-security-on-Hadoop-23/ws/trunk/target/surefire/surefire_1295645497092513244547tmp>
Running org.apache.hadoop.hbase.mapreduce.TestHLogRecordReader
Tests run: 2, Failures: 0, Errors: 0, Skipped: 0, Time elapsed: 4.302 sec
Running org.apache.hadoop.hbase.mapreduce.TestImportTsv
Tests run: 9, Failures: 0, Errors: 0, Skipped: 0, Time elapsed: 120.872 sec

Results :

Tests in error: 
  org.apache.hadoop.hbase.client.TestMetaMigrationRemovingHTD: Failed put; errcode=1
  org.apache.hadoop.hbase.mapreduce.TestImportExport: Failed to Start org.apache.hadoop.mapred.MiniMRCluster

Tests run: 668, Failures: 0, Errors: 2, Skipped: 2

[INFO] ------------------------------------------------------------------------
[INFO] BUILD FAILURE
[INFO] ------------------------------------------------------------------------
[INFO] Total time: 24:27.918s
[INFO] Finished at: Mon Nov 05 01:35:22 UTC 2012
[INFO] Final Memory: 39M/495M
[INFO] ------------------------------------------------------------------------
[ERROR] Failed to execute goal org.apache.maven.plugins:maven-surefire-plugin:2.12-TRUNK-HBASE-2:test
(secondPartTestsExecution) on project hbase: There are test failures.
[ERROR] 
[ERROR] Please refer to <https://builds.apache.org/job/HBase-0.94-security-on-Hadoop-23/ws/trunk/target/surefire-reports>
for the individual test results.
[ERROR] -> [Help 1]
org.apache.maven.lifecycle.LifecycleExecutionException: Failed to execute goal org.apache.maven.plugins:maven-surefire-plugin:2.12-TRUNK-HBASE-2:test
(secondPartTestsExecution) on project hbase: There are test failures.

Please refer to <https://builds.apache.org/job/HBase-0.94-security-on-Hadoop-23/ws/trunk/target/surefire-reports>
for the individual test results.
	at org.apache.maven.lifecycle.internal.MojoExecutor.execute(MojoExecutor.java:213)
	at org.apache.maven.lifecycle.internal.MojoExecutor.execute(MojoExecutor.java:153)
	at org.apache.maven.lifecycle.internal.MojoExecutor.execute(MojoExecutor.java:145)
	at org.apache.maven.lifecycle.internal.MojoExecutor.executeForkedExecutions(MojoExecutor.java:365)
	at org.apache.maven.lifecycle.internal.MojoExecutor.execute(MojoExecutor.java:199)
	at org.apache.maven.lifecycle.internal.MojoExecutor.execute(MojoExecutor.java:153)
	at org.apache.maven.lifecycle.internal.MojoExecutor.execute(MojoExecutor.java:145)
	at org.apache.maven.lifecycle.internal.LifecycleModuleBuilder.buildProject(LifecycleModuleBuilder.java:84)
	at org.apache.maven.lifecycle.internal.LifecycleModuleBuilder.buildProject(LifecycleModuleBuilder.java:59)
	at org.apache.maven.lifecycle.internal.LifecycleStarter.singleThreadedBuild(LifecycleStarter.java:183)
	at org.apache.maven.lifecycle.internal.LifecycleStarter.execute(LifecycleStarter.java:161)
	at org.apache.maven.DefaultMaven.doExecute(DefaultMaven.java:319)
	at org.apache.maven.DefaultMaven.execute(DefaultMaven.java:156)
	at org.apache.maven.cli.MavenCli.execute(MavenCli.java:537)
	at org.apache.maven.cli.MavenCli.doMain(MavenCli.java:196)
	at org.apache.maven.cli.MavenCli.main(MavenCli.java:141)
	at sun.reflect.NativeMethodAccessorImpl.invoke0(Native Method)
	at sun.reflect.NativeMethodAccessorImpl.invoke(NativeMethodAccessorImpl.java:39)
	at sun.reflect.DelegatingMethodAccessorImpl.invoke(DelegatingMethodAccessorImpl.java:25)
	at java.lang.reflect.Method.invoke(Method.java:597)
	at org.codehaus.plexus.classworlds.launcher.Launcher.launchEnhanced(Launcher.java:290)
	at org.codehaus.plexus.classworlds.launcher.Launcher.launch(Launcher.java:230)
	at org.codehaus.plexus.classworlds.launcher.Launcher.mainWithExitCode(Launcher.java:409)
	at org.codehaus.plexus.classworlds.launcher.Launcher.main(Launcher.java:352)
Caused by: org.apache.maven.plugin.MojoFailureException: There are test failures.

Please refer to <https://builds.apache.org/job/HBase-0.94-security-on-Hadoop-23/ws/trunk/target/surefire-reports>
for the individual test results.
	at org.apache.maven.plugin.surefire.SurefireHelper.reportExecution(SurefireHelper.java:87)
	at org.apache.maven.plugin.surefire.SurefirePlugin.writeSummary(SurefirePlugin.java:651)
	at org.apache.maven.plugin.surefire.SurefirePlugin.handleSummary(SurefirePlugin.java:625)
	at org.apache.maven.plugin.surefire.AbstractSurefireMojo.executeAfterPreconditionsChecked(AbstractSurefireMojo.java:137)
	at org.apache.maven.plugin.surefire.AbstractSurefireMojo.execute(AbstractSurefireMojo.java:98)
	at org.apache.maven.plugin.DefaultBuildPluginManager.executeMojo(DefaultBuildPluginManager.java:101)
	at org.apache.maven.lifecycle.internal.MojoExecutor.execute(MojoExecutor.java:209)
	... 23 more
[ERROR] 
[ERROR] 
[ERROR] For more information about the errors and possible solutions, please read the following
articles:
[ERROR] [Help 1] http://cwiki.apache.org/confluence/display/MAVEN/MojoFailureException
Build step 'Invoke top-level Maven targets' marked build as failure
Archiving artifacts
Updating HBASE-5970
Updating HBASE-5582
Updating HBASE-5314
Updating HBASE-6312
Updating HBASE-7051
Updating HBASE-7017
Updating HBASE-6974
Updating HBASE-7016
Updating HBASE-7053
Updating HBASE-5547
Updating HBASE-7018
Updating HBASE-6700
Updating HBASE-7095
Updating HBASE-6978
Updating HBASE-6733
Updating HBASE-6900
Updating HBASE-6843
Updating HBASE-6942
Updating HBASE-6846
Updating HBASE-7048
Updating HBASE-6904
Updating HBASE-6032
Updating HBASE-7040
Updating HBASE-7086
Updating HBASE-6889
Updating HBASE-7087
Updating HBASE-6951
Updating HBASE-7037
Updating HBASE-7038
Updating HBASE-6336
Updating HBASE-7033
Updating HBASE-6728
Updating HBASE-6996
Updating HBASE-6853
Updating HBASE-7077
Updating HBASE-5867
Updating HBASE-7073
Updating HBASE-6852
Updating HBASE-6389
Updating HBASE-5987
Updating HBASE-6920
Updating HBASE-6583
Updating HBASE-7069
Updating HBASE-6796
Updating HBASE-6925
Updating HBASE-6305
Updating HBASE-7060
Updating HBASE-5257
Updating HBASE-7021
Updating HBASE-7020
Updating HBASE-6518
Recording test results

Mime
View raw message