hbase-dev mailing list archives

Site index · List index
Message view « Date » · « Thread »
Top « Date » · « Thread »
From Apache Jenkins Server <jenk...@builds.apache.org>
Subject Build failed in Jenkins: HBase-TRUNK #3557
Date Thu, 22 Nov 2012 00:27:49 GMT
See <https://builds.apache.org/job/HBase-TRUNK/3557/changes>

Changes:

[tedyu] HBASE-6787 Convert RowProcessorProtocol to protocol buffer service (Devaraj)

[stack] HBASE-7109 integration tests on cluster are not getting picked up from distribution

------------------------------------------
[...truncated 2605 lines...]
  where S,T are type-variables:
    S extends Message declared in class RowProcessorEndpoint
    T extends Message declared in class RowProcessorEndpoint
<https://builds.apache.org/job/HBase-TRUNK/ws/trunk/hbase-server/src/test/java/org/apache/hadoop/hbase/coprocessor/TestRowProcessorEndpoint.java>:[489,13]
error: cannot find symbol
[ERROR]   symbol:   class RowSwapProcessorResponse
  location: class RowSwapProcessor
<https://builds.apache.org/job/HBase-TRUNK/ws/trunk/hbase-server/src/test/java/org/apache/hadoop/hbase/coprocessor/TestRowProcessorEndpoint.java>:[545,13]
error: cannot find symbol
[ERROR]   symbol:   class RowSwapProcessorRequest
  location: class RowSwapProcessor
<https://builds.apache.org/job/HBase-TRUNK/ws/trunk/hbase-server/src/test/java/org/apache/hadoop/hbase/coprocessor/TestRowProcessorEndpoint.java>:[553,29]
error: cannot find symbol
[ERROR]   symbol:   class RowSwapProcessorRequest
  location: class RowSwapProcessor
<https://builds.apache.org/job/HBase-TRUNK/ws/trunk/hbase-server/src/test/java/org/apache/hadoop/hbase/coprocessor/TestRowProcessorEndpoint.java>:[560,25]
error: cannot find symbol
[ERROR]   symbol:   class TimeoutProcessorRequest
  location: class RowProcessorEndpoint<S,T>
  where S,T are type-variables:
    S extends Message declared in class RowProcessorEndpoint
    T extends Message declared in class RowProcessorEndpoint
<https://builds.apache.org/job/HBase-TRUNK/ws/trunk/hbase-server/src/test/java/org/apache/hadoop/hbase/coprocessor/TestRowProcessorEndpoint.java>:[560,50]
error: cannot find symbol
[ERROR]   symbol:   class TimeoutProcessorResponse
  location: class RowProcessorEndpoint<S,T>
  where S,T are type-variables:
    S extends Message declared in class RowProcessorEndpoint
    T extends Message declared in class RowProcessorEndpoint
<https://builds.apache.org/job/HBase-TRUNK/ws/trunk/hbase-server/src/test/java/org/apache/hadoop/hbase/coprocessor/TestRowProcessorEndpoint.java>:[579,13]
error: cannot find symbol
[ERROR]   symbol:   class TimeoutProcessorResponse
  location: class TimeoutProcessor
<https://builds.apache.org/job/HBase-TRUNK/ws/trunk/hbase-server/src/test/java/org/apache/hadoop/hbase/coprocessor/TestRowProcessorEndpoint.java>:[605,13]
error: cannot find symbol
[ERROR]   symbol:   class TimeoutProcessorRequest
  location: class TimeoutProcessor
<https://builds.apache.org/job/HBase-TRUNK/ws/trunk/hbase-server/src/test/java/org/apache/hadoop/hbase/coprocessor/TestRowProcessorEndpoint.java>:[612,29]
error: cannot find symbol
[ERROR]   symbol:   class TimeoutProcessorRequest
  location: class TimeoutProcessor
<https://builds.apache.org/job/HBase-TRUNK/ws/trunk/hbase-server/src/test/java/org/apache/hadoop/hbase/coprocessor/TestRowProcessorEndpoint.java>:[159,4]
error: cannot find symbol
[ERROR]   symbol:   class FriendsOfFriendsProcessorResponse
  location: class TestRowProcessorEndpoint
<https://builds.apache.org/job/HBase-TRUNK/ws/trunk/hbase-server/src/test/java/org/apache/hadoop/hbase/coprocessor/TestRowProcessorEndpoint.java>:[160,8]
error: cannot find symbol
[ERROR]   symbol:   variable FriendsOfFriendsProcessorResponse
  location: class TestRowProcessorEndpoint
<https://builds.apache.org/job/HBase-TRUNK/ws/trunk/hbase-server/src/test/java/org/apache/hadoop/hbase/coprocessor/TestRowProcessorEndpoint.java>:[202,4]
error: cannot find symbol
[ERROR]   symbol:   class IncCounterProcessorResponse
  location: class TestRowProcessorEndpoint
<https://builds.apache.org/job/HBase-TRUNK/ws/trunk/hbase-server/src/test/java/org/apache/hadoop/hbase/coprocessor/TestRowProcessorEndpoint.java>:[202,43]
error: cannot find symbol
[ERROR]   symbol:   variable IncCounterProcessorResponse
  location: class TestRowProcessorEndpoint
<https://builds.apache.org/job/HBase-TRUNK/ws/trunk/hbase-server/src/test/java/org/apache/hadoop/hbase/coprocessor/TestRowProcessorEndpoint.java>:[317,35]
error: package IncCounterProcessorResponse does not exist
[ERROR] <https://builds.apache.org/job/HBase-TRUNK/ws/trunk/hbase-server/src/test/java/org/apache/hadoop/hbase/coprocessor/TestRowProcessorEndpoint.java>:[317,48]
error: cannot find symbol
[ERROR]   symbol:   variable IncCounterProcessorResponse
  location: class IncrementCounterProcessor
<https://builds.apache.org/job/HBase-TRUNK/ws/trunk/hbase-server/src/test/java/org/apache/hadoop/hbase/coprocessor/TestRowProcessorEndpoint.java>:[361,34]
error: package IncCounterProcessorRequest does not exist
[ERROR] <https://builds.apache.org/job/HBase-TRUNK/ws/trunk/hbase-server/src/test/java/org/apache/hadoop/hbase/coprocessor/TestRowProcessorEndpoint.java>:[361,53]
error: cannot find symbol
[ERROR]   symbol:   variable IncCounterProcessorRequest
  location: class IncrementCounterProcessor
<https://builds.apache.org/job/HBase-TRUNK/ws/trunk/hbase-server/src/test/java/org/apache/hadoop/hbase/coprocessor/TestRowProcessorEndpoint.java>:[398,41]
error: package FriendsOfFriendsProcessorResponse does not exist
[ERROR] <https://builds.apache.org/job/HBase-TRUNK/ws/trunk/hbase-server/src/test/java/org/apache/hadoop/hbase/coprocessor/TestRowProcessorEndpoint.java>:[399,12]
error: cannot find symbol
[ERROR]   symbol:   variable FriendsOfFriendsProcessorResponse
  location: class FriendsOfFriendsProcessor
<https://builds.apache.org/job/HBase-TRUNK/ws/trunk/hbase-server/src/test/java/org/apache/hadoop/hbase/coprocessor/TestRowProcessorEndpoint.java>:[440,40]
error: package FriendsOfFriendsProcessorRequest does not exist
[ERROR] <https://builds.apache.org/job/HBase-TRUNK/ws/trunk/hbase-server/src/test/java/org/apache/hadoop/hbase/coprocessor/TestRowProcessorEndpoint.java>:[441,12]
error: cannot find symbol
[ERROR]   symbol:   variable FriendsOfFriendsProcessorRequest
  location: class FriendsOfFriendsProcessor
<https://builds.apache.org/job/HBase-TRUNK/ws/trunk/hbase-server/src/test/java/org/apache/hadoop/hbase/coprocessor/TestRowProcessorEndpoint.java>:[445,8]
error: cannot find symbol
[ERROR]   symbol:   class FriendsOfFriendsProcessorRequest
  location: class FriendsOfFriendsProcessor
<https://builds.apache.org/job/HBase-TRUNK/ws/trunk/hbase-server/src/test/java/org/apache/hadoop/hbase/coprocessor/TestRowProcessorEndpoint.java>:[490,15]
error: cannot find symbol
[ERROR]   symbol:   variable RowSwapProcessorResponse
  location: class RowSwapProcessor
<https://builds.apache.org/job/HBase-TRUNK/ws/trunk/hbase-server/src/test/java/org/apache/hadoop/hbase/coprocessor/TestRowProcessorEndpoint.java>:[546,31]
error: package RowSwapProcessorRequest does not exist
[ERROR] <https://builds.apache.org/job/HBase-TRUNK/ws/trunk/hbase-server/src/test/java/org/apache/hadoop/hbase/coprocessor/TestRowProcessorEndpoint.java>:[546,50]
error: cannot find symbol
[ERROR]   symbol:   variable RowSwapProcessorRequest
  location: class RowSwapProcessor
<https://builds.apache.org/job/HBase-TRUNK/ws/trunk/hbase-server/src/test/java/org/apache/hadoop/hbase/coprocessor/TestRowProcessorEndpoint.java>:[580,15]
error: cannot find symbol
[ERROR]   symbol:   variable TimeoutProcessorResponse
  location: class TimeoutProcessor
<https://builds.apache.org/job/HBase-TRUNK/ws/trunk/hbase-server/src/test/java/org/apache/hadoop/hbase/coprocessor/TestRowProcessorEndpoint.java>:[606,31]
error: package TimeoutProcessorRequest does not exist
[ERROR] <https://builds.apache.org/job/HBase-TRUNK/ws/trunk/hbase-server/src/test/java/org/apache/hadoop/hbase/coprocessor/TestRowProcessorEndpoint.java>:[606,50]
error: cannot find symbol
[INFO] 48 errors 
[INFO] -------------------------------------------------------------
[INFO]                                                                         
[INFO] ------------------------------------------------------------------------
[INFO] Skipping HBase
[INFO] This project has been banned from the build due to previous failures.
[INFO] ------------------------------------------------------------------------
[INFO]                                                                         
[INFO] ------------------------------------------------------------------------
[INFO] Skipping HBase
[INFO] This project has been banned from the build due to previous failures.
[INFO] ------------------------------------------------------------------------
[INFO] ------------------------------------------------------------------------
[INFO] Reactor Summary:
[INFO] 
[INFO] HBase ............................................. SUCCESS [6.017s]
[INFO] HBase - Common .................................... SUCCESS [15.795s]
[INFO] HBase - Protocol .................................. SUCCESS [7.177s]
[INFO] HBase - Hadoop Compatibility ...................... SUCCESS [0.687s]
[INFO] HBase - Hadoop One Compatibility .................. SUCCESS [1.577s]
[INFO] HBase - Server .................................... FAILURE [17.334s]
[INFO] HBase - Hadoop Two Compatibility .................. SKIPPED
[INFO] HBase - Integration Tests ......................... SKIPPED
[INFO] HBase - Examples .................................. SKIPPED
[INFO] ------------------------------------------------------------------------
[INFO] BUILD FAILURE
[INFO] ------------------------------------------------------------------------
[INFO] Total time: 49.482s
[INFO] Finished at: Thu Nov 22 00:27:47 UTC 2012
[INFO] Final Memory: 63M/1036M
[INFO] ------------------------------------------------------------------------
[ERROR] Failed to execute goal org.apache.maven.plugins:maven-compiler-plugin:2.5.1:testCompile
(default-testCompile) on project hbase-server: Compilation failure: Compilation failure:
[ERROR] <https://builds.apache.org/job/HBase-TRUNK/ws/trunk/hbase-server/src/test/java/org/apache/hadoop/hbase/coprocessor/TestRowProcessorEndpoint.java>:[46,61]
error: package org.apache.hadoop.hbase.coprocessor.protobuf.generated does not exist
[ERROR] <https://builds.apache.org/job/HBase-TRUNK/ws/trunk/hbase-server/src/test/java/org/apache/hadoop/hbase/coprocessor/TestRowProcessorEndpoint.java>:[47,97]
error: package org.apache.hadoop.hbase.coprocessor.protobuf.generated.IncrementCounterProcessorTestProtos
does not exist
[ERROR] <https://builds.apache.org/job/HBase-TRUNK/ws/trunk/hbase-server/src/test/java/org/apache/hadoop/hbase/coprocessor/TestRowProcessorEndpoint.java>:[48,97]
error: package org.apache.hadoop.hbase.coprocessor.protobuf.generated.IncrementCounterProcessorTestProtos
does not exist
[ERROR] <https://builds.apache.org/job/HBase-TRUNK/ws/trunk/hbase-server/src/test/java/org/apache/hadoop/hbase/coprocessor/TestRowProcessorEndpoint.java>:[49,97]
error: package org.apache.hadoop.hbase.coprocessor.protobuf.generated.IncrementCounterProcessorTestProtos
does not exist
[ERROR] <https://builds.apache.org/job/HBase-TRUNK/ws/trunk/hbase-server/src/test/java/org/apache/hadoop/hbase/coprocessor/TestRowProcessorEndpoint.java>:[50,97]
error: package org.apache.hadoop.hbase.coprocessor.protobuf.generated.IncrementCounterProcessorTestProtos
does not exist
[ERROR] <https://builds.apache.org/job/HBase-TRUNK/ws/trunk/hbase-server/src/test/java/org/apache/hadoop/hbase/coprocessor/TestRowProcessorEndpoint.java>:[51,97]
error: package org.apache.hadoop.hbase.coprocessor.protobuf.generated.IncrementCounterProcessorTestProtos
does not exist
[ERROR] <https://builds.apache.org/job/HBase-TRUNK/ws/trunk/hbase-server/src/test/java/org/apache/hadoop/hbase/coprocessor/TestRowProcessorEndpoint.java>:[52,97]
error: package org.apache.hadoop.hbase.coprocessor.protobuf.generated.IncrementCounterProcessorTestProtos
does not exist
[ERROR] <https://builds.apache.org/job/HBase-TRUNK/ws/trunk/hbase-server/src/test/java/org/apache/hadoop/hbase/coprocessor/TestRowProcessorEndpoint.java>:[53,97]
error: package org.apache.hadoop.hbase.coprocessor.protobuf.generated.IncrementCounterProcessorTestProtos
does not exist
[ERROR] <https://builds.apache.org/job/HBase-TRUNK/ws/trunk/hbase-server/src/test/java/org/apache/hadoop/hbase/coprocessor/TestRowProcessorEndpoint.java>:[54,97]
error: package org.apache.hadoop.hbase.coprocessor.protobuf.generated.IncrementCounterProcessorTestProtos
does not exist
[ERROR] <https://builds.apache.org/job/HBase-TRUNK/ws/trunk/hbase-server/src/test/java/org/apache/hadoop/hbase/coprocessor/TestRowProcessorEndpoint.java>:[295,60]
error: package IncrementCounterProcessorTestProtos does not exist
[ERROR] <https://builds.apache.org/job/HBase-TRUNK/ws/trunk/hbase-server/src/test/java/org/apache/hadoop/hbase/coprocessor/TestRowProcessorEndpoint.java>:[296,43]
error: package IncrementCounterProcessorTestProtos does not exist
[ERROR] <https://builds.apache.org/job/HBase-TRUNK/ws/trunk/hbase-server/src/test/java/org/apache/hadoop/hbase/coprocessor/TestRowProcessorEndpoint.java>:[316,13]
error: cannot find symbol
[ERROR] symbol:   class IncCounterProcessorResponse
[ERROR] location: class IncrementCounterProcessor
[ERROR] <https://builds.apache.org/job/HBase-TRUNK/ws/trunk/hbase-server/src/test/java/org/apache/hadoop/hbase/coprocessor/TestRowProcessorEndpoint.java>:[360,13]
error: cannot find symbol
[ERROR] symbol:   class IncCounterProcessorRequest
[ERROR] location: class IncrementCounterProcessor
[ERROR] <https://builds.apache.org/job/HBase-TRUNK/ws/trunk/hbase-server/src/test/java/org/apache/hadoop/hbase/coprocessor/TestRowProcessorEndpoint.java>:[368,29]
error: cannot find symbol
[ERROR] symbol:   class IncCounterProcessorRequest
[ERROR] location: class IncrementCounterProcessor
[ERROR] <https://builds.apache.org/job/HBase-TRUNK/ws/trunk/hbase-server/src/test/java/org/apache/hadoop/hbase/coprocessor/TestRowProcessorEndpoint.java>:[375,25]
error: cannot find symbol
[ERROR] symbol:   class FriendsOfFriendsProcessorRequest
[ERROR] location: class RowProcessorEndpoint<S,T>
[ERROR] where S,T are type-variables:
[ERROR] S extends Message declared in class RowProcessorEndpoint
[ERROR] T extends Message declared in class RowProcessorEndpoint
[ERROR] <https://builds.apache.org/job/HBase-TRUNK/ws/trunk/hbase-server/src/test/java/org/apache/hadoop/hbase/coprocessor/TestRowProcessorEndpoint.java>:[375,59]
error: cannot find symbol
[ERROR] symbol:   class FriendsOfFriendsProcessorResponse
[ERROR] location: class RowProcessorEndpoint<S,T>
[ERROR] where S,T are type-variables:
[ERROR] S extends Message declared in class RowProcessorEndpoint
[ERROR] T extends Message declared in class RowProcessorEndpoint
[ERROR] <https://builds.apache.org/job/HBase-TRUNK/ws/trunk/hbase-server/src/test/java/org/apache/hadoop/hbase/coprocessor/TestRowProcessorEndpoint.java>:[397,13]
error: cannot find symbol
[ERROR] symbol:   class FriendsOfFriendsProcessorResponse
[ERROR] location: class FriendsOfFriendsProcessor
[ERROR] <https://builds.apache.org/job/HBase-TRUNK/ws/trunk/hbase-server/src/test/java/org/apache/hadoop/hbase/coprocessor/TestRowProcessorEndpoint.java>:[439,13]
error: cannot find symbol
[ERROR] symbol:   class FriendsOfFriendsProcessorRequest
[ERROR] location: class FriendsOfFriendsProcessor
[ERROR] <https://builds.apache.org/job/HBase-TRUNK/ws/trunk/hbase-server/src/test/java/org/apache/hadoop/hbase/coprocessor/TestRowProcessorEndpoint.java>:[450,29]
error: cannot find symbol
[ERROR] symbol:   class FriendsOfFriendsProcessorRequest
[ERROR] location: class FriendsOfFriendsProcessor
[ERROR] <https://builds.apache.org/job/HBase-TRUNK/ws/trunk/hbase-server/src/test/java/org/apache/hadoop/hbase/coprocessor/TestRowProcessorEndpoint.java>:[460,25]
error: cannot find symbol
[ERROR] symbol:   class RowSwapProcessorRequest
[ERROR] location: class RowProcessorEndpoint<S,T>
[ERROR] where S,T are type-variables:
[ERROR] S extends Message declared in class RowProcessorEndpoint
[ERROR] T extends Message declared in class RowProcessorEndpoint
[ERROR] <https://builds.apache.org/job/HBase-TRUNK/ws/trunk/hbase-server/src/test/java/org/apache/hadoop/hbase/coprocessor/TestRowProcessorEndpoint.java>:[460,50]
error: cannot find symbol
[ERROR] symbol:   class RowSwapProcessorResponse
[ERROR] location: class RowProcessorEndpoint<S,T>
[ERROR] where S,T are type-variables:
[ERROR] S extends Message declared in class RowProcessorEndpoint
[ERROR] T extends Message declared in class RowProcessorEndpoint
[ERROR] <https://builds.apache.org/job/HBase-TRUNK/ws/trunk/hbase-server/src/test/java/org/apache/hadoop/hbase/coprocessor/TestRowProcessorEndpoint.java>:[489,13]
error: cannot find symbol
[ERROR] symbol:   class RowSwapProcessorResponse
[ERROR] location: class RowSwapProcessor
[ERROR] <https://builds.apache.org/job/HBase-TRUNK/ws/trunk/hbase-server/src/test/java/org/apache/hadoop/hbase/coprocessor/TestRowProcessorEndpoint.java>:[545,13]
error: cannot find symbol
[ERROR] symbol:   class RowSwapProcessorRequest
[ERROR] location: class RowSwapProcessor
[ERROR] <https://builds.apache.org/job/HBase-TRUNK/ws/trunk/hbase-server/src/test/java/org/apache/hadoop/hbase/coprocessor/TestRowProcessorEndpoint.java>:[553,29]
error: cannot find symbol
[ERROR] symbol:   class RowSwapProcessorRequest
[ERROR] location: class RowSwapProcessor
[ERROR] <https://builds.apache.org/job/HBase-TRUNK/ws/trunk/hbase-server/src/test/java/org/apache/hadoop/hbase/coprocessor/TestRowProcessorEndpoint.java>:[560,25]
error: cannot find symbol
[ERROR] symbol:   class TimeoutProcessorRequest
[ERROR] location: class RowProcessorEndpoint<S,T>
[ERROR] where S,T are type-variables:
[ERROR] S extends Message declared in class RowProcessorEndpoint
[ERROR] T extends Message declared in class RowProcessorEndpoint
[ERROR] <https://builds.apache.org/job/HBase-TRUNK/ws/trunk/hbase-server/src/test/java/org/apache/hadoop/hbase/coprocessor/TestRowProcessorEndpoint.java>:[560,50]
error: cannot find symbol
[ERROR] symbol:   class TimeoutProcessorResponse
[ERROR] location: class RowProcessorEndpoint<S,T>
[ERROR] where S,T are type-variables:
[ERROR] S extends Message declared in class RowProcessorEndpoint
[ERROR] T extends Message declared in class RowProcessorEndpoint
[ERROR] <https://builds.apache.org/job/HBase-TRUNK/ws/trunk/hbase-server/src/test/java/org/apache/hadoop/hbase/coprocessor/TestRowProcessorEndpoint.java>:[579,13]
error: cannot find symbol
[ERROR] symbol:   class TimeoutProcessorResponse
[ERROR] location: class TimeoutProcessor
[ERROR] <https://builds.apache.org/job/HBase-TRUNK/ws/trunk/hbase-server/src/test/java/org/apache/hadoop/hbase/coprocessor/TestRowProcessorEndpoint.java>:[605,13]
error: cannot find symbol
[ERROR] symbol:   class TimeoutProcessorRequest
[ERROR] location: class TimeoutProcessor
[ERROR] <https://builds.apache.org/job/HBase-TRUNK/ws/trunk/hbase-server/src/test/java/org/apache/hadoop/hbase/coprocessor/TestRowProcessorEndpoint.java>:[612,29]
error: cannot find symbol
[ERROR] symbol:   class TimeoutProcessorRequest
[ERROR] location: class TimeoutProcessor
[ERROR] <https://builds.apache.org/job/HBase-TRUNK/ws/trunk/hbase-server/src/test/java/org/apache/hadoop/hbase/coprocessor/TestRowProcessorEndpoint.java>:[159,4]
error: cannot find symbol
[ERROR] symbol:   class FriendsOfFriendsProcessorResponse
[ERROR] location: class TestRowProcessorEndpoint
[ERROR] <https://builds.apache.org/job/HBase-TRUNK/ws/trunk/hbase-server/src/test/java/org/apache/hadoop/hbase/coprocessor/TestRowProcessorEndpoint.java>:[160,8]
error: cannot find symbol
[ERROR] symbol:   variable FriendsOfFriendsProcessorResponse
[ERROR] location: class TestRowProcessorEndpoint
[ERROR] <https://builds.apache.org/job/HBase-TRUNK/ws/trunk/hbase-server/src/test/java/org/apache/hadoop/hbase/coprocessor/TestRowProcessorEndpoint.java>:[202,4]
error: cannot find symbol
[ERROR] symbol:   class IncCounterProcessorResponse
[ERROR] location: class TestRowProcessorEndpoint
[ERROR] <https://builds.apache.org/job/HBase-TRUNK/ws/trunk/hbase-server/src/test/java/org/apache/hadoop/hbase/coprocessor/TestRowProcessorEndpoint.java>:[202,43]
error: cannot find symbol
[ERROR] symbol:   variable IncCounterProcessorResponse
[ERROR] location: class TestRowProcessorEndpoint
[ERROR] <https://builds.apache.org/job/HBase-TRUNK/ws/trunk/hbase-server/src/test/java/org/apache/hadoop/hbase/coprocessor/TestRowProcessorEndpoint.java>:[317,35]
error: package IncCounterProcessorResponse does not exist
[ERROR] <https://builds.apache.org/job/HBase-TRUNK/ws/trunk/hbase-server/src/test/java/org/apache/hadoop/hbase/coprocessor/TestRowProcessorEndpoint.java>:[317,48]
error: cannot find symbol
[ERROR] symbol:   variable IncCounterProcessorResponse
[ERROR] location: class IncrementCounterProcessor
[ERROR] <https://builds.apache.org/job/HBase-TRUNK/ws/trunk/hbase-server/src/test/java/org/apache/hadoop/hbase/coprocessor/TestRowProcessorEndpoint.java>:[361,34]
error: package IncCounterProcessorRequest does not exist
[ERROR] <https://builds.apache.org/job/HBase-TRUNK/ws/trunk/hbase-server/src/test/java/org/apache/hadoop/hbase/coprocessor/TestRowProcessorEndpoint.java>:[361,53]
error: cannot find symbol
[ERROR] symbol:   variable IncCounterProcessorRequest
[ERROR] location: class IncrementCounterProcessor
[ERROR] <https://builds.apache.org/job/HBase-TRUNK/ws/trunk/hbase-server/src/test/java/org/apache/hadoop/hbase/coprocessor/TestRowProcessorEndpoint.java>:[398,41]
error: package FriendsOfFriendsProcessorResponse does not exist
[ERROR] <https://builds.apache.org/job/HBase-TRUNK/ws/trunk/hbase-server/src/test/java/org/apache/hadoop/hbase/coprocessor/TestRowProcessorEndpoint.java>:[399,12]
error: cannot find symbol
[ERROR] symbol:   variable FriendsOfFriendsProcessorResponse
[ERROR] location: class FriendsOfFriendsProcessor
[ERROR] <https://builds.apache.org/job/HBase-TRUNK/ws/trunk/hbase-server/src/test/java/org/apache/hadoop/hbase/coprocessor/TestRowProcessorEndpoint.java>:[440,40]
error: package FriendsOfFriendsProcessorRequest does not exist
[ERROR] <https://builds.apache.org/job/HBase-TRUNK/ws/trunk/hbase-server/src/test/java/org/apache/hadoop/hbase/coprocessor/TestRowProcessorEndpoint.java>:[441,12]
error: cannot find symbol
[ERROR] symbol:   variable FriendsOfFriendsProcessorRequest
[ERROR] location: class FriendsOfFriendsProcessor
[ERROR] <https://builds.apache.org/job/HBase-TRUNK/ws/trunk/hbase-server/src/test/java/org/apache/hadoop/hbase/coprocessor/TestRowProcessorEndpoint.java>:[445,8]
error: cannot find symbol
[ERROR] symbol:   class FriendsOfFriendsProcessorRequest
[ERROR] location: class FriendsOfFriendsProcessor
[ERROR] <https://builds.apache.org/job/HBase-TRUNK/ws/trunk/hbase-server/src/test/java/org/apache/hadoop/hbase/coprocessor/TestRowProcessorEndpoint.java>:[490,15]
error: cannot find symbol
[ERROR] symbol:   variable RowSwapProcessorResponse
[ERROR] location: class RowSwapProcessor
[ERROR] <https://builds.apache.org/job/HBase-TRUNK/ws/trunk/hbase-server/src/test/java/org/apache/hadoop/hbase/coprocessor/TestRowProcessorEndpoint.java>:[546,31]
error: package RowSwapProcessorRequest does not exist
[ERROR] <https://builds.apache.org/job/HBase-TRUNK/ws/trunk/hbase-server/src/test/java/org/apache/hadoop/hbase/coprocessor/TestRowProcessorEndpoint.java>:[546,50]
error: cannot find symbol
[ERROR] symbol:   variable RowSwapProcessorRequest
[ERROR] location: class RowSwapProcessor
[ERROR] <https://builds.apache.org/job/HBase-TRUNK/ws/trunk/hbase-server/src/test/java/org/apache/hadoop/hbase/coprocessor/TestRowProcessorEndpoint.java>:[580,15]
error: cannot find symbol
[ERROR] symbol:   variable TimeoutProcessorResponse
[ERROR] location: class TimeoutProcessor
[ERROR] <https://builds.apache.org/job/HBase-TRUNK/ws/trunk/hbase-server/src/test/java/org/apache/hadoop/hbase/coprocessor/TestRowProcessorEndpoint.java>:[606,31]
error: package TimeoutProcessorRequest does not exist
[ERROR] <https://builds.apache.org/job/HBase-TRUNK/ws/trunk/hbase-server/src/test/java/org/apache/hadoop/hbase/coprocessor/TestRowProcessorEndpoint.java>:[606,50]
error: cannot find symbol
[ERROR] -> [Help 1]
[ERROR] 
[ERROR] To see the full stack trace of the errors, re-run Maven with the -e switch.
[ERROR] Re-run Maven using the -X switch to enable full debug logging.
[ERROR] 
[ERROR] For more information about the errors and possible solutions, please read the following
articles:
[ERROR] [Help 1] http://cwiki.apache.org/confluence/display/MAVEN/MojoFailureException
[ERROR] 
[ERROR] After correcting the problems, you can resume the build with the command
[ERROR]   mvn <goals> -rf :hbase-server
Build step 'Invoke top-level Maven targets' marked build as failure
Archiving artifacts
Recording test results
Updating HBASE-7109
Updating HBASE-6787

Mime
View raw message