hbase-dev mailing list archives

Site index · List index
Message view « Date » · « Thread »
Top « Date » · « Thread »
From Apache Jenkins Server <jenk...@builds.apache.org>
Subject Build failed in Jenkins: HBase-TRUNK-on-Hadoop-2.0.0 #250
Date Tue, 06 Nov 2012 23:44:04 GMT
See <https://builds.apache.org/job/HBase-TRUNK-on-Hadoop-2.0.0/250/changes>

Changes:

[stack] HBASE-6793 Make hbase-examples module

[stack] Add note that can OOME if many regions and MSLAB on

[stack] HBASE-6991 Escape "\" in Bytes.toStringBinary() and its counterpart Bytes.toBytesBinary()

------------------------------------------
[...truncated 13341 lines...]
Running org.apache.hadoop.hbase.regionserver.metrics.TestSchemaMetrics
Tests run: 6, Failures: 0, Errors: 0, Skipped: 0, Time elapsed: 11.645 sec
Forking command line: /bin/sh -c cd /x1/jenkins/jenkins-slave/workspace/HBase-TRUNK-on-Hadoop-2.0.0/trunk/hbase-server
&& /x1/jenkins/tools/java/jdk1.6.0_32-32/jre/bin/java -enableassertions -Xmx1900m
-Djava.security.egd=file:/dev/./urandom -jar /x1/jenkins/jenkins-slave/workspace/HBase-TRUNK-on-Hadoop-2.0.0/trunk/hbase-server/target/surefire/surefirebooter8124923106353781531.jar
/x1/jenkins/jenkins-slave/workspace/HBase-TRUNK-on-Hadoop-2.0.0/trunk/hbase-server/target/surefire/surefire7252644716872145510tmp
/x1/jenkins/jenkins-slave/workspace/HBase-TRUNK-on-Hadoop-2.0.0/trunk/hbase-server/target/surefire/surefire_964400674590941785512tmp
Running org.apache.hadoop.hbase.regionserver.TestStoreFileBlockCacheSummary
Tests run: 1, Failures: 0, Errors: 0, Skipped: 0, Time elapsed: 9.767 sec
Forking command line: /bin/sh -c cd /x1/jenkins/jenkins-slave/workspace/HBase-TRUNK-on-Hadoop-2.0.0/trunk/hbase-server
&& /x1/jenkins/tools/java/jdk1.6.0_32-32/jre/bin/java -enableassertions -Xmx1900m
-Djava.security.egd=file:/dev/./urandom -jar /x1/jenkins/jenkins-slave/workspace/HBase-TRUNK-on-Hadoop-2.0.0/trunk/hbase-server/target/surefire/surefirebooter6616418127411562446.jar
/x1/jenkins/jenkins-slave/workspace/HBase-TRUNK-on-Hadoop-2.0.0/trunk/hbase-server/target/surefire/surefire1767455301433037136tmp
/x1/jenkins/jenkins-slave/workspace/HBase-TRUNK-on-Hadoop-2.0.0/trunk/hbase-server/target/surefire/surefire_976977635883641664461tmp
Running org.apache.hadoop.hbase.regionserver.TestCompaction
Tests run: 15, Failures: 0, Errors: 0, Skipped: 0, Time elapsed: 34.866 sec
Forking command line: /bin/sh -c cd /x1/jenkins/jenkins-slave/workspace/HBase-TRUNK-on-Hadoop-2.0.0/trunk/hbase-server
&& /x1/jenkins/tools/java/jdk1.6.0_32-32/jre/bin/java -enableassertions -Xmx1900m
-Djava.security.egd=file:/dev/./urandom -jar /x1/jenkins/jenkins-slave/workspace/HBase-TRUNK-on-Hadoop-2.0.0/trunk/hbase-server/target/surefire/surefirebooter2933161527743821174.jar
/x1/jenkins/jenkins-slave/workspace/HBase-TRUNK-on-Hadoop-2.0.0/trunk/hbase-server/target/surefire/surefire167740137390047098tmp
/x1/jenkins/jenkins-slave/workspace/HBase-TRUNK-on-Hadoop-2.0.0/trunk/hbase-server/target/surefire/surefire_982794707491313893208tmp
Running org.apache.hadoop.hbase.regionserver.TestClusterId
Tests run: 1, Failures: 0, Errors: 0, Skipped: 0, Time elapsed: 23.481 sec
Forking command line: /bin/sh -c cd /x1/jenkins/jenkins-slave/workspace/HBase-TRUNK-on-Hadoop-2.0.0/trunk/hbase-server
&& /x1/jenkins/tools/java/jdk1.6.0_32-32/jre/bin/java -enableassertions -Xmx1900m
-Djava.security.egd=file:/dev/./urandom -jar /x1/jenkins/jenkins-slave/workspace/HBase-TRUNK-on-Hadoop-2.0.0/trunk/hbase-server/target/surefire/surefirebooter108200125707870944.jar
/x1/jenkins/jenkins-slave/workspace/HBase-TRUNK-on-Hadoop-2.0.0/trunk/hbase-server/target/surefire/surefire7558872389151038058tmp
/x1/jenkins/jenkins-slave/workspace/HBase-TRUNK-on-Hadoop-2.0.0/trunk/hbase-server/target/surefire/surefire_994180322499933679162tmp
Running org.apache.hadoop.hbase.regionserver.TestMasterAddressManager
Tests run: 1, Failures: 0, Errors: 0, Skipped: 0, Time elapsed: 0.841 sec
Forking command line: /bin/sh -c cd /x1/jenkins/jenkins-slave/workspace/HBase-TRUNK-on-Hadoop-2.0.0/trunk/hbase-server
&& /x1/jenkins/tools/java/jdk1.6.0_32-32/jre/bin/java -enableassertions -Xmx1900m
-Djava.security.egd=file:/dev/./urandom -jar /x1/jenkins/jenkins-slave/workspace/HBase-TRUNK-on-Hadoop-2.0.0/trunk/hbase-server/target/surefire/surefirebooter6488339889296162671.jar
/x1/jenkins/jenkins-slave/workspace/HBase-TRUNK-on-Hadoop-2.0.0/trunk/hbase-server/target/surefire/surefire1107917317997408285tmp
/x1/jenkins/jenkins-slave/workspace/HBase-TRUNK-on-Hadoop-2.0.0/trunk/hbase-server/target/surefire/surefire_1009178758030421759962tmp
Running org.apache.hadoop.hbase.regionserver.TestMultiColumnScanner
Tests run: 12, Failures: 0, Errors: 0, Skipped: 0, Time elapsed: 31.207 sec
Forking command line: /bin/sh -c cd /x1/jenkins/jenkins-slave/workspace/HBase-TRUNK-on-Hadoop-2.0.0/trunk/hbase-server
&& /x1/jenkins/tools/java/jdk1.6.0_32-32/jre/bin/java -enableassertions -Xmx1900m
-Djava.security.egd=file:/dev/./urandom -jar /x1/jenkins/jenkins-slave/workspace/HBase-TRUNK-on-Hadoop-2.0.0/trunk/hbase-server/target/surefire/surefirebooter4738183244109981348.jar
/x1/jenkins/jenkins-slave/workspace/HBase-TRUNK-on-Hadoop-2.0.0/trunk/hbase-server/target/surefire/surefire9078216305933927449tmp
/x1/jenkins/jenkins-slave/workspace/HBase-TRUNK-on-Hadoop-2.0.0/trunk/hbase-server/target/surefire/surefire_1016014376226488850206tmp
Running org.apache.hadoop.hbase.regionserver.TestHRegion
Tests run: 58, Failures: 0, Errors: 0, Skipped: 0, Time elapsed: 34.093 sec
Forking command line: /bin/sh -c cd /x1/jenkins/jenkins-slave/workspace/HBase-TRUNK-on-Hadoop-2.0.0/trunk/hbase-server
&& /x1/jenkins/tools/java/jdk1.6.0_32-32/jre/bin/java -enableassertions -Xmx1900m
-Djava.security.egd=file:/dev/./urandom -jar /x1/jenkins/jenkins-slave/workspace/HBase-TRUNK-on-Hadoop-2.0.0/trunk/hbase-server/target/surefire/surefirebooter6409003672201135408.jar
/x1/jenkins/jenkins-slave/workspace/HBase-TRUNK-on-Hadoop-2.0.0/trunk/hbase-server/target/surefire/surefire3115953813868580719tmp
/x1/jenkins/jenkins-slave/workspace/HBase-TRUNK-on-Hadoop-2.0.0/trunk/hbase-server/target/surefire/surefire_1026552905927839828327tmp
Running org.apache.hadoop.hbase.backup.example.TestZooKeeperTableArchiveClient
Tests run: 3, Failures: 0, Errors: 0, Skipped: 0, Time elapsed: 5.912 sec
Forking command line: /bin/sh -c cd /x1/jenkins/jenkins-slave/workspace/HBase-TRUNK-on-Hadoop-2.0.0/trunk/hbase-server
&& /x1/jenkins/tools/java/jdk1.6.0_32-32/jre/bin/java -enableassertions -Xmx1900m
-Djava.security.egd=file:/dev/./urandom -jar /x1/jenkins/jenkins-slave/workspace/HBase-TRUNK-on-Hadoop-2.0.0/trunk/hbase-server/target/surefire/surefirebooter6961549302300864006.jar
/x1/jenkins/jenkins-slave/workspace/HBase-TRUNK-on-Hadoop-2.0.0/trunk/hbase-server/target/surefire/surefire3291969381944492193tmp
/x1/jenkins/jenkins-slave/workspace/HBase-TRUNK-on-Hadoop-2.0.0/trunk/hbase-server/target/surefire/surefire_1032118070049581078769tmp
Running org.apache.hadoop.hbase.TestLocalHBaseCluster
Tests run: 1, Failures: 0, Errors: 0, Skipped: 0, Time elapsed: 8.866 sec
Forking command line: /bin/sh -c cd /x1/jenkins/jenkins-slave/workspace/HBase-TRUNK-on-Hadoop-2.0.0/trunk/hbase-server
&& /x1/jenkins/tools/java/jdk1.6.0_32-32/jre/bin/java -enableassertions -Xmx1900m
-Djava.security.egd=file:/dev/./urandom -jar /x1/jenkins/jenkins-slave/workspace/HBase-TRUNK-on-Hadoop-2.0.0/trunk/hbase-server/target/surefire/surefirebooter6549584622426080886.jar
/x1/jenkins/jenkins-slave/workspace/HBase-TRUNK-on-Hadoop-2.0.0/trunk/hbase-server/target/surefire/surefire3733537052897600015tmp
/x1/jenkins/jenkins-slave/workspace/HBase-TRUNK-on-Hadoop-2.0.0/trunk/hbase-server/target/surefire/surefire_1047412042843985979512tmp
Running org.apache.hadoop.hbase.ipc.TestDelayedRpc
Tests run: 4, Failures: 0, Errors: 0, Skipped: 0, Time elapsed: 2.448 sec
Forking command line: /bin/sh -c cd /x1/jenkins/jenkins-slave/workspace/HBase-TRUNK-on-Hadoop-2.0.0/trunk/hbase-server
&& /x1/jenkins/tools/java/jdk1.6.0_32-32/jre/bin/java -enableassertions -Xmx1900m
-Djava.security.egd=file:/dev/./urandom -jar /x1/jenkins/jenkins-slave/workspace/HBase-TRUNK-on-Hadoop-2.0.0/trunk/hbase-server/target/surefire/surefirebooter4476710780556105275.jar
/x1/jenkins/jenkins-slave/workspace/HBase-TRUNK-on-Hadoop-2.0.0/trunk/hbase-server/target/surefire/surefire2181437710791976817tmp
/x1/jenkins/jenkins-slave/workspace/HBase-TRUNK-on-Hadoop-2.0.0/trunk/hbase-server/target/surefire/surefire_105931329833424808094tmp
Running org.apache.hadoop.hbase.ipc.TestHBaseClient
Tests run: 1, Failures: 0, Errors: 0, Skipped: 0, Time elapsed: 0.294 sec
Forking command line: /bin/sh -c cd /x1/jenkins/jenkins-slave/workspace/HBase-TRUNK-on-Hadoop-2.0.0/trunk/hbase-server
&& /x1/jenkins/tools/java/jdk1.6.0_32-32/jre/bin/java -enableassertions -Xmx1900m
-Djava.security.egd=file:/dev/./urandom -jar /x1/jenkins/jenkins-slave/workspace/HBase-TRUNK-on-Hadoop-2.0.0/trunk/hbase-server/target/surefire/surefirebooter6951045106139519360.jar
/x1/jenkins/jenkins-slave/workspace/HBase-TRUNK-on-Hadoop-2.0.0/trunk/hbase-server/target/surefire/surefire3634245281128408011tmp
/x1/jenkins/jenkins-slave/workspace/HBase-TRUNK-on-Hadoop-2.0.0/trunk/hbase-server/target/surefire/surefire_106866624404766467536tmp
Running org.apache.hadoop.hbase.ipc.TestProtoBufRpc
Tests run: 1, Failures: 0, Errors: 0, Skipped: 0, Time elapsed: 0.901 sec
Forking command line: /bin/sh -c cd /x1/jenkins/jenkins-slave/workspace/HBase-TRUNK-on-Hadoop-2.0.0/trunk/hbase-server
&& /x1/jenkins/tools/java/jdk1.6.0_32-32/jre/bin/java -enableassertions -Xmx1900m
-Djava.security.egd=file:/dev/./urandom -jar /x1/jenkins/jenkins-slave/workspace/HBase-TRUNK-on-Hadoop-2.0.0/trunk/hbase-server/target/surefire/surefirebooter1441529927953915475.jar
/x1/jenkins/jenkins-slave/workspace/HBase-TRUNK-on-Hadoop-2.0.0/trunk/hbase-server/target/surefire/surefire6099831594826457191tmp
/x1/jenkins/jenkins-slave/workspace/HBase-TRUNK-on-Hadoop-2.0.0/trunk/hbase-server/target/surefire/surefire_1071962282492205372439tmp
Running org.apache.hadoop.hbase.backup.TestHFileArchiving
Tests run: 3, Failures: 0, Errors: 0, Skipped: 0, Time elapsed: 41.436 sec
Forking command line: /bin/sh -c cd /x1/jenkins/jenkins-slave/workspace/HBase-TRUNK-on-Hadoop-2.0.0/trunk/hbase-server
&& /x1/jenkins/tools/java/jdk1.6.0_32-32/jre/bin/java -enableassertions -Xmx1900m
-Djava.security.egd=file:/dev/./urandom -jar /x1/jenkins/jenkins-slave/workspace/HBase-TRUNK-on-Hadoop-2.0.0/trunk/hbase-server/target/surefire/surefirebooter4031851544667787854.jar
/x1/jenkins/jenkins-slave/workspace/HBase-TRUNK-on-Hadoop-2.0.0/trunk/hbase-server/target/surefire/surefire4888707522499099841tmp
/x1/jenkins/jenkins-slave/workspace/HBase-TRUNK-on-Hadoop-2.0.0/trunk/hbase-server/target/surefire/surefire_1088712196397357484558tmp
Running org.apache.hadoop.hbase.TestGlobalMemStoreSize
Tests run: 1, Failures: 0, Errors: 0, Skipped: 0, Time elapsed: 11.228 sec
Forking command line: /bin/sh -c cd /x1/jenkins/jenkins-slave/workspace/HBase-TRUNK-on-Hadoop-2.0.0/trunk/hbase-server
&& /x1/jenkins/tools/java/jdk1.6.0_32-32/jre/bin/java -enableassertions -Xmx1900m
-Djava.security.egd=file:/dev/./urandom -jar /x1/jenkins/jenkins-slave/workspace/HBase-TRUNK-on-Hadoop-2.0.0/trunk/hbase-server/target/surefire/surefirebooter5910182407814256044.jar
/x1/jenkins/jenkins-slave/workspace/HBase-TRUNK-on-Hadoop-2.0.0/trunk/hbase-server/target/surefire/surefire5176653630052041388tmp
/x1/jenkins/jenkins-slave/workspace/HBase-TRUNK-on-Hadoop-2.0.0/trunk/hbase-server/target/surefire/surefire_1095420532184581526291tmp
Running org.apache.hadoop.hbase.rest.TestSchemaResource
Tests run: 2, Failures: 0, Errors: 0, Skipped: 0, Time elapsed: 15.502 sec
Forking command line: /bin/sh -c cd /x1/jenkins/jenkins-slave/workspace/HBase-TRUNK-on-Hadoop-2.0.0/trunk/hbase-server
&& /x1/jenkins/tools/java/jdk1.6.0_32-32/jre/bin/java -enableassertions -Xmx1900m
-Djava.security.egd=file:/dev/./urandom -jar /x1/jenkins/jenkins-slave/workspace/HBase-TRUNK-on-Hadoop-2.0.0/trunk/hbase-server/target/surefire/surefirebooter5525618714342283326.jar
/x1/jenkins/jenkins-slave/workspace/HBase-TRUNK-on-Hadoop-2.0.0/trunk/hbase-server/target/surefire/surefire3821815701086427544tmp
/x1/jenkins/jenkins-slave/workspace/HBase-TRUNK-on-Hadoop-2.0.0/trunk/hbase-server/target/surefire/surefire_11037955759730269808tmp
Running org.apache.hadoop.hbase.constraint.TestConstraint
Tests run: 5, Failures: 0, Errors: 0, Skipped: 0, Time elapsed: 23.826 sec
Forking command line: /bin/sh -c cd /x1/jenkins/jenkins-slave/workspace/HBase-TRUNK-on-Hadoop-2.0.0/trunk/hbase-server
&& /x1/jenkins/tools/java/jdk1.6.0_32-32/jre/bin/java -enableassertions -Xmx1900m
-Djava.security.egd=file:/dev/./urandom -jar /x1/jenkins/jenkins-slave/workspace/HBase-TRUNK-on-Hadoop-2.0.0/trunk/hbase-server/target/surefire/surefirebooter8083043572948230159.jar
/x1/jenkins/jenkins-slave/workspace/HBase-TRUNK-on-Hadoop-2.0.0/trunk/hbase-server/target/surefire/surefire6175213638638478176tmp
/x1/jenkins/jenkins-slave/workspace/HBase-TRUNK-on-Hadoop-2.0.0/trunk/hbase-server/target/surefire/surefire_1111415040008683764564tmp
Running org.apache.hadoop.hbase.rest.client.TestRemoteAdmin
Tests run: 1, Failures: 0, Errors: 0, Skipped: 0, Time elapsed: 11.831 sec
Forking command line: /bin/sh -c cd /x1/jenkins/jenkins-slave/workspace/HBase-TRUNK-on-Hadoop-2.0.0/trunk/hbase-server
&& /x1/jenkins/tools/java/jdk1.6.0_32-32/jre/bin/java -enableassertions -Xmx1900m
-Djava.security.egd=file:/dev/./urandom -jar /x1/jenkins/jenkins-slave/workspace/HBase-TRUNK-on-Hadoop-2.0.0/trunk/hbase-server/target/surefire/surefirebooter2617737105307829600.jar
/x1/jenkins/jenkins-slave/workspace/HBase-TRUNK-on-Hadoop-2.0.0/trunk/hbase-server/target/surefire/surefire224673059528000452tmp
/x1/jenkins/jenkins-slave/workspace/HBase-TRUNK-on-Hadoop-2.0.0/trunk/hbase-server/target/surefire/surefire_1125042168934697086302tmp
Running org.apache.hadoop.hbase.rest.client.TestRemoteTable
Tests run: 3, Failures: 0, Errors: 0, Skipped: 0, Time elapsed: 10.834 sec
Forking command line: /bin/sh -c cd /x1/jenkins/jenkins-slave/workspace/HBase-TRUNK-on-Hadoop-2.0.0/trunk/hbase-server
&& /x1/jenkins/tools/java/jdk1.6.0_32-32/jre/bin/java -enableassertions -Xmx1900m
-Djava.security.egd=file:/dev/./urandom -jar /x1/jenkins/jenkins-slave/workspace/HBase-TRUNK-on-Hadoop-2.0.0/trunk/hbase-server/target/surefire/surefirebooter2098088027091207816.jar
/x1/jenkins/jenkins-slave/workspace/HBase-TRUNK-on-Hadoop-2.0.0/trunk/hbase-server/target/surefire/surefire6997797623085182321tmp
/x1/jenkins/jenkins-slave/workspace/HBase-TRUNK-on-Hadoop-2.0.0/trunk/hbase-server/target/surefire/surefire_1133841536379761948886tmp
Running org.apache.hadoop.hbase.rest.TestMultiRowResource
Tests run: 3, Failures: 0, Errors: 0, Skipped: 0, Time elapsed: 10.566 sec
Forking command line: /bin/sh -c cd /x1/jenkins/jenkins-slave/workspace/HBase-TRUNK-on-Hadoop-2.0.0/trunk/hbase-server
&& /x1/jenkins/tools/java/jdk1.6.0_32-32/jre/bin/java -enableassertions -Xmx1900m
-Djava.security.egd=file:/dev/./urandom -jar /x1/jenkins/jenkins-slave/workspace/HBase-TRUNK-on-Hadoop-2.0.0/trunk/hbase-server/target/surefire/surefirebooter7169682165745948253.jar
/x1/jenkins/jenkins-slave/workspace/HBase-TRUNK-on-Hadoop-2.0.0/trunk/hbase-server/target/surefire/surefire407183394008599702tmp
/x1/jenkins/jenkins-slave/workspace/HBase-TRUNK-on-Hadoop-2.0.0/trunk/hbase-server/target/surefire/surefire_1149112240022131404232tmp
Running org.apache.hadoop.hbase.rest.TestTableResource
Tests run: 8, Failures: 0, Errors: 0, Skipped: 0, Time elapsed: 21.274 sec
Forking command line: /bin/sh -c cd /x1/jenkins/jenkins-slave/workspace/HBase-TRUNK-on-Hadoop-2.0.0/trunk/hbase-server
&& /x1/jenkins/tools/java/jdk1.6.0_32-32/jre/bin/java -enableassertions -Xmx1900m
-Djava.security.egd=file:/dev/./urandom -jar /x1/jenkins/jenkins-slave/workspace/HBase-TRUNK-on-Hadoop-2.0.0/trunk/hbase-server/target/surefire/surefirebooter2456227452950831135.jar
/x1/jenkins/jenkins-slave/workspace/HBase-TRUNK-on-Hadoop-2.0.0/trunk/hbase-server/target/surefire/surefire7340633958634875176tmp
/x1/jenkins/jenkins-slave/workspace/HBase-TRUNK-on-Hadoop-2.0.0/trunk/hbase-server/target/surefire/surefire_115572977791438105695tmp
Running org.apache.hadoop.hbase.rest.TestGzipFilter
Tests run: 3, Failures: 0, Errors: 0, Skipped: 0, Time elapsed: 10.135 sec
Forking command line: /bin/sh -c cd /x1/jenkins/jenkins-slave/workspace/HBase-TRUNK-on-Hadoop-2.0.0/trunk/hbase-server
&& /x1/jenkins/tools/java/jdk1.6.0_32-32/jre/bin/java -enableassertions -Xmx1900m
-Djava.security.egd=file:/dev/./urandom -jar /x1/jenkins/jenkins-slave/workspace/HBase-TRUNK-on-Hadoop-2.0.0/trunk/hbase-server/target/surefire/surefirebooter5227511253576538080.jar
/x1/jenkins/jenkins-slave/workspace/HBase-TRUNK-on-Hadoop-2.0.0/trunk/hbase-server/target/surefire/surefire3718197700849317959tmp
/x1/jenkins/jenkins-slave/workspace/HBase-TRUNK-on-Hadoop-2.0.0/trunk/hbase-server/target/surefire/surefire_1168511731961422212576tmp
Running org.apache.hadoop.hbase.rest.TestRowResource
Tests run: 12, Failures: 0, Errors: 0, Skipped: 0, Time elapsed: 13.119 sec
Forking command line: /bin/sh -c cd /x1/jenkins/jenkins-slave/workspace/HBase-TRUNK-on-Hadoop-2.0.0/trunk/hbase-server
&& /x1/jenkins/tools/java/jdk1.6.0_32-32/jre/bin/java -enableassertions -Xmx1900m
-Djava.security.egd=file:/dev/./urandom -jar /x1/jenkins/jenkins-slave/workspace/HBase-TRUNK-on-Hadoop-2.0.0/trunk/hbase-server/target/surefire/surefirebooter5937086832862612895.jar
/x1/jenkins/jenkins-slave/workspace/HBase-TRUNK-on-Hadoop-2.0.0/trunk/hbase-server/target/surefire/surefire3619429510722586002tmp
/x1/jenkins/jenkins-slave/workspace/HBase-TRUNK-on-Hadoop-2.0.0/trunk/hbase-server/target/surefire/surefire_1178095189881657572436tmp
Running org.apache.hadoop.hbase.rest.TestVersionResource
Tests run: 7, Failures: 0, Errors: 0, Skipped: 0, Time elapsed: 9.587 sec
Forking command line: /bin/sh -c cd /x1/jenkins/jenkins-slave/workspace/HBase-TRUNK-on-Hadoop-2.0.0/trunk/hbase-server
&& /x1/jenkins/tools/java/jdk1.6.0_32-32/jre/bin/java -enableassertions -Xmx1900m
-Djava.security.egd=file:/dev/./urandom -jar /x1/jenkins/jenkins-slave/workspace/HBase-TRUNK-on-Hadoop-2.0.0/trunk/hbase-server/target/surefire/surefirebooter5698006910542716933.jar
/x1/jenkins/jenkins-slave/workspace/HBase-TRUNK-on-Hadoop-2.0.0/trunk/hbase-server/target/surefire/surefire2239544429574473429tmp
/x1/jenkins/jenkins-slave/workspace/HBase-TRUNK-on-Hadoop-2.0.0/trunk/hbase-server/target/surefire/surefire_1181960792020503930140tmp
Running org.apache.hadoop.hbase.rest.TestScannerResource
Tests run: 5, Failures: 0, Errors: 0, Skipped: 0, Time elapsed: 30.515 sec
Forking command line: /bin/sh -c cd /x1/jenkins/jenkins-slave/workspace/HBase-TRUNK-on-Hadoop-2.0.0/trunk/hbase-server
&& /x1/jenkins/tools/java/jdk1.6.0_32-32/jre/bin/java -enableassertions -Xmx1900m
-Djava.security.egd=file:/dev/./urandom -jar /x1/jenkins/jenkins-slave/workspace/HBase-TRUNK-on-Hadoop-2.0.0/trunk/hbase-server/target/surefire/surefirebooter7935679284985524364.jar
/x1/jenkins/jenkins-slave/workspace/HBase-TRUNK-on-Hadoop-2.0.0/trunk/hbase-server/target/surefire/surefire6520256651912964170tmp
/x1/jenkins/jenkins-slave/workspace/HBase-TRUNK-on-Hadoop-2.0.0/trunk/hbase-server/target/surefire/surefire_1197242816076564083682tmp
Running org.apache.hadoop.hbase.rest.TestStatusResource
Tests run: 2, Failures: 0, Errors: 0, Skipped: 0, Time elapsed: 8.996 sec
Forking command line: /bin/sh -c cd /x1/jenkins/jenkins-slave/workspace/HBase-TRUNK-on-Hadoop-2.0.0/trunk/hbase-server
&& /x1/jenkins/tools/java/jdk1.6.0_32-32/jre/bin/java -enableassertions -Xmx1900m
-Djava.security.egd=file:/dev/./urandom -jar /x1/jenkins/jenkins-slave/workspace/HBase-TRUNK-on-Hadoop-2.0.0/trunk/hbase-server/target/surefire/surefirebooter6349119511164547370.jar
/x1/jenkins/jenkins-slave/workspace/HBase-TRUNK-on-Hadoop-2.0.0/trunk/hbase-server/target/surefire/surefire5936223973852664799tmp
/x1/jenkins/jenkins-slave/workspace/HBase-TRUNK-on-Hadoop-2.0.0/trunk/hbase-server/target/surefire/surefire_120525549722144024075tmp
Running org.apache.hadoop.hbase.trace.TestHTraceHooks
Tests run: 1, Failures: 0, Errors: 0, Skipped: 0, Time elapsed: 9.421 sec
Forking command line: /bin/sh -c cd /x1/jenkins/jenkins-slave/workspace/HBase-TRUNK-on-Hadoop-2.0.0/trunk/hbase-server
&& /x1/jenkins/tools/java/jdk1.6.0_32-32/jre/bin/java -enableassertions -Xmx1900m
-Djava.security.egd=file:/dev/./urandom -jar /x1/jenkins/jenkins-slave/workspace/HBase-TRUNK-on-Hadoop-2.0.0/trunk/hbase-server/target/surefire/surefirebooter1441562280015800108.jar
/x1/jenkins/jenkins-slave/workspace/HBase-TRUNK-on-Hadoop-2.0.0/trunk/hbase-server/target/surefire/surefire1390378453421877456tmp
/x1/jenkins/jenkins-slave/workspace/HBase-TRUNK-on-Hadoop-2.0.0/trunk/hbase-server/target/surefire/surefire_1211066621422389499438tmp
Running org.apache.hadoop.hbase.rest.TestScannersWithFilters
Tests run: 10, Failures: 0, Errors: 0, Skipped: 0, Time elapsed: 14.617 sec
Forking command line: /bin/sh -c cd /x1/jenkins/jenkins-slave/workspace/HBase-TRUNK-on-Hadoop-2.0.0/trunk/hbase-server
&& /x1/jenkins/tools/java/jdk1.6.0_32-32/jre/bin/java -enableassertions -Xmx1900m
-Djava.security.egd=file:/dev/./urandom -jar /x1/jenkins/jenkins-slave/workspace/HBase-TRUNK-on-Hadoop-2.0.0/trunk/hbase-server/target/surefire/surefirebooter7512686671897535464.jar
/x1/jenkins/jenkins-slave/workspace/HBase-TRUNK-on-Hadoop-2.0.0/trunk/hbase-server/target/surefire/surefire2144067392384797458tmp
/x1/jenkins/jenkins-slave/workspace/HBase-TRUNK-on-Hadoop-2.0.0/trunk/hbase-server/target/surefire/surefire_1223940478981975609602tmp
Running org.apache.hadoop.hbase.io.hfile.TestHFileBlockIndex
Tests run: 10, Failures: 0, Errors: 0, Skipped: 0, Time elapsed: 8.334 sec
Forking command line: /bin/sh -c cd /x1/jenkins/jenkins-slave/workspace/HBase-TRUNK-on-Hadoop-2.0.0/trunk/hbase-server
&& /x1/jenkins/tools/java/jdk1.6.0_32-32/jre/bin/java -enableassertions -Xmx1900m
-Djava.security.egd=file:/dev/./urandom -jar /x1/jenkins/jenkins-slave/workspace/HBase-TRUNK-on-Hadoop-2.0.0/trunk/hbase-server/target/surefire/surefirebooter8344572277603828003.jar
/x1/jenkins/jenkins-slave/workspace/HBase-TRUNK-on-Hadoop-2.0.0/trunk/hbase-server/target/surefire/surefire7401442074311394051tmp
/x1/jenkins/jenkins-slave/workspace/HBase-TRUNK-on-Hadoop-2.0.0/trunk/hbase-server/target/surefire/surefire_123757465267769557230tmp
Running org.apache.hadoop.hbase.io.hfile.TestHFileSeek
Tests run: 1, Failures: 0, Errors: 0, Skipped: 0, Time elapsed: 4.932 sec
Forking command line: /bin/sh -c cd /x1/jenkins/jenkins-slave/workspace/HBase-TRUNK-on-Hadoop-2.0.0/trunk/hbase-server
&& /x1/jenkins/tools/java/jdk1.6.0_32-32/jre/bin/java -enableassertions -Xmx1900m
-Djava.security.egd=file:/dev/./urandom -jar /x1/jenkins/jenkins-slave/workspace/HBase-TRUNK-on-Hadoop-2.0.0/trunk/hbase-server/target/surefire/surefirebooter4447900748730757412.jar
/x1/jenkins/jenkins-slave/workspace/HBase-TRUNK-on-Hadoop-2.0.0/trunk/hbase-server/target/surefire/surefire8959273709642243580tmp
/x1/jenkins/jenkins-slave/workspace/HBase-TRUNK-on-Hadoop-2.0.0/trunk/hbase-server/target/surefire/surefire_1243041599452017928233tmp
Running org.apache.hadoop.hbase.io.hfile.TestHFilePerformance
Tests run: 1, Failures: 0, Errors: 0, Skipped: 0, Time elapsed: 4.645 sec
Forking command line: /bin/sh -c cd /x1/jenkins/jenkins-slave/workspace/HBase-TRUNK-on-Hadoop-2.0.0/trunk/hbase-server
&& /x1/jenkins/tools/java/jdk1.6.0_32-32/jre/bin/java -enableassertions -Xmx1900m
-Djava.security.egd=file:/dev/./urandom -jar /x1/jenkins/jenkins-slave/workspace/HBase-TRUNK-on-Hadoop-2.0.0/trunk/hbase-server/target/surefire/surefirebooter2598798745320552885.jar
/x1/jenkins/jenkins-slave/workspace/HBase-TRUNK-on-Hadoop-2.0.0/trunk/hbase-server/target/surefire/surefire3225385270496810626tmp
/x1/jenkins/jenkins-slave/workspace/HBase-TRUNK-on-Hadoop-2.0.0/trunk/hbase-server/target/surefire/surefire_1253811113138285498332tmp
Running org.apache.hadoop.hbase.io.hfile.TestCacheOnWrite
Tests run: 36, Failures: 0, Errors: 0, Skipped: 0, Time elapsed: 27.521 sec
Forking command line: /bin/sh -c cd /x1/jenkins/jenkins-slave/workspace/HBase-TRUNK-on-Hadoop-2.0.0/trunk/hbase-server
&& /x1/jenkins/tools/java/jdk1.6.0_32-32/jre/bin/java -enableassertions -Xmx1900m
-Djava.security.egd=file:/dev/./urandom -jar /x1/jenkins/jenkins-slave/workspace/HBase-TRUNK-on-Hadoop-2.0.0/trunk/hbase-server/target/surefire/surefirebooter4671992592322407557.jar
/x1/jenkins/jenkins-slave/workspace/HBase-TRUNK-on-Hadoop-2.0.0/trunk/hbase-server/target/surefire/surefire4971472905410500966tmp
/x1/jenkins/jenkins-slave/workspace/HBase-TRUNK-on-Hadoop-2.0.0/trunk/hbase-server/target/surefire/surefire_1265251662954514580471tmp
Running org.apache.hadoop.hbase.io.hfile.TestForceCacheImportantBlocks
Tests run: 4, Failures: 0, Errors: 0, Skipped: 0, Time elapsed: 36.873 sec
Forking command line: /bin/sh -c cd /x1/jenkins/jenkins-slave/workspace/HBase-TRUNK-on-Hadoop-2.0.0/trunk/hbase-server
&& /x1/jenkins/tools/java/jdk1.6.0_32-32/jre/bin/java -enableassertions -Xmx1900m
-Djava.security.egd=file:/dev/./urandom -jar /x1/jenkins/jenkins-slave/workspace/HBase-TRUNK-on-Hadoop-2.0.0/trunk/hbase-server/target/surefire/surefirebooter4032752250664360182.jar
/x1/jenkins/jenkins-slave/workspace/HBase-TRUNK-on-Hadoop-2.0.0/trunk/hbase-server/target/surefire/surefire1332844904802795441tmp
/x1/jenkins/jenkins-slave/workspace/HBase-TRUNK-on-Hadoop-2.0.0/trunk/hbase-server/target/surefire/surefire_1271138382354099339903tmp
Running org.apache.hadoop.hbase.io.hfile.TestHFileBlock
Tests run: 16, Failures: 0, Errors: 0, Skipped: 0, Time elapsed: 46.363 sec
Forking command line: /bin/sh -c cd /x1/jenkins/jenkins-slave/workspace/HBase-TRUNK-on-Hadoop-2.0.0/trunk/hbase-server
&& /x1/jenkins/tools/java/jdk1.6.0_32-32/jre/bin/java -enableassertions -Xmx1900m
-Djava.security.egd=file:/dev/./urandom -jar /x1/jenkins/jenkins-slave/workspace/HBase-TRUNK-on-Hadoop-2.0.0/trunk/hbase-server/target/surefire/surefirebooter7771494416353147945.jar
/x1/jenkins/jenkins-slave/workspace/HBase-TRUNK-on-Hadoop-2.0.0/trunk/hbase-server/target/surefire/surefire2298952037088545194tmp
/x1/jenkins/jenkins-slave/workspace/HBase-TRUNK-on-Hadoop-2.0.0/trunk/hbase-server/target/surefire/surefire_1286579141013340541758tmp
Running org.apache.hadoop.hbase.io.hfile.TestScannerSelectionUsingTTL
Tests run: 6, Failures: 0, Errors: 0, Skipped: 0, Time elapsed: 61.736 sec
Forking command line: /bin/sh -c cd /x1/jenkins/jenkins-slave/workspace/HBase-TRUNK-on-Hadoop-2.0.0/trunk/hbase-server
&& /x1/jenkins/tools/java/jdk1.6.0_32-32/jre/bin/java -enableassertions -Xmx1900m
-Djava.security.egd=file:/dev/./urandom -jar /x1/jenkins/jenkins-slave/workspace/HBase-TRUNK-on-Hadoop-2.0.0/trunk/hbase-server/target/surefire/surefirebooter1519544494901264208.jar
/x1/jenkins/jenkins-slave/workspace/HBase-TRUNK-on-Hadoop-2.0.0/trunk/hbase-server/target/surefire/surefire8272541324567463491tmp
/x1/jenkins/jenkins-slave/workspace/HBase-TRUNK-on-Hadoop-2.0.0/trunk/hbase-server/target/surefire/surefire_1291441872149811362920tmp
Running org.apache.hadoop.hbase.io.hfile.slab.TestSlabCache
Tests run: 7, Failures: 0, Errors: 0, Skipped: 0, Time elapsed: 16.435 sec
Forking command line: /bin/sh -c cd /x1/jenkins/jenkins-slave/workspace/HBase-TRUNK-on-Hadoop-2.0.0/trunk/hbase-server
&& /x1/jenkins/tools/java/jdk1.6.0_32-32/jre/bin/java -enableassertions -Xmx1900m
-Djava.security.egd=file:/dev/./urandom -jar /x1/jenkins/jenkins-slave/workspace/HBase-TRUNK-on-Hadoop-2.0.0/trunk/hbase-server/target/surefire/surefirebooter9094277732360717346.jar
/x1/jenkins/jenkins-slave/workspace/HBase-TRUNK-on-Hadoop-2.0.0/trunk/hbase-server/target/surefire/surefire6480108261162229779tmp
/x1/jenkins/jenkins-slave/workspace/HBase-TRUNK-on-Hadoop-2.0.0/trunk/hbase-server/target/surefire/surefire_130129892550390554776tmp
Running org.apache.hadoop.hbase.io.TestFileLink
Tests run: 3, Failures: 0, Errors: 0, Skipped: 0, Time elapsed: 13.945 sec
Forking command line: /bin/sh -c cd /x1/jenkins/jenkins-slave/workspace/HBase-TRUNK-on-Hadoop-2.0.0/trunk/hbase-server
&& /x1/jenkins/tools/java/jdk1.6.0_32-32/jre/bin/java -enableassertions -Xmx1900m
-Djava.security.egd=file:/dev/./urandom -jar /x1/jenkins/jenkins-slave/workspace/HBase-TRUNK-on-Hadoop-2.0.0/trunk/hbase-server/target/surefire/surefirebooter1041836858611559144.jar
/x1/jenkins/jenkins-slave/workspace/HBase-TRUNK-on-Hadoop-2.0.0/trunk/hbase-server/target/surefire/surefire4369061858773918552tmp
/x1/jenkins/jenkins-slave/workspace/HBase-TRUNK-on-Hadoop-2.0.0/trunk/hbase-server/target/surefire/surefire_1314084955083241080863tmp
Running org.apache.hadoop.hbase.io.hfile.slab.TestSingleSizeCache
Tests run: 5, Failures: 0, Errors: 0, Skipped: 0, Time elapsed: 32.351 sec
Forking command line: /bin/sh -c cd /x1/jenkins/jenkins-slave/workspace/HBase-TRUNK-on-Hadoop-2.0.0/trunk/hbase-server
&& /x1/jenkins/tools/java/jdk1.6.0_32-32/jre/bin/java -enableassertions -Xmx1900m
-Djava.security.egd=file:/dev/./urandom -jar /x1/jenkins/jenkins-slave/workspace/HBase-TRUNK-on-Hadoop-2.0.0/trunk/hbase-server/target/surefire/surefirebooter8232244716533660613.jar
/x1/jenkins/jenkins-slave/workspace/HBase-TRUNK-on-Hadoop-2.0.0/trunk/hbase-server/target/surefire/surefire4505172412756990698tmp
/x1/jenkins/jenkins-slave/workspace/HBase-TRUNK-on-Hadoop-2.0.0/trunk/hbase-server/target/surefire/surefire_1325849440413634452625tmp
Running org.apache.hadoop.hbase.io.encoding.TestEncodedSeekers
Tests run: 8, Failures: 0, Errors: 0, Skipped: 0, Time elapsed: 25.712 sec
Forking command line: /bin/sh -c cd /x1/jenkins/jenkins-slave/workspace/HBase-TRUNK-on-Hadoop-2.0.0/trunk/hbase-server
&& /x1/jenkins/tools/java/jdk1.6.0_32-32/jre/bin/java -enableassertions -Xmx1900m
-Djava.security.egd=file:/dev/./urandom -jar /x1/jenkins/jenkins-slave/workspace/HBase-TRUNK-on-Hadoop-2.0.0/trunk/hbase-server/target/surefire/surefirebooter1663974943487798330.jar
/x1/jenkins/jenkins-slave/workspace/HBase-TRUNK-on-Hadoop-2.0.0/trunk/hbase-server/target/surefire/surefire4047162936781051428tmp
/x1/jenkins/jenkins-slave/workspace/HBase-TRUNK-on-Hadoop-2.0.0/trunk/hbase-server/target/surefire/surefire_1335492191025964781020tmp
Running org.apache.hadoop.hbase.io.encoding.TestBufferedDataBlockEncoder
Tests run: 1, Failures: 0, Errors: 0, Skipped: 0, Time elapsed: 19.168 sec
Forking command line: /bin/sh -c cd /x1/jenkins/jenkins-slave/workspace/HBase-TRUNK-on-Hadoop-2.0.0/trunk/hbase-server
&& /x1/jenkins/tools/java/jdk1.6.0_32-32/jre/bin/java -enableassertions -Xmx1900m
-Djava.security.egd=file:/dev/./urandom -jar /x1/jenkins/jenkins-slave/workspace/HBase-TRUNK-on-Hadoop-2.0.0/trunk/hbase-server/target/surefire/surefirebooter638451141923314208.jar
/x1/jenkins/jenkins-slave/workspace/HBase-TRUNK-on-Hadoop-2.0.0/trunk/hbase-server/target/surefire/surefire5987457557808289563tmp
/x1/jenkins/jenkins-slave/workspace/HBase-TRUNK-on-Hadoop-2.0.0/trunk/hbase-server/target/surefire/surefire_1346289526884193087379tmp
Running org.apache.hadoop.hbase.replication.TestReplicationZookeeper
Tests run: 1, Failures: 0, Errors: 0, Skipped: 0, Time elapsed: 0.75 sec
Forking command line: /bin/sh -c cd /x1/jenkins/jenkins-slave/workspace/HBase-TRUNK-on-Hadoop-2.0.0/trunk/hbase-server
&& /x1/jenkins/tools/java/jdk1.6.0_32-32/jre/bin/java -enableassertions -Xmx1900m
-Djava.security.egd=file:/dev/./urandom -jar /x1/jenkins/jenkins-slave/workspace/HBase-TRUNK-on-Hadoop-2.0.0/trunk/hbase-server/target/surefire/surefirebooter4999641767938729209.jar
/x1/jenkins/jenkins-slave/workspace/HBase-TRUNK-on-Hadoop-2.0.0/trunk/hbase-server/target/surefire/surefire7151835805505628242tmp
/x1/jenkins/jenkins-slave/workspace/HBase-TRUNK-on-Hadoop-2.0.0/trunk/hbase-server/target/surefire/surefire_1356960475632615960944tmp
Running org.apache.hadoop.hbase.replication.regionserver.TestReplicationSink
Tests run: 5, Failures: 0, Errors: 0, Skipped: 0, Time elapsed: 11.952 sec
Forking command line: /bin/sh -c cd /x1/jenkins/jenkins-slave/workspace/HBase-TRUNK-on-Hadoop-2.0.0/trunk/hbase-server
&& /x1/jenkins/tools/java/jdk1.6.0_32-32/jre/bin/java -enableassertions -Xmx1900m
-Djava.security.egd=file:/dev/./urandom -jar /x1/jenkins/jenkins-slave/workspace/HBase-TRUNK-on-Hadoop-2.0.0/trunk/hbase-server/target/surefire/surefirebooter7037641938422641712.jar
/x1/jenkins/jenkins-slave/workspace/HBase-TRUNK-on-Hadoop-2.0.0/trunk/hbase-server/target/surefire/surefire2672921684983923038tmp
/x1/jenkins/jenkins-slave/workspace/HBase-TRUNK-on-Hadoop-2.0.0/trunk/hbase-server/target/surefire/surefire_136975140119592965744tmp
Running org.apache.hadoop.hbase.replication.regionserver.TestReplicationSourceManager
Tests run: 1, Failures: 0, Errors: 0, Skipped: 0, Time elapsed: 1.217 sec
Forking command line: /bin/sh -c cd /x1/jenkins/jenkins-slave/workspace/HBase-TRUNK-on-Hadoop-2.0.0/trunk/hbase-server
&& /x1/jenkins/tools/java/jdk1.6.0_32-32/jre/bin/java -enableassertions -Xmx1900m
-Djava.security.egd=file:/dev/./urandom -jar /x1/jenkins/jenkins-slave/workspace/HBase-TRUNK-on-Hadoop-2.0.0/trunk/hbase-server/target/surefire/surefirebooter5168407878510574107.jar
/x1/jenkins/jenkins-slave/workspace/HBase-TRUNK-on-Hadoop-2.0.0/trunk/hbase-server/target/surefire/surefire5383926259975853348tmp
/x1/jenkins/jenkins-slave/workspace/HBase-TRUNK-on-Hadoop-2.0.0/trunk/hbase-server/target/surefire/surefire_1371715172846859560402tmp
Running org.apache.hadoop.hbase.replication.TestReplicationSource
Tests run: 1, Failures: 0, Errors: 0, Skipped: 0, Time elapsed: 3.399 sec
Forking command line: /bin/sh -c cd /x1/jenkins/jenkins-slave/workspace/HBase-TRUNK-on-Hadoop-2.0.0/trunk/hbase-server
&& /x1/jenkins/tools/java/jdk1.6.0_32-32/jre/bin/java -enableassertions -Xmx1900m
-Djava.security.egd=file:/dev/./urandom -jar /x1/jenkins/jenkins-slave/workspace/HBase-TRUNK-on-Hadoop-2.0.0/trunk/hbase-server/target/surefire/surefirebooter5504415295752838820.jar
/x1/jenkins/jenkins-slave/workspace/HBase-TRUNK-on-Hadoop-2.0.0/trunk/hbase-server/target/surefire/surefire1405963108598614283tmp
/x1/jenkins/jenkins-slave/workspace/HBase-TRUNK-on-Hadoop-2.0.0/trunk/hbase-server/target/surefire/surefire_138699739858088148079tmp
Running org.apache.hadoop.hbase.util.TestFSTableDescriptors
Tests run: 11, Failures: 0, Errors: 0, Skipped: 0, Time elapsed: 1.245 sec
Forking command line: /bin/sh -c cd /x1/jenkins/jenkins-slave/workspace/HBase-TRUNK-on-Hadoop-2.0.0/trunk/hbase-server
&& /x1/jenkins/tools/java/jdk1.6.0_32-32/jre/bin/java -enableassertions -Xmx1900m
-Djava.security.egd=file:/dev/./urandom -jar /x1/jenkins/jenkins-slave/workspace/HBase-TRUNK-on-Hadoop-2.0.0/trunk/hbase-server/target/surefire/surefirebooter3448940408936777061.jar
/x1/jenkins/jenkins-slave/workspace/HBase-TRUNK-on-Hadoop-2.0.0/trunk/hbase-server/target/surefire/surefire2177684696142175462tmp
/x1/jenkins/jenkins-slave/workspace/HBase-TRUNK-on-Hadoop-2.0.0/trunk/hbase-server/target/surefire/surefire_1391335135741783357753tmp
Running org.apache.hadoop.hbase.io.encoding.TestLoadAndSwitchEncodeOnDisk
Tests run: 1, Failures: 0, Errors: 0, Skipped: 0, Time elapsed: 39.73 sec
Forking command line: /bin/sh -c cd /x1/jenkins/jenkins-slave/workspace/HBase-TRUNK-on-Hadoop-2.0.0/trunk/hbase-server
&& /x1/jenkins/tools/java/jdk1.6.0_32-32/jre/bin/java -enableassertions -Xmx1900m
-Djava.security.egd=file:/dev/./urandom -jar /x1/jenkins/jenkins-slave/workspace/HBase-TRUNK-on-Hadoop-2.0.0/trunk/hbase-server/target/surefire/surefirebooter8221641346091198357.jar
/x1/jenkins/jenkins-slave/workspace/HBase-TRUNK-on-Hadoop-2.0.0/trunk/hbase-server/target/surefire/surefire4897858721319208791tmp
/x1/jenkins/jenkins-slave/workspace/HBase-TRUNK-on-Hadoop-2.0.0/trunk/hbase-server/target/surefire/surefire_1404308662254211185296tmp
Running org.apache.hadoop.hbase.util.TestIdLock
Tests run: 1, Failures: 0, Errors: 0, Skipped: 0, Time elapsed: 15.286 sec
Forking command line: /bin/sh -c cd /x1/jenkins/jenkins-slave/workspace/HBase-TRUNK-on-Hadoop-2.0.0/trunk/hbase-server
&& /x1/jenkins/tools/java/jdk1.6.0_32-32/jre/bin/java -enableassertions -Xmx1900m
-Djava.security.egd=file:/dev/./urandom -jar /x1/jenkins/jenkins-slave/workspace/HBase-TRUNK-on-Hadoop-2.0.0/trunk/hbase-server/target/surefire/surefirebooter6108145456273601077.jar
/x1/jenkins/jenkins-slave/workspace/HBase-TRUNK-on-Hadoop-2.0.0/trunk/hbase-server/target/surefire/surefire2936293165112084553tmp
/x1/jenkins/jenkins-slave/workspace/HBase-TRUNK-on-Hadoop-2.0.0/trunk/hbase-server/target/surefire/surefire_1412172035533743550823tmp
Running org.apache.hadoop.hbase.util.TestFSUtils
Tests run: 5, Failures: 0, Errors: 0, Skipped: 0, Time elapsed: 8.518 sec
Forking command line: /bin/sh -c cd /x1/jenkins/jenkins-slave/workspace/HBase-TRUNK-on-Hadoop-2.0.0/trunk/hbase-server
&& /x1/jenkins/tools/java/jdk1.6.0_32-32/jre/bin/java -enableassertions -Xmx1900m
-Djava.security.egd=file:/dev/./urandom -jar /x1/jenkins/jenkins-slave/workspace/HBase-TRUNK-on-Hadoop-2.0.0/trunk/hbase-server/target/surefire/surefirebooter5867312198869753006.jar
/x1/jenkins/jenkins-slave/workspace/HBase-TRUNK-on-Hadoop-2.0.0/trunk/hbase-server/target/surefire/surefire2514015888116576739tmp
/x1/jenkins/jenkins-slave/workspace/HBase-TRUNK-on-Hadoop-2.0.0/trunk/hbase-server/target/surefire/surefire_1424530363928398379219tmp
Running org.apache.hadoop.hbase.util.TestMergeTable
Tests run: 1, Failures: 0, Errors: 0, Skipped: 0, Time elapsed: 18.176 sec
Forking command line: /bin/sh -c cd /x1/jenkins/jenkins-slave/workspace/HBase-TRUNK-on-Hadoop-2.0.0/trunk/hbase-server
&& /x1/jenkins/tools/java/jdk1.6.0_32-32/jre/bin/java -enableassertions -Xmx1900m
-Djava.security.egd=file:/dev/./urandom -jar /x1/jenkins/jenkins-slave/workspace/HBase-TRUNK-on-Hadoop-2.0.0/trunk/hbase-server/target/surefire/surefirebooter9132861058236176097.jar
/x1/jenkins/jenkins-slave/workspace/HBase-TRUNK-on-Hadoop-2.0.0/trunk/hbase-server/target/surefire/surefire3425864775525883397tmp
/x1/jenkins/jenkins-slave/workspace/HBase-TRUNK-on-Hadoop-2.0.0/trunk/hbase-server/target/surefire/surefire_1435585383345421003505tmp
Running org.apache.hadoop.hbase.util.TestProcessBasedCluster
Tests run: 1, Failures: 0, Errors: 0, Skipped: 0, Time elapsed: 0.389 sec
Forking command line: /bin/sh -c cd /x1/jenkins/jenkins-slave/workspace/HBase-TRUNK-on-Hadoop-2.0.0/trunk/hbase-server
&& /x1/jenkins/tools/java/jdk1.6.0_32-32/jre/bin/java -enableassertions -Xmx1900m
-Djava.security.egd=file:/dev/./urandom -jar /x1/jenkins/jenkins-slave/workspace/HBase-TRUNK-on-Hadoop-2.0.0/trunk/hbase-server/target/surefire/surefirebooter6870130771063442564.jar
/x1/jenkins/jenkins-slave/workspace/HBase-TRUNK-on-Hadoop-2.0.0/trunk/hbase-server/target/surefire/surefire3490515579829966784tmp
/x1/jenkins/jenkins-slave/workspace/HBase-TRUNK-on-Hadoop-2.0.0/trunk/hbase-server/target/surefire/surefire_144783725767660503987tmp
Running org.apache.hadoop.hbase.util.TestRegionSplitter
Tests run: 5, Failures: 0, Errors: 0, Skipped: 0, Time elapsed: 11.476 sec
Forking command line: /bin/sh -c cd /x1/jenkins/jenkins-slave/workspace/HBase-TRUNK-on-Hadoop-2.0.0/trunk/hbase-server
&& /x1/jenkins/tools/java/jdk1.6.0_32-32/jre/bin/java -enableassertions -Xmx1900m
-Djava.security.egd=file:/dev/./urandom -jar /x1/jenkins/jenkins-slave/workspace/HBase-TRUNK-on-Hadoop-2.0.0/trunk/hbase-server/target/surefire/surefirebooter7524602264277233641.jar
/x1/jenkins/jenkins-slave/workspace/HBase-TRUNK-on-Hadoop-2.0.0/trunk/hbase-server/target/surefire/surefire239347676327774976tmp
/x1/jenkins/jenkins-slave/workspace/HBase-TRUNK-on-Hadoop-2.0.0/trunk/hbase-server/target/surefire/surefire_1452162857146709539584tmp
Running org.apache.hadoop.hbase.util.TestCoprocessorScanPolicy
Tests run: 2, Failures: 0, Errors: 0, Skipped: 0, Time elapsed: 10.461 sec
Forking command line: /bin/sh -c cd /x1/jenkins/jenkins-slave/workspace/HBase-TRUNK-on-Hadoop-2.0.0/trunk/hbase-server
&& /x1/jenkins/tools/java/jdk1.6.0_32-32/jre/bin/java -enableassertions -Xmx1900m
-Djava.security.egd=file:/dev/./urandom -jar /x1/jenkins/jenkins-slave/workspace/HBase-TRUNK-on-Hadoop-2.0.0/trunk/hbase-server/target/surefire/surefirebooter8106577107228015584.jar
/x1/jenkins/jenkins-slave/workspace/HBase-TRUNK-on-Hadoop-2.0.0/trunk/hbase-server/target/surefire/surefire6233022851743986637tmp
/x1/jenkins/jenkins-slave/workspace/HBase-TRUNK-on-Hadoop-2.0.0/trunk/hbase-server/target/surefire/surefire_1463107860840719481034tmp
Running org.apache.hadoop.hbase.util.hbck.TestOfflineMetaRebuildBase
Tests run: 1, Failures: 0, Errors: 0, Skipped: 0, Time elapsed: 20.113 sec
Forking command line: /bin/sh -c cd /x1/jenkins/jenkins-slave/workspace/HBase-TRUNK-on-Hadoop-2.0.0/trunk/hbase-server
&& /x1/jenkins/tools/java/jdk1.6.0_32-32/jre/bin/java -enableassertions -Xmx1900m
-Djava.security.egd=file:/dev/./urandom -jar /x1/jenkins/jenkins-slave/workspace/HBase-TRUNK-on-Hadoop-2.0.0/trunk/hbase-server/target/surefire/surefirebooter3602420566114974933.jar
/x1/jenkins/jenkins-slave/workspace/HBase-TRUNK-on-Hadoop-2.0.0/trunk/hbase-server/target/surefire/surefire7115873008749408154tmp
/x1/jenkins/jenkins-slave/workspace/HBase-TRUNK-on-Hadoop-2.0.0/trunk/hbase-server/target/surefire/surefire_1476007059058692836461tmp
Running org.apache.hadoop.hbase.util.hbck.TestOfflineMetaRebuildOverlap
Tests run: 1, Failures: 0, Errors: 0, Skipped: 0, Time elapsed: 19.357 sec
Forking command line: /bin/sh -c cd /x1/jenkins/jenkins-slave/workspace/HBase-TRUNK-on-Hadoop-2.0.0/trunk/hbase-server
&& /x1/jenkins/tools/java/jdk1.6.0_32-32/jre/bin/java -enableassertions -Xmx1900m
-Djava.security.egd=file:/dev/./urandom -jar /x1/jenkins/jenkins-slave/workspace/HBase-TRUNK-on-Hadoop-2.0.0/trunk/hbase-server/target/surefire/surefirebooter8625366622255059386.jar
/x1/jenkins/jenkins-slave/workspace/HBase-TRUNK-on-Hadoop-2.0.0/trunk/hbase-server/target/surefire/surefire4470453000635276417tmp
/x1/jenkins/jenkins-slave/workspace/HBase-TRUNK-on-Hadoop-2.0.0/trunk/hbase-server/target/surefire/surefire_1486304574022603433693tmp
Running org.apache.hadoop.hbase.util.TestDefaultEnvironmentEdge
Tests run: 1, Failures: 0, Errors: 0, Skipped: 0, Time elapsed: 0.179 sec
Forking command line: /bin/sh -c cd /x1/jenkins/jenkins-slave/workspace/HBase-TRUNK-on-Hadoop-2.0.0/trunk/hbase-server
&& /x1/jenkins/tools/java/jdk1.6.0_32-32/jre/bin/java -enableassertions -Xmx1900m
-Djava.security.egd=file:/dev/./urandom -jar /x1/jenkins/jenkins-slave/workspace/HBase-TRUNK-on-Hadoop-2.0.0/trunk/hbase-server/target/surefire/surefirebooter4267777008501383891.jar
/x1/jenkins/jenkins-slave/workspace/HBase-TRUNK-on-Hadoop-2.0.0/trunk/hbase-server/target/surefire/surefire3811038328788261269tmp
/x1/jenkins/jenkins-slave/workspace/HBase-TRUNK-on-Hadoop-2.0.0/trunk/hbase-server/target/surefire/surefire_1496830702419135747591tmp
Running org.apache.hadoop.hbase.TestInfoServers
Tests run: 3, Failures: 0, Errors: 0, Skipped: 0, Time elapsed: 8.504 sec
Running org.apache.hadoop.hbase.util.hbck.TestOfflineMetaRebuildHole
Tests run: 1, Failures: 0, Errors: 0, Skipped: 0, Time elapsed: 18.742 sec

Results :

Failed tests:   testSimpleCase(org.apache.hadoop.hbase.mapreduce.TestImportExport)

Tests in error: 
  org.apache.hadoop.hbase.catalog.TestMetaMigrationConvertingToPB: Failed put; errcode=1

Tests run: 724, Failures: 1, Errors: 1, Skipped: 2

[INFO]                                                                         
[INFO] ------------------------------------------------------------------------
[INFO] Skipping HBase
[INFO] This project has been banned from the build due to previous failures.
[INFO] ------------------------------------------------------------------------
[INFO] ------------------------------------------------------------------------
[INFO] Reactor Summary:
[INFO] 
[INFO] HBase ............................................. SUCCESS [2.972s]
[INFO] HBase - Common .................................... SUCCESS [11.892s]
[INFO] HBase - Hadoop Compatibility ...................... SUCCESS [0.524s]
[INFO] HBase - Hadoop Two Compatibility .................. SUCCESS [1.675s]
[INFO] HBase - Server .................................... FAILURE [26:04.366s]
[INFO] HBase - Hadoop One Compatibility .................. SKIPPED
[INFO] HBase - Integration Tests ......................... SKIPPED
[INFO] HBase - Examples .................................. SKIPPED
[INFO] ------------------------------------------------------------------------
[INFO] BUILD FAILURE
[INFO] ------------------------------------------------------------------------
[INFO] Total time: 26:24.250s
[INFO] Finished at: Tue Nov 06 23:43:56 UTC 2012
[INFO] Final Memory: 50M/502M
[INFO] ------------------------------------------------------------------------
[ERROR] Failed to execute goal org.apache.maven.plugins:maven-surefire-plugin:2.12-TRUNK-HBASE-2:test
(secondPartTestsExecution) on project hbase-server: There are test failures.
[ERROR] 
[ERROR] Please refer to /x1/jenkins/jenkins-slave/workspace/HBase-TRUNK-on-Hadoop-2.0.0/trunk/hbase-server/target/surefire-reports
for the individual test results.
[ERROR] -> [Help 1]
org.apache.maven.lifecycle.LifecycleExecutionException: Failed to execute goal org.apache.maven.plugins:maven-surefire-plugin:2.12-TRUNK-HBASE-2:test
(secondPartTestsExecution) on project hbase-server: There are test failures.

Please refer to /x1/jenkins/jenkins-slave/workspace/HBase-TRUNK-on-Hadoop-2.0.0/trunk/hbase-server/target/surefire-reports
for the individual test results.
	at org.apache.maven.lifecycle.internal.MojoExecutor.execute(MojoExecutor.java:213)
	at org.apache.maven.lifecycle.internal.MojoExecutor.execute(MojoExecutor.java:153)
	at org.apache.maven.lifecycle.internal.MojoExecutor.execute(MojoExecutor.java:145)
	at org.apache.maven.lifecycle.internal.LifecycleModuleBuilder.buildProject(LifecycleModuleBuilder.java:84)
	at org.apache.maven.lifecycle.internal.LifecycleModuleBuilder.buildProject(LifecycleModuleBuilder.java:59)
	at org.apache.maven.lifecycle.internal.LifecycleStarter.singleThreadedBuild(LifecycleStarter.java:183)
	at org.apache.maven.lifecycle.internal.LifecycleStarter.execute(LifecycleStarter.java:161)
	at org.apache.maven.DefaultMaven.doExecute(DefaultMaven.java:319)
	at org.apache.maven.DefaultMaven.execute(DefaultMaven.java:156)
	at org.apache.maven.cli.MavenCli.execute(MavenCli.java:537)
	at org.apache.maven.cli.MavenCli.doMain(MavenCli.java:196)
	at org.apache.maven.cli.MavenCli.main(MavenCli.java:141)
	at sun.reflect.NativeMethodAccessorImpl.invoke0(Native Method)
	at sun.reflect.NativeMethodAccessorImpl.invoke(NativeMethodAccessorImpl.java:39)
	at sun.reflect.DelegatingMethodAccessorImpl.invoke(DelegatingMethodAccessorImpl.java:25)
	at java.lang.reflect.Method.invoke(Method.java:597)
	at org.codehaus.plexus.classworlds.launcher.Launcher.launchEnhanced(Launcher.java:290)
	at org.codehaus.plexus.classworlds.launcher.Launcher.launch(Launcher.java:230)
	at org.codehaus.plexus.classworlds.launcher.Launcher.mainWithExitCode(Launcher.java:409)
	at org.codehaus.plexus.classworlds.launcher.Launcher.main(Launcher.java:352)
Caused by: org.apache.maven.plugin.MojoFailureException: There are test failures.

Please refer to /x1/jenkins/jenkins-slave/workspace/HBase-TRUNK-on-Hadoop-2.0.0/trunk/hbase-server/target/surefire-reports
for the individual test results.
	at org.apache.maven.plugin.surefire.SurefireHelper.reportExecution(SurefireHelper.java:87)
	at org.apache.maven.plugin.surefire.SurefirePlugin.writeSummary(SurefirePlugin.java:651)
	at org.apache.maven.plugin.surefire.SurefirePlugin.handleSummary(SurefirePlugin.java:625)
	at org.apache.maven.plugin.surefire.AbstractSurefireMojo.executeAfterPreconditionsChecked(AbstractSurefireMojo.java:137)
	at org.apache.maven.plugin.surefire.AbstractSurefireMojo.execute(AbstractSurefireMojo.java:98)
	at org.apache.maven.plugin.DefaultBuildPluginManager.executeMojo(DefaultBuildPluginManager.java:101)
	at org.apache.maven.lifecycle.internal.MojoExecutor.execute(MojoExecutor.java:209)
	... 19 more
[ERROR] 
[ERROR] 
[ERROR] For more information about the errors and possible solutions, please read the following
articles:
[ERROR] [Help 1] http://cwiki.apache.org/confluence/display/MAVEN/MojoFailureException
[ERROR] 
[ERROR] After correcting the problems, you can resume the build with the command
[ERROR]   mvn <goals> -rf :hbase-server
Build step 'Invoke top-level Maven targets' marked build as failure
Archiving artifacts
Recording test results
Updating HBASE-6793
Updating HBASE-6991

Mime
View raw message