hbase-dev mailing list archives

Site index · List index
Message view « Date » · « Thread »
Top « Date » · « Thread »
From Apache Jenkins Server <jenk...@builds.apache.org>
Subject Build failed in Jenkins: HBase-TRUNK-on-Hadoop-2.0.0 #269
Date Thu, 22 Nov 2012 00:33:00 GMT
See <https://builds.apache.org/job/HBase-TRUNK-on-Hadoop-2.0.0/269/changes>

Changes:

[tedyu] HBASE-6787 Convert RowProcessorProtocol to protocol buffer service (Devaraj)

[stack] HBASE-7109 integration tests on cluster are not getting picked up from distribution

[tedyu] HBASE-7202 Family Store Files are not archived on admin.deleteColumn() (Matteo)

[nkeywal] HBASE-7146 Fix the wrong reference to getReader that survived in the FSHLog javadoc
(Gustavo Anatoly)

------------------------------------------
[...truncated 14199 lines...]
location: class org.apache.hadoop.hbase.coprocessor.TestRowProcessorEndpoint.RowProcessorEndpoint<S,T>
[ERROR] <https://builds.apache.org/job/HBase-TRUNK-on-Hadoop-2.0.0/ws/trunk/hbase-server/src/test/java/org/apache/hadoop/hbase/coprocessor/TestRowProcessorEndpoint.java>:[489,13]
cannot find symbol
symbol  : class RowSwapProcessorResponse
location: class org.apache.hadoop.hbase.coprocessor.TestRowProcessorEndpoint.RowProcessorEndpoint.RowSwapProcessor
[ERROR] <https://builds.apache.org/job/HBase-TRUNK-on-Hadoop-2.0.0/ws/trunk/hbase-server/src/test/java/org/apache/hadoop/hbase/coprocessor/TestRowProcessorEndpoint.java>:[545,13]
cannot find symbol
symbol  : class RowSwapProcessorRequest
location: class org.apache.hadoop.hbase.coprocessor.TestRowProcessorEndpoint.RowProcessorEndpoint.RowSwapProcessor
[ERROR] <https://builds.apache.org/job/HBase-TRUNK-on-Hadoop-2.0.0/ws/trunk/hbase-server/src/test/java/org/apache/hadoop/hbase/coprocessor/TestRowProcessorEndpoint.java>:[553,29]
cannot find symbol
symbol  : class RowSwapProcessorRequest
location: class org.apache.hadoop.hbase.coprocessor.TestRowProcessorEndpoint.RowProcessorEndpoint.RowSwapProcessor
[ERROR] <https://builds.apache.org/job/HBase-TRUNK-on-Hadoop-2.0.0/ws/trunk/hbase-server/src/test/java/org/apache/hadoop/hbase/coprocessor/TestRowProcessorEndpoint.java>:[560,25]
cannot find symbol
symbol  : class TimeoutProcessorRequest
location: class org.apache.hadoop.hbase.coprocessor.TestRowProcessorEndpoint.RowProcessorEndpoint<S,T>
[ERROR] <https://builds.apache.org/job/HBase-TRUNK-on-Hadoop-2.0.0/ws/trunk/hbase-server/src/test/java/org/apache/hadoop/hbase/coprocessor/TestRowProcessorEndpoint.java>:[560,50]
cannot find symbol
symbol  : class TimeoutProcessorResponse
location: class org.apache.hadoop.hbase.coprocessor.TestRowProcessorEndpoint.RowProcessorEndpoint<S,T>
[ERROR] <https://builds.apache.org/job/HBase-TRUNK-on-Hadoop-2.0.0/ws/trunk/hbase-server/src/test/java/org/apache/hadoop/hbase/coprocessor/TestRowProcessorEndpoint.java>:[579,13]
cannot find symbol
symbol  : class TimeoutProcessorResponse
location: class org.apache.hadoop.hbase.coprocessor.TestRowProcessorEndpoint.RowProcessorEndpoint.TimeoutProcessor
[ERROR] <https://builds.apache.org/job/HBase-TRUNK-on-Hadoop-2.0.0/ws/trunk/hbase-server/src/test/java/org/apache/hadoop/hbase/coprocessor/TestRowProcessorEndpoint.java>:[605,13]
cannot find symbol
symbol  : class TimeoutProcessorRequest
location: class org.apache.hadoop.hbase.coprocessor.TestRowProcessorEndpoint.RowProcessorEndpoint.TimeoutProcessor
[ERROR] <https://builds.apache.org/job/HBase-TRUNK-on-Hadoop-2.0.0/ws/trunk/hbase-server/src/test/java/org/apache/hadoop/hbase/coprocessor/TestRowProcessorEndpoint.java>:[612,29]
cannot find symbol
symbol  : class TimeoutProcessorRequest
location: class org.apache.hadoop.hbase.coprocessor.TestRowProcessorEndpoint.RowProcessorEndpoint.TimeoutProcessor
[ERROR] <https://builds.apache.org/job/HBase-TRUNK-on-Hadoop-2.0.0/ws/trunk/hbase-server/src/test/java/org/apache/hadoop/hbase/coprocessor/TestRowProcessorEndpoint.java>:[159,4]
cannot find symbol
symbol  : class FriendsOfFriendsProcessorResponse
location: class org.apache.hadoop.hbase.coprocessor.TestRowProcessorEndpoint
[ERROR] <https://builds.apache.org/job/HBase-TRUNK-on-Hadoop-2.0.0/ws/trunk/hbase-server/src/test/java/org/apache/hadoop/hbase/coprocessor/TestRowProcessorEndpoint.java>:[160,8]
cannot find symbol
symbol  : variable FriendsOfFriendsProcessorResponse
location: class org.apache.hadoop.hbase.coprocessor.TestRowProcessorEndpoint
[ERROR] <https://builds.apache.org/job/HBase-TRUNK-on-Hadoop-2.0.0/ws/trunk/hbase-server/src/test/java/org/apache/hadoop/hbase/coprocessor/TestRowProcessorEndpoint.java>:[202,4]
cannot find symbol
symbol  : class IncCounterProcessorResponse
location: class org.apache.hadoop.hbase.coprocessor.TestRowProcessorEndpoint
[ERROR] <https://builds.apache.org/job/HBase-TRUNK-on-Hadoop-2.0.0/ws/trunk/hbase-server/src/test/java/org/apache/hadoop/hbase/coprocessor/TestRowProcessorEndpoint.java>:[202,43]
cannot find symbol
symbol  : variable IncCounterProcessorResponse
location: class org.apache.hadoop.hbase.coprocessor.TestRowProcessorEndpoint
[ERROR] <https://builds.apache.org/job/HBase-TRUNK-on-Hadoop-2.0.0/ws/trunk/hbase-server/src/test/java/org/apache/hadoop/hbase/coprocessor/TestRowProcessorEndpoint.java>:[317,35]
package IncCounterProcessorResponse does not exist
[ERROR] <https://builds.apache.org/job/HBase-TRUNK-on-Hadoop-2.0.0/ws/trunk/hbase-server/src/test/java/org/apache/hadoop/hbase/coprocessor/TestRowProcessorEndpoint.java>:[317,48]
cannot find symbol
symbol  : variable IncCounterProcessorResponse
location: class org.apache.hadoop.hbase.coprocessor.TestRowProcessorEndpoint.RowProcessorEndpoint.IncrementCounterProcessor
[ERROR] <https://builds.apache.org/job/HBase-TRUNK-on-Hadoop-2.0.0/ws/trunk/hbase-server/src/test/java/org/apache/hadoop/hbase/coprocessor/TestRowProcessorEndpoint.java>:[361,34]
package IncCounterProcessorRequest does not exist
[ERROR] <https://builds.apache.org/job/HBase-TRUNK-on-Hadoop-2.0.0/ws/trunk/hbase-server/src/test/java/org/apache/hadoop/hbase/coprocessor/TestRowProcessorEndpoint.java>:[361,53]
cannot find symbol
symbol  : variable IncCounterProcessorRequest
location: class org.apache.hadoop.hbase.coprocessor.TestRowProcessorEndpoint.RowProcessorEndpoint.IncrementCounterProcessor
[ERROR] <https://builds.apache.org/job/HBase-TRUNK-on-Hadoop-2.0.0/ws/trunk/hbase-server/src/test/java/org/apache/hadoop/hbase/coprocessor/TestRowProcessorEndpoint.java>:[398,41]
package FriendsOfFriendsProcessorResponse does not exist
[ERROR] <https://builds.apache.org/job/HBase-TRUNK-on-Hadoop-2.0.0/ws/trunk/hbase-server/src/test/java/org/apache/hadoop/hbase/coprocessor/TestRowProcessorEndpoint.java>:[399,12]
cannot find symbol
symbol  : variable FriendsOfFriendsProcessorResponse
location: class org.apache.hadoop.hbase.coprocessor.TestRowProcessorEndpoint.RowProcessorEndpoint.FriendsOfFriendsProcessor
[ERROR] <https://builds.apache.org/job/HBase-TRUNK-on-Hadoop-2.0.0/ws/trunk/hbase-server/src/test/java/org/apache/hadoop/hbase/coprocessor/TestRowProcessorEndpoint.java>:[440,40]
package FriendsOfFriendsProcessorRequest does not exist
[ERROR] <https://builds.apache.org/job/HBase-TRUNK-on-Hadoop-2.0.0/ws/trunk/hbase-server/src/test/java/org/apache/hadoop/hbase/coprocessor/TestRowProcessorEndpoint.java>:[441,12]
cannot find symbol
symbol  : variable FriendsOfFriendsProcessorRequest
location: class org.apache.hadoop.hbase.coprocessor.TestRowProcessorEndpoint.RowProcessorEndpoint.FriendsOfFriendsProcessor
[ERROR] <https://builds.apache.org/job/HBase-TRUNK-on-Hadoop-2.0.0/ws/trunk/hbase-server/src/test/java/org/apache/hadoop/hbase/coprocessor/TestRowProcessorEndpoint.java>:[445,8]
cannot find symbol
symbol  : class FriendsOfFriendsProcessorRequest
location: class org.apache.hadoop.hbase.coprocessor.TestRowProcessorEndpoint.RowProcessorEndpoint.FriendsOfFriendsProcessor
[ERROR] <https://builds.apache.org/job/HBase-TRUNK-on-Hadoop-2.0.0/ws/trunk/hbase-server/src/test/java/org/apache/hadoop/hbase/coprocessor/TestRowProcessorEndpoint.java>:[490,15]
cannot find symbol
symbol  : variable RowSwapProcessorResponse
location: class org.apache.hadoop.hbase.coprocessor.TestRowProcessorEndpoint.RowProcessorEndpoint.RowSwapProcessor
[ERROR] <https://builds.apache.org/job/HBase-TRUNK-on-Hadoop-2.0.0/ws/trunk/hbase-server/src/test/java/org/apache/hadoop/hbase/coprocessor/TestRowProcessorEndpoint.java>:[546,31]
package RowSwapProcessorRequest does not exist
[ERROR] <https://builds.apache.org/job/HBase-TRUNK-on-Hadoop-2.0.0/ws/trunk/hbase-server/src/test/java/org/apache/hadoop/hbase/coprocessor/TestRowProcessorEndpoint.java>:[546,50]
cannot find symbol
symbol  : variable RowSwapProcessorRequest
location: class org.apache.hadoop.hbase.coprocessor.TestRowProcessorEndpoint.RowProcessorEndpoint.RowSwapProcessor
[ERROR] <https://builds.apache.org/job/HBase-TRUNK-on-Hadoop-2.0.0/ws/trunk/hbase-server/src/test/java/org/apache/hadoop/hbase/coprocessor/TestRowProcessorEndpoint.java>:[580,15]
cannot find symbol
symbol  : variable TimeoutProcessorResponse
location: class org.apache.hadoop.hbase.coprocessor.TestRowProcessorEndpoint.RowProcessorEndpoint.TimeoutProcessor
[ERROR] <https://builds.apache.org/job/HBase-TRUNK-on-Hadoop-2.0.0/ws/trunk/hbase-server/src/test/java/org/apache/hadoop/hbase/coprocessor/TestRowProcessorEndpoint.java>:[606,31]
package TimeoutProcessorRequest does not exist
[ERROR] <https://builds.apache.org/job/HBase-TRUNK-on-Hadoop-2.0.0/ws/trunk/hbase-server/src/test/java/org/apache/hadoop/hbase/coprocessor/TestRowProcessorEndpoint.java>:[606,50]
cannot find symbol
symbol  : variable TimeoutProcessorRequest
location: class org.apache.hadoop.hbase.coprocessor.TestRowProcessorEndpoint.RowProcessorEndpoint.TimeoutProcessor
[INFO] 48 errors 
[INFO] -------------------------------------------------------------
[INFO]                                                                         
[INFO] ------------------------------------------------------------------------
[INFO] Skipping HBase
[INFO] This project has been banned from the build due to previous failures.
[INFO] ------------------------------------------------------------------------
[INFO] ------------------------------------------------------------------------
[INFO] Reactor Summary:
[INFO] 
[INFO] HBase ............................................. SUCCESS [6.859s]
[INFO] HBase - Common .................................... SUCCESS [16.735s]
[INFO] HBase - Protocol .................................. SUCCESS [13.349s]
[INFO] HBase - Hadoop Compatibility ...................... SUCCESS [0.572s]
[INFO] HBase - Hadoop Two Compatibility .................. SUCCESS [2.242s]
[INFO] HBase - Server .................................... FAILURE [12.701s]
[INFO] HBase - Hadoop One Compatibility .................. SKIPPED
[INFO] HBase - Integration Tests ......................... SKIPPED
[INFO] HBase - Examples .................................. SKIPPED
[INFO] ------------------------------------------------------------------------
[INFO] BUILD FAILURE
[INFO] ------------------------------------------------------------------------
[INFO] Total time: 55.578s
[INFO] Finished at: Thu Nov 22 00:32:58 UTC 2012
[INFO] Final Memory: 54M/620M
[INFO] ------------------------------------------------------------------------
[ERROR] Failed to execute goal org.apache.maven.plugins:maven-compiler-plugin:2.5.1:testCompile
(default-testCompile) on project hbase-server: Compilation failure: Compilation failure:
[ERROR] <https://builds.apache.org/job/HBase-TRUNK-on-Hadoop-2.0.0/ws/trunk/hbase-server/src/test/java/org/apache/hadoop/hbase/coprocessor/TestRowProcessorEndpoint.java>:[46,61]
package org.apache.hadoop.hbase.coprocessor.protobuf.generated does not exist
[ERROR] <https://builds.apache.org/job/HBase-TRUNK-on-Hadoop-2.0.0/ws/trunk/hbase-server/src/test/java/org/apache/hadoop/hbase/coprocessor/TestRowProcessorEndpoint.java>:[47,97]
package org.apache.hadoop.hbase.coprocessor.protobuf.generated.IncrementCounterProcessorTestProtos
does not exist
[ERROR] <https://builds.apache.org/job/HBase-TRUNK-on-Hadoop-2.0.0/ws/trunk/hbase-server/src/test/java/org/apache/hadoop/hbase/coprocessor/TestRowProcessorEndpoint.java>:[48,97]
package org.apache.hadoop.hbase.coprocessor.protobuf.generated.IncrementCounterProcessorTestProtos
does not exist
[ERROR] <https://builds.apache.org/job/HBase-TRUNK-on-Hadoop-2.0.0/ws/trunk/hbase-server/src/test/java/org/apache/hadoop/hbase/coprocessor/TestRowProcessorEndpoint.java>:[49,97]
package org.apache.hadoop.hbase.coprocessor.protobuf.generated.IncrementCounterProcessorTestProtos
does not exist
[ERROR] <https://builds.apache.org/job/HBase-TRUNK-on-Hadoop-2.0.0/ws/trunk/hbase-server/src/test/java/org/apache/hadoop/hbase/coprocessor/TestRowProcessorEndpoint.java>:[50,97]
package org.apache.hadoop.hbase.coprocessor.protobuf.generated.IncrementCounterProcessorTestProtos
does not exist
[ERROR] <https://builds.apache.org/job/HBase-TRUNK-on-Hadoop-2.0.0/ws/trunk/hbase-server/src/test/java/org/apache/hadoop/hbase/coprocessor/TestRowProcessorEndpoint.java>:[51,97]
package org.apache.hadoop.hbase.coprocessor.protobuf.generated.IncrementCounterProcessorTestProtos
does not exist
[ERROR] <https://builds.apache.org/job/HBase-TRUNK-on-Hadoop-2.0.0/ws/trunk/hbase-server/src/test/java/org/apache/hadoop/hbase/coprocessor/TestRowProcessorEndpoint.java>:[52,97]
package org.apache.hadoop.hbase.coprocessor.protobuf.generated.IncrementCounterProcessorTestProtos
does not exist
[ERROR] <https://builds.apache.org/job/HBase-TRUNK-on-Hadoop-2.0.0/ws/trunk/hbase-server/src/test/java/org/apache/hadoop/hbase/coprocessor/TestRowProcessorEndpoint.java>:[53,97]
package org.apache.hadoop.hbase.coprocessor.protobuf.generated.IncrementCounterProcessorTestProtos
does not exist
[ERROR] <https://builds.apache.org/job/HBase-TRUNK-on-Hadoop-2.0.0/ws/trunk/hbase-server/src/test/java/org/apache/hadoop/hbase/coprocessor/TestRowProcessorEndpoint.java>:[54,97]
package org.apache.hadoop.hbase.coprocessor.protobuf.generated.IncrementCounterProcessorTestProtos
does not exist
[ERROR] <https://builds.apache.org/job/HBase-TRUNK-on-Hadoop-2.0.0/ws/trunk/hbase-server/src/test/java/org/apache/hadoop/hbase/coprocessor/TestRowProcessorEndpoint.java>:[295,60]
package IncrementCounterProcessorTestProtos does not exist
[ERROR] <https://builds.apache.org/job/HBase-TRUNK-on-Hadoop-2.0.0/ws/trunk/hbase-server/src/test/java/org/apache/hadoop/hbase/coprocessor/TestRowProcessorEndpoint.java>:[296,43]
package IncrementCounterProcessorTestProtos does not exist
[ERROR] <https://builds.apache.org/job/HBase-TRUNK-on-Hadoop-2.0.0/ws/trunk/hbase-server/src/test/java/org/apache/hadoop/hbase/coprocessor/TestRowProcessorEndpoint.java>:[316,13]
cannot find symbol
[ERROR] symbol  : class IncCounterProcessorResponse
[ERROR] location: class org.apache.hadoop.hbase.coprocessor.TestRowProcessorEndpoint.RowProcessorEndpoint.IncrementCounterProcessor
[ERROR] <https://builds.apache.org/job/HBase-TRUNK-on-Hadoop-2.0.0/ws/trunk/hbase-server/src/test/java/org/apache/hadoop/hbase/coprocessor/TestRowProcessorEndpoint.java>:[360,13]
cannot find symbol
[ERROR] symbol  : class IncCounterProcessorRequest
[ERROR] location: class org.apache.hadoop.hbase.coprocessor.TestRowProcessorEndpoint.RowProcessorEndpoint.IncrementCounterProcessor
[ERROR] <https://builds.apache.org/job/HBase-TRUNK-on-Hadoop-2.0.0/ws/trunk/hbase-server/src/test/java/org/apache/hadoop/hbase/coprocessor/TestRowProcessorEndpoint.java>:[368,29]
cannot find symbol
[ERROR] symbol  : class IncCounterProcessorRequest
[ERROR] location: class org.apache.hadoop.hbase.coprocessor.TestRowProcessorEndpoint.RowProcessorEndpoint.IncrementCounterProcessor
[ERROR] <https://builds.apache.org/job/HBase-TRUNK-on-Hadoop-2.0.0/ws/trunk/hbase-server/src/test/java/org/apache/hadoop/hbase/coprocessor/TestRowProcessorEndpoint.java>:[375,25]
cannot find symbol
[ERROR] symbol  : class FriendsOfFriendsProcessorRequest
[ERROR] location: class org.apache.hadoop.hbase.coprocessor.TestRowProcessorEndpoint.RowProcessorEndpoint<S,T>
[ERROR] <https://builds.apache.org/job/HBase-TRUNK-on-Hadoop-2.0.0/ws/trunk/hbase-server/src/test/java/org/apache/hadoop/hbase/coprocessor/TestRowProcessorEndpoint.java>:[375,59]
cannot find symbol
[ERROR] symbol  : class FriendsOfFriendsProcessorResponse
[ERROR] location: class org.apache.hadoop.hbase.coprocessor.TestRowProcessorEndpoint.RowProcessorEndpoint<S,T>
[ERROR] <https://builds.apache.org/job/HBase-TRUNK-on-Hadoop-2.0.0/ws/trunk/hbase-server/src/test/java/org/apache/hadoop/hbase/coprocessor/TestRowProcessorEndpoint.java>:[397,13]
cannot find symbol
[ERROR] symbol  : class FriendsOfFriendsProcessorResponse
[ERROR] location: class org.apache.hadoop.hbase.coprocessor.TestRowProcessorEndpoint.RowProcessorEndpoint.FriendsOfFriendsProcessor
[ERROR] <https://builds.apache.org/job/HBase-TRUNK-on-Hadoop-2.0.0/ws/trunk/hbase-server/src/test/java/org/apache/hadoop/hbase/coprocessor/TestRowProcessorEndpoint.java>:[439,13]
cannot find symbol
[ERROR] symbol  : class FriendsOfFriendsProcessorRequest
[ERROR] location: class org.apache.hadoop.hbase.coprocessor.TestRowProcessorEndpoint.RowProcessorEndpoint.FriendsOfFriendsProcessor
[ERROR] <https://builds.apache.org/job/HBase-TRUNK-on-Hadoop-2.0.0/ws/trunk/hbase-server/src/test/java/org/apache/hadoop/hbase/coprocessor/TestRowProcessorEndpoint.java>:[450,29]
cannot find symbol
[ERROR] symbol  : class FriendsOfFriendsProcessorRequest
[ERROR] location: class org.apache.hadoop.hbase.coprocessor.TestRowProcessorEndpoint.RowProcessorEndpoint.FriendsOfFriendsProcessor
[ERROR] <https://builds.apache.org/job/HBase-TRUNK-on-Hadoop-2.0.0/ws/trunk/hbase-server/src/test/java/org/apache/hadoop/hbase/coprocessor/TestRowProcessorEndpoint.java>:[460,25]
cannot find symbol
[ERROR] symbol  : class RowSwapProcessorRequest
[ERROR] location: class org.apache.hadoop.hbase.coprocessor.TestRowProcessorEndpoint.RowProcessorEndpoint<S,T>
[ERROR] <https://builds.apache.org/job/HBase-TRUNK-on-Hadoop-2.0.0/ws/trunk/hbase-server/src/test/java/org/apache/hadoop/hbase/coprocessor/TestRowProcessorEndpoint.java>:[460,50]
cannot find symbol
[ERROR] symbol  : class RowSwapProcessorResponse
[ERROR] location: class org.apache.hadoop.hbase.coprocessor.TestRowProcessorEndpoint.RowProcessorEndpoint<S,T>
[ERROR] <https://builds.apache.org/job/HBase-TRUNK-on-Hadoop-2.0.0/ws/trunk/hbase-server/src/test/java/org/apache/hadoop/hbase/coprocessor/TestRowProcessorEndpoint.java>:[489,13]
cannot find symbol
[ERROR] symbol  : class RowSwapProcessorResponse
[ERROR] location: class org.apache.hadoop.hbase.coprocessor.TestRowProcessorEndpoint.RowProcessorEndpoint.RowSwapProcessor
[ERROR] <https://builds.apache.org/job/HBase-TRUNK-on-Hadoop-2.0.0/ws/trunk/hbase-server/src/test/java/org/apache/hadoop/hbase/coprocessor/TestRowProcessorEndpoint.java>:[545,13]
cannot find symbol
[ERROR] symbol  : class RowSwapProcessorRequest
[ERROR] location: class org.apache.hadoop.hbase.coprocessor.TestRowProcessorEndpoint.RowProcessorEndpoint.RowSwapProcessor
[ERROR] <https://builds.apache.org/job/HBase-TRUNK-on-Hadoop-2.0.0/ws/trunk/hbase-server/src/test/java/org/apache/hadoop/hbase/coprocessor/TestRowProcessorEndpoint.java>:[553,29]
cannot find symbol
[ERROR] symbol  : class RowSwapProcessorRequest
[ERROR] location: class org.apache.hadoop.hbase.coprocessor.TestRowProcessorEndpoint.RowProcessorEndpoint.RowSwapProcessor
[ERROR] <https://builds.apache.org/job/HBase-TRUNK-on-Hadoop-2.0.0/ws/trunk/hbase-server/src/test/java/org/apache/hadoop/hbase/coprocessor/TestRowProcessorEndpoint.java>:[560,25]
cannot find symbol
[ERROR] symbol  : class TimeoutProcessorRequest
[ERROR] location: class org.apache.hadoop.hbase.coprocessor.TestRowProcessorEndpoint.RowProcessorEndpoint<S,T>
[ERROR] <https://builds.apache.org/job/HBase-TRUNK-on-Hadoop-2.0.0/ws/trunk/hbase-server/src/test/java/org/apache/hadoop/hbase/coprocessor/TestRowProcessorEndpoint.java>:[560,50]
cannot find symbol
[ERROR] symbol  : class TimeoutProcessorResponse
[ERROR] location: class org.apache.hadoop.hbase.coprocessor.TestRowProcessorEndpoint.RowProcessorEndpoint<S,T>
[ERROR] <https://builds.apache.org/job/HBase-TRUNK-on-Hadoop-2.0.0/ws/trunk/hbase-server/src/test/java/org/apache/hadoop/hbase/coprocessor/TestRowProcessorEndpoint.java>:[579,13]
cannot find symbol
[ERROR] symbol  : class TimeoutProcessorResponse
[ERROR] location: class org.apache.hadoop.hbase.coprocessor.TestRowProcessorEndpoint.RowProcessorEndpoint.TimeoutProcessor
[ERROR] <https://builds.apache.org/job/HBase-TRUNK-on-Hadoop-2.0.0/ws/trunk/hbase-server/src/test/java/org/apache/hadoop/hbase/coprocessor/TestRowProcessorEndpoint.java>:[605,13]
cannot find symbol
[ERROR] symbol  : class TimeoutProcessorRequest
[ERROR] location: class org.apache.hadoop.hbase.coprocessor.TestRowProcessorEndpoint.RowProcessorEndpoint.TimeoutProcessor
[ERROR] <https://builds.apache.org/job/HBase-TRUNK-on-Hadoop-2.0.0/ws/trunk/hbase-server/src/test/java/org/apache/hadoop/hbase/coprocessor/TestRowProcessorEndpoint.java>:[612,29]
cannot find symbol
[ERROR] symbol  : class TimeoutProcessorRequest
[ERROR] location: class org.apache.hadoop.hbase.coprocessor.TestRowProcessorEndpoint.RowProcessorEndpoint.TimeoutProcessor
[ERROR] <https://builds.apache.org/job/HBase-TRUNK-on-Hadoop-2.0.0/ws/trunk/hbase-server/src/test/java/org/apache/hadoop/hbase/coprocessor/TestRowProcessorEndpoint.java>:[159,4]
cannot find symbol
[ERROR] symbol  : class FriendsOfFriendsProcessorResponse
[ERROR] location: class org.apache.hadoop.hbase.coprocessor.TestRowProcessorEndpoint
[ERROR] <https://builds.apache.org/job/HBase-TRUNK-on-Hadoop-2.0.0/ws/trunk/hbase-server/src/test/java/org/apache/hadoop/hbase/coprocessor/TestRowProcessorEndpoint.java>:[160,8]
cannot find symbol
[ERROR] symbol  : variable FriendsOfFriendsProcessorResponse
[ERROR] location: class org.apache.hadoop.hbase.coprocessor.TestRowProcessorEndpoint
[ERROR] <https://builds.apache.org/job/HBase-TRUNK-on-Hadoop-2.0.0/ws/trunk/hbase-server/src/test/java/org/apache/hadoop/hbase/coprocessor/TestRowProcessorEndpoint.java>:[202,4]
cannot find symbol
[ERROR] symbol  : class IncCounterProcessorResponse
[ERROR] location: class org.apache.hadoop.hbase.coprocessor.TestRowProcessorEndpoint
[ERROR] <https://builds.apache.org/job/HBase-TRUNK-on-Hadoop-2.0.0/ws/trunk/hbase-server/src/test/java/org/apache/hadoop/hbase/coprocessor/TestRowProcessorEndpoint.java>:[202,43]
cannot find symbol
[ERROR] symbol  : variable IncCounterProcessorResponse
[ERROR] location: class org.apache.hadoop.hbase.coprocessor.TestRowProcessorEndpoint
[ERROR] <https://builds.apache.org/job/HBase-TRUNK-on-Hadoop-2.0.0/ws/trunk/hbase-server/src/test/java/org/apache/hadoop/hbase/coprocessor/TestRowProcessorEndpoint.java>:[317,35]
package IncCounterProcessorResponse does not exist
[ERROR] <https://builds.apache.org/job/HBase-TRUNK-on-Hadoop-2.0.0/ws/trunk/hbase-server/src/test/java/org/apache/hadoop/hbase/coprocessor/TestRowProcessorEndpoint.java>:[317,48]
cannot find symbol
[ERROR] symbol  : variable IncCounterProcessorResponse
[ERROR] location: class org.apache.hadoop.hbase.coprocessor.TestRowProcessorEndpoint.RowProcessorEndpoint.IncrementCounterProcessor
[ERROR] <https://builds.apache.org/job/HBase-TRUNK-on-Hadoop-2.0.0/ws/trunk/hbase-server/src/test/java/org/apache/hadoop/hbase/coprocessor/TestRowProcessorEndpoint.java>:[361,34]
package IncCounterProcessorRequest does not exist
[ERROR] <https://builds.apache.org/job/HBase-TRUNK-on-Hadoop-2.0.0/ws/trunk/hbase-server/src/test/java/org/apache/hadoop/hbase/coprocessor/TestRowProcessorEndpoint.java>:[361,53]
cannot find symbol
[ERROR] symbol  : variable IncCounterProcessorRequest
[ERROR] location: class org.apache.hadoop.hbase.coprocessor.TestRowProcessorEndpoint.RowProcessorEndpoint.IncrementCounterProcessor
[ERROR] <https://builds.apache.org/job/HBase-TRUNK-on-Hadoop-2.0.0/ws/trunk/hbase-server/src/test/java/org/apache/hadoop/hbase/coprocessor/TestRowProcessorEndpoint.java>:[398,41]
package FriendsOfFriendsProcessorResponse does not exist
[ERROR] <https://builds.apache.org/job/HBase-TRUNK-on-Hadoop-2.0.0/ws/trunk/hbase-server/src/test/java/org/apache/hadoop/hbase/coprocessor/TestRowProcessorEndpoint.java>:[399,12]
cannot find symbol
[ERROR] symbol  : variable FriendsOfFriendsProcessorResponse
[ERROR] location: class org.apache.hadoop.hbase.coprocessor.TestRowProcessorEndpoint.RowProcessorEndpoint.FriendsOfFriendsProcessor
[ERROR] <https://builds.apache.org/job/HBase-TRUNK-on-Hadoop-2.0.0/ws/trunk/hbase-server/src/test/java/org/apache/hadoop/hbase/coprocessor/TestRowProcessorEndpoint.java>:[440,40]
package FriendsOfFriendsProcessorRequest does not exist
[ERROR] <https://builds.apache.org/job/HBase-TRUNK-on-Hadoop-2.0.0/ws/trunk/hbase-server/src/test/java/org/apache/hadoop/hbase/coprocessor/TestRowProcessorEndpoint.java>:[441,12]
cannot find symbol
[ERROR] symbol  : variable FriendsOfFriendsProcessorRequest
[ERROR] location: class org.apache.hadoop.hbase.coprocessor.TestRowProcessorEndpoint.RowProcessorEndpoint.FriendsOfFriendsProcessor
[ERROR] <https://builds.apache.org/job/HBase-TRUNK-on-Hadoop-2.0.0/ws/trunk/hbase-server/src/test/java/org/apache/hadoop/hbase/coprocessor/TestRowProcessorEndpoint.java>:[445,8]
cannot find symbol
[ERROR] symbol  : class FriendsOfFriendsProcessorRequest
[ERROR] location: class org.apache.hadoop.hbase.coprocessor.TestRowProcessorEndpoint.RowProcessorEndpoint.FriendsOfFriendsProcessor
[ERROR] <https://builds.apache.org/job/HBase-TRUNK-on-Hadoop-2.0.0/ws/trunk/hbase-server/src/test/java/org/apache/hadoop/hbase/coprocessor/TestRowProcessorEndpoint.java>:[490,15]
cannot find symbol
[ERROR] symbol  : variable RowSwapProcessorResponse
[ERROR] location: class org.apache.hadoop.hbase.coprocessor.TestRowProcessorEndpoint.RowProcessorEndpoint.RowSwapProcessor
[ERROR] <https://builds.apache.org/job/HBase-TRUNK-on-Hadoop-2.0.0/ws/trunk/hbase-server/src/test/java/org/apache/hadoop/hbase/coprocessor/TestRowProcessorEndpoint.java>:[546,31]
package RowSwapProcessorRequest does not exist
[ERROR] <https://builds.apache.org/job/HBase-TRUNK-on-Hadoop-2.0.0/ws/trunk/hbase-server/src/test/java/org/apache/hadoop/hbase/coprocessor/TestRowProcessorEndpoint.java>:[546,50]
cannot find symbol
[ERROR] symbol  : variable RowSwapProcessorRequest
[ERROR] location: class org.apache.hadoop.hbase.coprocessor.TestRowProcessorEndpoint.RowProcessorEndpoint.RowSwapProcessor
[ERROR] <https://builds.apache.org/job/HBase-TRUNK-on-Hadoop-2.0.0/ws/trunk/hbase-server/src/test/java/org/apache/hadoop/hbase/coprocessor/TestRowProcessorEndpoint.java>:[580,15]
cannot find symbol
[ERROR] symbol  : variable TimeoutProcessorResponse
[ERROR] location: class org.apache.hadoop.hbase.coprocessor.TestRowProcessorEndpoint.RowProcessorEndpoint.TimeoutProcessor
[ERROR] <https://builds.apache.org/job/HBase-TRUNK-on-Hadoop-2.0.0/ws/trunk/hbase-server/src/test/java/org/apache/hadoop/hbase/coprocessor/TestRowProcessorEndpoint.java>:[606,31]
package TimeoutProcessorRequest does not exist
[ERROR] <https://builds.apache.org/job/HBase-TRUNK-on-Hadoop-2.0.0/ws/trunk/hbase-server/src/test/java/org/apache/hadoop/hbase/coprocessor/TestRowProcessorEndpoint.java>:[606,50]
cannot find symbol
[ERROR] symbol  : variable TimeoutProcessorRequest
[ERROR] location: class org.apache.hadoop.hbase.coprocessor.TestRowProcessorEndpoint.RowProcessorEndpoint.TimeoutProcessor
[ERROR] -> [Help 1]
org.apache.maven.lifecycle.LifecycleExecutionException: Failed to execute goal org.apache.maven.plugins:maven-compiler-plugin:2.5.1:testCompile
(default-testCompile) on project hbase-server: Compilation failure
	at org.apache.maven.lifecycle.internal.MojoExecutor.execute(MojoExecutor.java:213)
	at org.apache.maven.lifecycle.internal.MojoExecutor.execute(MojoExecutor.java:153)
	at org.apache.maven.lifecycle.internal.MojoExecutor.execute(MojoExecutor.java:145)
	at org.apache.maven.lifecycle.internal.LifecycleModuleBuilder.buildProject(LifecycleModuleBuilder.java:84)
	at org.apache.maven.lifecycle.internal.LifecycleModuleBuilder.buildProject(LifecycleModuleBuilder.java:59)
	at org.apache.maven.lifecycle.internal.LifecycleStarter.singleThreadedBuild(LifecycleStarter.java:183)
	at org.apache.maven.lifecycle.internal.LifecycleStarter.execute(LifecycleStarter.java:161)
	at org.apache.maven.DefaultMaven.doExecute(DefaultMaven.java:319)
	at org.apache.maven.DefaultMaven.execute(DefaultMaven.java:156)
	at org.apache.maven.cli.MavenCli.execute(MavenCli.java:537)
	at org.apache.maven.cli.MavenCli.doMain(MavenCli.java:196)
	at org.apache.maven.cli.MavenCli.main(MavenCli.java:141)
	at sun.reflect.NativeMethodAccessorImpl.invoke0(Native Method)
	at sun.reflect.NativeMethodAccessorImpl.invoke(NativeMethodAccessorImpl.java:39)
	at sun.reflect.DelegatingMethodAccessorImpl.invoke(DelegatingMethodAccessorImpl.java:25)
	at java.lang.reflect.Method.invoke(Method.java:597)
	at org.codehaus.plexus.classworlds.launcher.Launcher.launchEnhanced(Launcher.java:290)
	at org.codehaus.plexus.classworlds.launcher.Launcher.launch(Launcher.java:230)
	at org.codehaus.plexus.classworlds.launcher.Launcher.mainWithExitCode(Launcher.java:409)
	at org.codehaus.plexus.classworlds.launcher.Launcher.main(Launcher.java:352)
Caused by: org.apache.maven.plugin.CompilationFailureException: Compilation failure
	at org.apache.maven.plugin.AbstractCompilerMojo.execute(AbstractCompilerMojo.java:729)
	at org.apache.maven.plugin.TestCompilerMojo.execute(TestCompilerMojo.java:161)
	at org.apache.maven.plugin.DefaultBuildPluginManager.executeMojo(DefaultBuildPluginManager.java:101)
	at org.apache.maven.lifecycle.internal.MojoExecutor.execute(MojoExecutor.java:209)
	... 19 more
[ERROR] 
[ERROR] 
[ERROR] For more information about the errors and possible solutions, please read the following
articles:
[ERROR] [Help 1] http://cwiki.apache.org/confluence/display/MAVEN/MojoFailureException
[ERROR] 
[ERROR] After correcting the problems, you can resume the build with the command
[ERROR]   mvn <goals> -rf :hbase-server
Build step 'Invoke top-level Maven targets' marked build as failure
Archiving artifacts
Recording test results
Updating HBASE-7146
Updating HBASE-7202
Updating HBASE-7109
Updating HBASE-6787

Mime
View raw message