hbase-dev mailing list archives

Site index · List index
Message view « Date » · « Thread »
Top « Date » · « Thread »
From Apache Jenkins Server <jenk...@builds.apache.org>
Subject Build failed in Jenkins: HBase-TRUNK #3549
Date Fri, 16 Nov 2012 07:56:49 GMT
See <https://builds.apache.org/job/HBase-TRUNK/3549/changes>

Changes:

[stack] HBASE-7162 Prefix Compression - Trie data block encoding; hbase-common and hbase-server
changes

[larsh] HBASE-7177 TestZooKeeperScanPolicyObserver.testScanPolicyObserver is flaky

------------------------------------------
[...truncated 2943 lines...]
Tests run: 5, Failures: 0, Errors: 0, Skipped: 0, Time elapsed: 29.615 sec
Running org.apache.hadoop.hbase.regionserver.TestSplitTransactionOnCluster
Tests run: 9, Failures: 0, Errors: 0, Skipped: 0, Time elapsed: 89.995 sec
Running org.apache.hadoop.hbase.regionserver.TestRSKilledWhenMasterInitializing
Tests run: 1, Failures: 0, Errors: 0, Skipped: 0, Time elapsed: 76.25 sec
Running org.apache.hadoop.hbase.regionserver.wal.TestWALReplayCompressed
Tests run: 7, Failures: 0, Errors: 0, Skipped: 0, Time elapsed: 72.171 sec
Running org.apache.hadoop.hbase.regionserver.wal.TestHLogFiltering
Tests run: 1, Failures: 0, Errors: 0, Skipped: 0, Time elapsed: 37.674 sec
Running org.apache.hadoop.hbase.regionserver.wal.TestHLog
Tests run: 11, Failures: 0, Errors: 0, Skipped: 0, Time elapsed: 78.78 sec
Running org.apache.hadoop.hbase.util.TestHBaseFsck
Tests run: 27, Failures: 0, Errors: 0, Skipped: 0, Time elapsed: 583.888 sec
Running org.apache.hadoop.hbase.regionserver.wal.TestWALReplay
Tests run: 7, Failures: 0, Errors: 0, Skipped: 0, Time elapsed: 63.223 sec
Running org.apache.hadoop.hbase.regionserver.TestRpcMetrics
Tests run: 1, Failures: 0, Errors: 0, Skipped: 0, Time elapsed: 2.083 sec
Running org.apache.hadoop.hbase.regionserver.TestGetClosestAtOrBefore
Tests run: 3, Failures: 0, Errors: 0, Skipped: 0, Time elapsed: 1.284 sec
Running org.apache.hadoop.hbase.regionserver.TestStoreScanner
Tests run: 16, Failures: 0, Errors: 0, Skipped: 0, Time elapsed: 0.218 sec
Running org.apache.hadoop.hbase.regionserver.TestCacheOnWriteInSchema
Tests run: 3, Failures: 0, Errors: 0, Skipped: 0, Time elapsed: 1.701 sec
Running org.apache.hadoop.hbase.regionserver.TestSeekOptimizations
Tests run: 6, Failures: 0, Errors: 0, Skipped: 0, Time elapsed: 2.795 sec
Running org.apache.hadoop.hbase.regionserver.TestFSErrorsExposed
Tests run: 3, Failures: 0, Errors: 0, Skipped: 1, Time elapsed: 0.908 sec
Running org.apache.hadoop.hbase.regionserver.TestSplitLogWorker
Tests run: 5, Failures: 0, Errors: 0, Skipped: 0, Time elapsed: 3.482 sec
Running org.apache.hadoop.hbase.regionserver.TestHRegionServerBulkLoad
Tests run: 1, Failures: 0, Errors: 0, Skipped: 0, Time elapsed: 47.741 sec
Running org.apache.hadoop.hbase.regionserver.TestMultiColumnScanner
Tests run: 12, Failures: 0, Errors: 0, Skipped: 0, Time elapsed: 31.059 sec
Running org.apache.hadoop.hbase.regionserver.TestCompoundBloomFilter
Tests run: 3, Failures: 0, Errors: 0, Skipped: 0, Time elapsed: 19.36 sec
Running org.apache.hadoop.hbase.regionserver.wal.TestLogRollAbort
Tests run: 1, Failures: 0, Errors: 0, Skipped: 0, Time elapsed: 162.524 sec
Running org.apache.hadoop.hbase.regionserver.TestClusterId
Tests run: 1, Failures: 0, Errors: 0, Skipped: 0, Time elapsed: 32.028 sec
Running org.apache.hadoop.hbase.regionserver.TestEndToEndSplitTransaction
Tests run: 2, Failures: 0, Errors: 0, Skipped: 0, Time elapsed: 72.398 sec
Running org.apache.hadoop.hbase.regionserver.wal.TestLogRolling
Tests run: 2, Failures: 0, Errors: 0, Skipped: 0, Time elapsed: 217.345 sec
Running org.apache.hadoop.hbase.regionserver.TestHRegion
Tests run: 58, Failures: 0, Errors: 37, Skipped: 0, Time elapsed: 42.519 sec <<<
FAILURE!
Running org.apache.hadoop.hbase.client.TestClientTimeouts
Tests run: 1, Failures: 0, Errors: 0, Skipped: 0, Time elapsed: 23.548 sec
Running org.apache.hadoop.hbase.client.replication.TestReplicationAdmin
Tests run: 1, Failures: 0, Errors: 0, Skipped: 0, Time elapsed: 1.765 sec
Running org.apache.hadoop.hbase.client.TestClientScannerRPCTimeout
Tests run: 1, Failures: 0, Errors: 0, Skipped: 0, Time elapsed: 38.478 sec
Running org.apache.hadoop.hbase.client.TestTimestampsFilter
Tests run: 3, Failures: 0, Errors: 0, Skipped: 0, Time elapsed: 29.188 sec
Running org.apache.hadoop.hbase.regionserver.wal.TestHLogSplit
Tests run: 31, Failures: 0, Errors: 0, Skipped: 1, Time elapsed: 272.858 sec
Running org.apache.hadoop.hbase.client.TestMultipleTimestamps
Tests run: 8, Failures: 0, Errors: 0, Skipped: 0, Time elapsed: 40.667 sec
Running org.apache.hadoop.hbase.regionserver.TestCompactionState
Tests run: 5, Failures: 0, Errors: 0, Skipped: 0, Time elapsed: 122.525 sec
Running org.apache.hadoop.hbase.client.TestHCM
Tests run: 7, Failures: 0, Errors: 0, Skipped: 0, Time elapsed: 28.282 sec
Running org.apache.hadoop.hbase.client.TestHTablePool$TestHTableReusablePool
Tests run: 8, Failures: 0, Errors: 0, Skipped: 0, Time elapsed: 5.52 sec
Running org.apache.hadoop.hbase.client.TestHTablePool$TestHTableThreadLocalPool
Tests run: 8, Failures: 0, Errors: 0, Skipped: 0, Time elapsed: 31.604 sec
Running org.apache.hadoop.hbase.client.TestHTableUtil
Tests run: 2, Failures: 0, Errors: 0, Skipped: 0, Time elapsed: 19.629 sec
Running org.apache.hadoop.hbase.client.TestFromClientSide3
Tests run: 1, Failures: 0, Errors: 0, Skipped: 0, Time elapsed: 36.464 sec
Running org.apache.hadoop.hbase.client.TestMetaScanner
Tests run: 1, Failures: 0, Errors: 0, Skipped: 0, Time elapsed: 22.405 sec
Running org.apache.hadoop.hbase.client.TestScannerTimeout
Tests run: 4, Failures: 0, Errors: 0, Skipped: 0, Time elapsed: 54.161 sec
Running org.apache.hadoop.hbase.client.TestFromClientSideWithCoprocessor
Tests run: 63, Failures: 0, Errors: 0, Skipped: 3, Time elapsed: 218.975 sec
Running org.apache.hadoop.hbase.client.TestScannersFromClientSide
Tests run: 4, Failures: 0, Errors: 0, Skipped: 0, Time elapsed: 30.494 sec
Running org.apache.hadoop.hbase.client.TestShell
Tests run: 1, Failures: 0, Errors: 0, Skipped: 0, Time elapsed: 131.605 sec
Running org.apache.hadoop.hbase.TestMultiVersions
Tests run: 3, Failures: 0, Errors: 0, Skipped: 0, Time elapsed: 28.845 sec
Running org.apache.hadoop.hbase.client.TestFromClientSide
Tests run: 63, Failures: 0, Errors: 0, Skipped: 3, Time elapsed: 221.509 sec
Running org.apache.hadoop.hbase.client.TestMultiParallel
Tests run: 11, Failures: 0, Errors: 0, Skipped: 0, Time elapsed: 64.124 sec
Running org.apache.hadoop.hbase.master.TestActiveMasterManager
Tests run: 2, Failures: 0, Errors: 0, Skipped: 0, Time elapsed: 1.538 sec
Running org.apache.hadoop.hbase.client.TestAdmin
Tests run: 42, Failures: 0, Errors: 0, Skipped: 0, Time elapsed: 176.481 sec
Running org.apache.hadoop.hbase.master.TestMasterNoCluster
Tests run: 3, Failures: 0, Errors: 0, Skipped: 0, Time elapsed: 10.642 sec
Running org.apache.hadoop.hbase.master.TestMasterMetrics
Tests run: 2, Failures: 0, Errors: 0, Skipped: 0, Time elapsed: 14.997 sec
Running org.apache.hadoop.hbase.master.balancer.TestDefaultLoadBalancer
Tests run: 1, Failures: 0, Errors: 0, Skipped: 0, Time elapsed: 1.611 sec
Running org.apache.hadoop.hbase.master.balancer.TestBaseLoadBalancer
Tests run: 3, Failures: 0, Errors: 0, Skipped: 0, Time elapsed: 0.509 sec
Running org.apache.hadoop.hbase.thrift.TestThriftServerCmdLine
Tests run: 32, Failures: 0, Errors: 0, Skipped: 0, Time elapsed: 63.233 sec
Running org.apache.hadoop.hbase.master.TestMasterFileSystem
Tests run: 1, Failures: 0, Errors: 0, Skipped: 0, Time elapsed: 17.049 sec
Running org.apache.hadoop.hbase.master.TestZKBasedOpenCloseRegion
Tests run: 4, Failures: 0, Errors: 0, Skipped: 0, Time elapsed: 30.134 sec
Running org.apache.hadoop.hbase.master.TestRollingRestart
Tests run: 1, Failures: 0, Errors: 0, Skipped: 0, Time elapsed: 60.908 sec
Running org.apache.hadoop.hbase.thrift.TestThriftServer
Tests run: 1, Failures: 0, Errors: 0, Skipped: 0, Time elapsed: 88.609 sec
Running org.apache.hadoop.hbase.master.TestMaster
Tests run: 1, Failures: 0, Errors: 0, Skipped: 0, Time elapsed: 24.279 sec
Running org.apache.hadoop.hbase.master.TestOpenedRegionHandler
Tests run: 2, Failures: 0, Errors: 0, Skipped: 0, Time elapsed: 18.077 sec
Running org.apache.hadoop.hbase.master.balancer.TestStochasticLoadBalancer
Tests run: 4, Failures: 0, Errors: 0, Skipped: 0, Time elapsed: 72.019 sec
Running org.apache.hadoop.hbase.master.TestMasterTransitions
Tests run: 3, Failures: 0, Errors: 0, Skipped: 3, Time elapsed: 30.133 sec
Running org.apache.hadoop.hbase.master.TestMasterMetricsWrapper
Tests run: 1, Failures: 0, Errors: 0, Skipped: 0, Time elapsed: 20.25 sec
Running org.apache.hadoop.hbase.master.TestAssignmentManager
Tests run: 14, Failures: 0, Errors: 0, Skipped: 0, Time elapsed: 4.358 sec
Running org.apache.hadoop.hbase.master.TestAssignmentManagerOnCluster
Tests run: 3, Failures: 0, Errors: 0, Skipped: 0, Time elapsed: 29.579 sec
Running org.apache.hadoop.hbase.master.TestMasterRestartAfterDisablingTable
Tests run: 1, Failures: 0, Errors: 0, Skipped: 0, Time elapsed: 22.385 sec
Running org.apache.hadoop.hbase.master.TestMasterStatusServlet
Tests run: 5, Failures: 0, Errors: 0, Skipped: 0, Time elapsed: 1.488 sec
Running org.apache.hadoop.hbase.master.handler.TestTableDeleteFamilyHandler
Tests run: 1, Failures: 0, Errors: 0, Skipped: 0, Time elapsed: 59.257 sec
Running org.apache.hadoop.hbase.master.TestHMasterRPCException
Tests run: 1, Failures: 0, Errors: 0, Skipped: 0, Time elapsed: 1.472 sec
Running org.apache.hadoop.hbase.master.TestSplitLogManager
Tests run: 13, Failures: 0, Errors: 0, Skipped: 0, Time elapsed: 40.651 sec
Running org.apache.hadoop.hbase.master.cleaner.TestLogsCleaner
Tests run: 1, Failures: 0, Errors: 0, Skipped: 0, Time elapsed: 3.609 sec
Running org.apache.hadoop.hbase.master.cleaner.TestHFileCleaner
Tests run: 3, Failures: 0, Errors: 0, Skipped: 0, Time elapsed: 11.218 sec
Running org.apache.hadoop.hbase.master.TestMasterShutdown
Tests run: 1, Failures: 0, Errors: 0, Skipped: 0, Time elapsed: 21.241 sec
Running org.apache.hadoop.hbase.master.TestRestartCluster
Tests run: 2, Failures: 0, Errors: 0, Skipped: 0, Time elapsed: 47.71 sec
Running org.apache.hadoop.hbase.TestZooKeeper
Tests run: 9, Failures: 0, Errors: 0, Skipped: 0, Time elapsed: 34.684 sec
Running org.apache.hadoop.hbase.ipc.TestProtoBufRpc
Tests run: 1, Failures: 0, Errors: 0, Skipped: 0, Time elapsed: 1.05 sec
Running org.apache.hadoop.hbase.ipc.TestDelayedRpc
Tests run: 4, Failures: 0, Errors: 0, Skipped: 0, Time elapsed: 2.53 sec
Running org.apache.hadoop.hbase.ipc.TestHBaseClient
Tests run: 1, Failures: 0, Errors: 0, Skipped: 0, Time elapsed: 0.294 sec
Running org.apache.hadoop.hbase.thrift2.TestThriftHBaseServiceHandler
Tests run: 12, Failures: 0, Errors: 0, Skipped: 0, Time elapsed: 19.486 sec
Running org.apache.hadoop.hbase.master.TestMasterFailover
Tests run: 5, Failures: 0, Errors: 0, Skipped: 0, Time elapsed: 126.757 sec
Running org.apache.hadoop.hbase.TestRegionRebalancing
Tests run: 2, Failures: 0, Errors: 0, Skipped: 0, Time elapsed: 124.857 sec
Running org.apache.hadoop.hbase.TestInfoServers
Tests run: 3, Failures: 0, Errors: 0, Skipped: 0, Time elapsed: 20.898 sec
Running org.apache.hadoop.hbase.TestAcidGuarantees
Tests run: 3, Failures: 0, Errors: 0, Skipped: 0, Time elapsed: 122.117 sec
Running org.apache.hadoop.hbase.master.TestDistributedLogSplitting
Tests run: 4, Failures: 0, Errors: 0, Skipped: 0, Time elapsed: 152.64 sec

Results :

Tests in error: 
  testParallelAppendWithMemStoreFlush(org.apache.hadoop.hbase.regionserver.TestHRegion): java.io.FileNotFoundException:
<https://builds.apache.org/job/HBase-TRUNK/ws/trunk/hbase-server/target/classes/hbase-default.xml>
(Too many open files)
  testPutWithMemStoreFlush(org.apache.hadoop.hbase.regionserver.TestHRegion): java.io.FileNotFoundException:
<https://builds.apache.org/job/HBase-TRUNK/ws/trunk/hbase-server/target/classes/hbase-default.xml>
(Too many open files)
  testBatchPutWithTsSlop(org.apache.hadoop.hbase.regionserver.TestHRegion): java.io.FileNotFoundException:
<https://builds.apache.org/job/HBase-TRUNK/ws/trunk/hbase-server/target/classes/hbase-default.xml>
(Too many open files)
  testCheckAndMutate_WithEmptyRowValue(org.apache.hadoop.hbase.regionserver.TestHRegion):
java.io.FileNotFoundException: <https://builds.apache.org/job/HBase-TRUNK/ws/trunk/hbase-server/target/classes/hbase-default.xml>
(Too many open files)
  testCheckAndMutate_WithWrongValue(org.apache.hadoop.hbase.regionserver.TestHRegion): java.io.FileNotFoundException:
<https://builds.apache.org/job/HBase-TRUNK/ws/trunk/hbase-server/target/classes/hbase-default.xml>
(Too many open files)
  testSkipRecoveredEditsReplay(org.apache.hadoop.hbase.regionserver.TestHRegion): cannot get
log writer
  testGetWhileRegionClose(org.apache.hadoop.hbase.regionserver.TestHRegion): <https://builds.apache.org/job/HBase-TRUNK/ws/trunk/hbase-server/target/test-data/abc2e208-bd66-4889-ade3-1166ad11091e/TestHRegiontestGetWhileRegionClose/testtable/9c336263d3b9c40b2ffef1483a78112e/.tmp/.regioninfo>
(Too many open files)
  testDelete_mixed(org.apache.hadoop.hbase.regionserver.TestHRegion): java.io.FileNotFoundException:
<https://builds.apache.org/job/HBase-TRUNK/ws/trunk/hbase-server/target/classes/hbase-default.xml>
(Too many open files)
  testDeleteRowWithFutureTs(org.apache.hadoop.hbase.regionserver.TestHRegion): java.io.FileNotFoundException:
<https://builds.apache.org/job/HBase-TRUNK/ws/trunk/hbase-server/target/classes/hbase-default.xml>
(Too many open files)
  testPutWithLatestTS(org.apache.hadoop.hbase.regionserver.TestHRegion): java.io.FileNotFoundException:
<https://builds.apache.org/job/HBase-TRUNK/ws/trunk/hbase-server/target/classes/hbase-default.xml>
(Too many open files)
  testPutWithTsSlop(org.apache.hadoop.hbase.regionserver.TestHRegion): java.io.FileNotFoundException:
<https://builds.apache.org/job/HBase-TRUNK/ws/trunk/hbase-server/target/classes/hbase-default.xml>
(Too many open files)
  testScanner_DeleteOneFamilyNotAnother(org.apache.hadoop.hbase.regionserver.TestHRegion):
cannot get log writer
  testDeleteColumns_PostInsert(org.apache.hadoop.hbase.regionserver.TestHRegion): java.io.FileNotFoundException:
<https://builds.apache.org/job/HBase-TRUNK/ws/trunk/hbase-server/target/classes/hbase-default.xml>
(Too many open files)
  testDeleteFamily_PostInsert(org.apache.hadoop.hbase.regionserver.TestHRegion): java.io.FileNotFoundException:
<https://builds.apache.org/job/HBase-TRUNK/ws/trunk/hbase-server/target/classes/hbase-default.xml>
(Too many open files)
  testDelete_CheckTimestampUpdated(org.apache.hadoop.hbase.regionserver.TestHRegion): java.io.FileNotFoundException:
<https://builds.apache.org/job/HBase-TRUNK/ws/trunk/hbase-server/target/classes/hbase-default.xml>
(Too many open files)
  testGet_FamilyChecker(org.apache.hadoop.hbase.regionserver.TestHRegion): java.io.FileNotFoundException:
<https://builds.apache.org/job/HBase-TRUNK/ws/trunk/hbase-server/target/classes/hbase-default.xml>
(Too many open files)
  testGet_Basic(org.apache.hadoop.hbase.regionserver.TestHRegion): java.io.FileNotFoundException:
<https://builds.apache.org/job/HBase-TRUNK/ws/trunk/hbase-server/target/classes/hbase-default.xml>
(Too many open files)
  testGet_Empty(org.apache.hadoop.hbase.regionserver.TestHRegion): java.io.FileNotFoundException:
<https://builds.apache.org/job/HBase-TRUNK/ws/trunk/hbase-server/target/classes/hbase-default.xml>
(Too many open files)
  testLocks(org.apache.hadoop.hbase.regionserver.TestHRegion): java.io.FileNotFoundException:
<https://builds.apache.org/job/HBase-TRUNK/ws/trunk/hbase-server/target/classes/hbase-default.xml>
(Too many open files)
  testMerge(org.apache.hadoop.hbase.regionserver.TestHRegion): java.io.FileNotFoundException:
<https://builds.apache.org/job/HBase-TRUNK/ws/trunk/hbase-server/target/classes/hbase-default.xml>
(Too many open files)
  testGetScanner_WithOkFamilies(org.apache.hadoop.hbase.regionserver.TestHRegion): java.io.FileNotFoundException:
<https://builds.apache.org/job/HBase-TRUNK/ws/trunk/hbase-server/target/classes/hbase-default.xml>
(Too many open files)
  testGetScanner_WithNotOkFamilies(org.apache.hadoop.hbase.regionserver.TestHRegion): java.io.FileNotFoundException:
<https://builds.apache.org/job/HBase-TRUNK/ws/trunk/hbase-server/target/classes/hbase-default.xml>
(Too many open files)
  testGetScanner_WithNoFamilies(org.apache.hadoop.hbase.regionserver.TestHRegion): java.io.FileNotFoundException:
<https://builds.apache.org/job/HBase-TRUNK/ws/trunk/hbase-server/target/classes/hbase-default.xml>
(Too many open files)
  testGetScanner_WithRegionClosed(org.apache.hadoop.hbase.regionserver.TestHRegion): java.io.FileNotFoundException:
<https://builds.apache.org/job/HBase-TRUNK/ws/trunk/hbase-server/target/classes/hbase-default.xml>
(Too many open files)
  testRegionScanner_Next(org.apache.hadoop.hbase.regionserver.TestHRegion): cannot get log
writer
  testScanner_ExplicitColumns_FromMemStore_EnforceVersions(org.apache.hadoop.hbase.regionserver.TestHRegion):
java.io.FileNotFoundException: <https://builds.apache.org/job/HBase-TRUNK/ws/trunk/hbase-server/target/classes/hbase-default.xml>
(Too many open files)
  testScanner_ExplicitColumns_FromFilesOnly_EnforceVersions(org.apache.hadoop.hbase.regionserver.TestHRegion):
java.io.FileNotFoundException: <https://builds.apache.org/job/HBase-TRUNK/ws/trunk/hbase-server/target/classes/hbase-default.xml>
(Too many open files)
  testScanner_ExplicitColumns_FromMemStoreAndFiles_EnforceVersions(org.apache.hadoop.hbase.regionserver.TestHRegion):
java.io.FileNotFoundException: <https://builds.apache.org/job/HBase-TRUNK/ws/trunk/hbase-server/target/classes/hbase-default.xml>
(Too many open files)
  testScanner_Wildcard_FromMemStore_EnforceVersions(org.apache.hadoop.hbase.regionserver.TestHRegion):
java.io.FileNotFoundException: <https://builds.apache.org/job/HBase-TRUNK/ws/trunk/hbase-server/target/classes/hbase-default.xml>
(Too many open files)
  testScanner_Wildcard_FromFilesOnly_EnforceVersions(org.apache.hadoop.hbase.regionserver.TestHRegion):
java.io.FileNotFoundException: <https://builds.apache.org/job/HBase-TRUNK/ws/trunk/hbase-server/target/classes/hbase-default.xml>
(Too many open files)
  testScanner_StopRow1542(org.apache.hadoop.hbase.regionserver.TestHRegion): java.io.FileNotFoundException:
<https://builds.apache.org/job/HBase-TRUNK/ws/trunk/hbase-server/target/classes/hbase-default.xml>
(Too many open files)
  testScanner_Wildcard_FromMemStoreAndFiles_EnforceVersions(org.apache.hadoop.hbase.regionserver.TestHRegion):
java.io.FileNotFoundException: <https://builds.apache.org/job/HBase-TRUNK/ws/trunk/hbase-server/target/classes/hbase-default.xml>
(Too many open files)
  testBasicSplit(org.apache.hadoop.hbase.regionserver.TestHRegion): java.io.FileNotFoundException:
<https://builds.apache.org/job/HBase-TRUNK/ws/trunk/hbase-server/target/classes/hbase-default.xml>
(Too many open files)
  testCompactionAffectedByScanners(org.apache.hadoop.hbase.regionserver.TestHRegion): java.io.FileNotFoundException:
<https://builds.apache.org/job/HBase-TRUNK/ws/trunk/hbase-server/target/classes/hbase-default.xml>
(Too many open files)
  testSkipRecoveredEditsReplaySomeIgnored(org.apache.hadoop.hbase.regionserver.TestHRegion):
java.io.FileNotFoundException: <https://builds.apache.org/job/HBase-TRUNK/ws/trunk/hbase-server/target/classes/hbase-default.xml>
(Too many open files)
  testSkipRecoveredEditsReplayAllIgnored(org.apache.hadoop.hbase.regionserver.TestHRegion):
java.io.FileNotFoundException: <https://builds.apache.org/job/HBase-TRUNK/ws/trunk/hbase-server/target/classes/hbase-default.xml>
(Too many open files)
  testWeirdCacheBehaviour(org.apache.hadoop.hbase.regionserver.TestHRegion): java.io.FileNotFoundException:
<https://builds.apache.org/job/HBase-TRUNK/ws/trunk/hbase-server/target/classes/hbase-default.xml>
(Too many open files)

Tests run: 1196, Failures: 0, Errors: 37, Skipped: 12

[INFO]                                                                         
[INFO] ------------------------------------------------------------------------
[INFO] Skipping HBase
[INFO] This project has been banned from the build due to previous failures.
[INFO] ------------------------------------------------------------------------
[INFO]                                                                         
[INFO] ------------------------------------------------------------------------
[INFO] Skipping HBase
[INFO] This project has been banned from the build due to previous failures.
[INFO] ------------------------------------------------------------------------
[INFO] ------------------------------------------------------------------------
[INFO] Reactor Summary:
[INFO] 
[INFO] HBase ............................................. SUCCESS [9.066s]
[INFO] HBase - Common .................................... SUCCESS [17.822s]
[INFO] HBase - Hadoop Compatibility ...................... SUCCESS [0.754s]
[INFO] HBase - Hadoop One Compatibility .................. SUCCESS [1.952s]
[INFO] HBase - Server .................................... FAILURE [43:19.895s]
[INFO] HBase - Hadoop Two Compatibility .................. SKIPPED
[INFO] HBase - Integration Tests ......................... SKIPPED
[INFO] HBase - Examples .................................. SKIPPED
[INFO] ------------------------------------------------------------------------
[INFO] BUILD FAILURE
[INFO] ------------------------------------------------------------------------
[INFO] Total time: 43:50.516s
[INFO] Finished at: Fri Nov 16 07:55:58 UTC 2012
[INFO] Final Memory: 48M/707M
[INFO] ------------------------------------------------------------------------
[ERROR] Failed to execute goal org.apache.maven.plugins:maven-surefire-plugin:2.12-TRUNK-HBASE-2:test
(secondPartTestsExecution) on project hbase-server: There are test failures.
[ERROR] 
[ERROR] Please refer to <https://builds.apache.org/job/HBase-TRUNK/ws/trunk/hbase-server/target/surefire-reports>
for the individual test results.
[ERROR] -> [Help 1]
[ERROR] 
[ERROR] To see the full stack trace of the errors, re-run Maven with the -e switch.
[ERROR] Re-run Maven using the -X switch to enable full debug logging.
[ERROR] 
[ERROR] For more information about the errors and possible solutions, please read the following
articles:
[ERROR] [Help 1] http://cwiki.apache.org/confluence/display/MAVEN/MojoFailureException
[ERROR] 
[ERROR] After correcting the problems, you can resume the build with the command
[ERROR]   mvn <goals> -rf :hbase-server
Build step 'Invoke top-level Maven targets' marked build as failure
Archiving artifacts
Recording test results
Updating HBASE-7162
Updating HBASE-7177

Mime
View raw message