hbase-dev mailing list archives

Site index · List index
Message view « Date » · « Thread »
Top « Date » · « Thread »
From Apache Jenkins Server <jenk...@builds.apache.org>
Subject Build failed in Jenkins: HBase-TRUNK-on-Hadoop-2.0.0 #233
Date Wed, 24 Oct 2012 12:25:25 GMT
See <https://builds.apache.org/job/HBase-TRUNK-on-Hadoop-2.0.0/233/changes>

Changes:

[stack] HBASE-7037 ReplicationPeer logs at WARN level aborting server instead of at FATAL

[larsh] HBASE-6843 loading lzo error when using coprocessor (Andy)

[gchanan] HBASE-7018 Fix and Improve TableDescriptor caching for bulk assignment

------------------------------------------
[...truncated 13411 lines...]
Forking command line: /bin/sh -c cd <https://builds.apache.org/job/HBase-TRUNK-on-Hadoop-2.0.0/ws/trunk/hbase-server> && /home/hudson/tools/java/jdk1.6.0_27-32/jre/bin/java -enableassertions -Xmx1900m -Djava.security.egd=file:/dev/./urandom -jar <https://builds.apache.org/job/HBase-TRUNK-on-Hadoop-2.0.0/ws/trunk/hbase-server/target/surefire/surefirebooter396408427826346006.jar> <https://builds.apache.org/job/HBase-TRUNK-on-Hadoop-2.0.0/ws/trunk/hbase-server/target/surefire/surefire5062847598751279878tmp> <https://builds.apache.org/job/HBase-TRUNK-on-Hadoop-2.0.0/ws/trunk/hbase-server/target/surefire/surefire_95137961249491694221tmp>
Running org.apache.hadoop.hbase.regionserver.TestHRegionOnCluster
Tests run: 1, Failures: 0, Errors: 0, Skipped: 0, Time elapsed: 37.113 sec
Forking command line: /bin/sh -c cd <https://builds.apache.org/job/HBase-TRUNK-on-Hadoop-2.0.0/ws/trunk/hbase-server> && /home/hudson/tools/java/jdk1.6.0_27-32/jre/bin/java -enableassertions -Xmx1900m -Djava.security.egd=file:/dev/./urandom -jar <https://builds.apache.org/job/HBase-TRUNK-on-Hadoop-2.0.0/ws/trunk/hbase-server/target/surefire/surefirebooter7447067996693385586.jar> <https://builds.apache.org/job/HBase-TRUNK-on-Hadoop-2.0.0/ws/trunk/hbase-server/target/surefire/surefire5590224096862217339tmp> <https://builds.apache.org/job/HBase-TRUNK-on-Hadoop-2.0.0/ws/trunk/hbase-server/target/surefire/surefire_968487385532774940593tmp>
Running org.apache.hadoop.hbase.regionserver.TestBlocksRead
Tests run: 4, Failures: 0, Errors: 0, Skipped: 0, Time elapsed: 1.489 sec
Forking command line: /bin/sh -c cd <https://builds.apache.org/job/HBase-TRUNK-on-Hadoop-2.0.0/ws/trunk/hbase-server> && /home/hudson/tools/java/jdk1.6.0_27-32/jre/bin/java -enableassertions -Xmx1900m -Djava.security.egd=file:/dev/./urandom -jar <https://builds.apache.org/job/HBase-TRUNK-on-Hadoop-2.0.0/ws/trunk/hbase-server/target/surefire/surefirebooter4297382739712342500.jar> <https://builds.apache.org/job/HBase-TRUNK-on-Hadoop-2.0.0/ws/trunk/hbase-server/target/surefire/surefire1821246908172822151tmp> <https://builds.apache.org/job/HBase-TRUNK-on-Hadoop-2.0.0/ws/trunk/hbase-server/target/surefire/surefire_979077111339386888066tmp>
Running org.apache.hadoop.hbase.regionserver.TestMasterAddressManager
Tests run: 1, Failures: 0, Errors: 0, Skipped: 0, Time elapsed: 1.205 sec
Forking command line: /bin/sh -c cd <https://builds.apache.org/job/HBase-TRUNK-on-Hadoop-2.0.0/ws/trunk/hbase-server> && /home/hudson/tools/java/jdk1.6.0_27-32/jre/bin/java -enableassertions -Xmx1900m -Djava.security.egd=file:/dev/./urandom -jar <https://builds.apache.org/job/HBase-TRUNK-on-Hadoop-2.0.0/ws/trunk/hbase-server/target/surefire/surefirebooter7343378969808753314.jar> <https://builds.apache.org/job/HBase-TRUNK-on-Hadoop-2.0.0/ws/trunk/hbase-server/target/surefire/surefire1648374218240942663tmp> <https://builds.apache.org/job/HBase-TRUNK-on-Hadoop-2.0.0/ws/trunk/hbase-server/target/surefire/surefire_985543274494519009128tmp>
Running org.apache.hadoop.hbase.regionserver.wal.TestWALReplay
Tests run: 7, Failures: 0, Errors: 0, Skipped: 0, Time elapsed: 41.874 sec
Forking command line: /bin/sh -c cd <https://builds.apache.org/job/HBase-TRUNK-on-Hadoop-2.0.0/ws/trunk/hbase-server> && /home/hudson/tools/java/jdk1.6.0_27-32/jre/bin/java -enableassertions -Xmx1900m -Djava.security.egd=file:/dev/./urandom -jar <https://builds.apache.org/job/HBase-TRUNK-on-Hadoop-2.0.0/ws/trunk/hbase-server/target/surefire/surefirebooter3140149394780675245.jar> <https://builds.apache.org/job/HBase-TRUNK-on-Hadoop-2.0.0/ws/trunk/hbase-server/target/surefire/surefire6381509341308053818tmp> <https://builds.apache.org/job/HBase-TRUNK-on-Hadoop-2.0.0/ws/trunk/hbase-server/target/surefire/surefire_992079875107158824497tmp>
Running org.apache.hadoop.hbase.regionserver.wal.TestWALReplayCompressed
Tests run: 7, Failures: 0, Errors: 0, Skipped: 0, Time elapsed: 43.078 sec
Forking command line: /bin/sh -c cd <https://builds.apache.org/job/HBase-TRUNK-on-Hadoop-2.0.0/ws/trunk/hbase-server> && /home/hudson/tools/java/jdk1.6.0_27-32/jre/bin/java -enableassertions -Xmx1900m -Djava.security.egd=file:/dev/./urandom -jar <https://builds.apache.org/job/HBase-TRUNK-on-Hadoop-2.0.0/ws/trunk/hbase-server/target/surefire/surefirebooter812314397556791286.jar> <https://builds.apache.org/job/HBase-TRUNK-on-Hadoop-2.0.0/ws/trunk/hbase-server/target/surefire/surefire7475809368012644504tmp> <https://builds.apache.org/job/HBase-TRUNK-on-Hadoop-2.0.0/ws/trunk/hbase-server/target/surefire/surefire_1006000651398141700584tmp>
Running org.apache.hadoop.hbase.regionserver.wal.TestHLogFiltering
Tests run: 1, Failures: 0, Errors: 0, Skipped: 0, Time elapsed: 24.988 sec
Forking command line: /bin/sh -c cd <https://builds.apache.org/job/HBase-TRUNK-on-Hadoop-2.0.0/ws/trunk/hbase-server> && /home/hudson/tools/java/jdk1.6.0_27-32/jre/bin/java -enableassertions -Xmx1900m -Djava.security.egd=file:/dev/./urandom -jar <https://builds.apache.org/job/HBase-TRUNK-on-Hadoop-2.0.0/ws/trunk/hbase-server/target/surefire/surefirebooter6737257914329126505.jar> <https://builds.apache.org/job/HBase-TRUNK-on-Hadoop-2.0.0/ws/trunk/hbase-server/target/surefire/surefire5099117381852316956tmp> <https://builds.apache.org/job/HBase-TRUNK-on-Hadoop-2.0.0/ws/trunk/hbase-server/target/surefire/surefire_1013007177790481223524tmp>
Running org.apache.hadoop.hbase.regionserver.TestMXBean
Tests run: 1, Failures: 0, Errors: 0, Skipped: 0, Time elapsed: 14.455 sec
Forking command line: /bin/sh -c cd <https://builds.apache.org/job/HBase-TRUNK-on-Hadoop-2.0.0/ws/trunk/hbase-server> && /home/hudson/tools/java/jdk1.6.0_27-32/jre/bin/java -enableassertions -Xmx1900m -Djava.security.egd=file:/dev/./urandom -jar <https://builds.apache.org/job/HBase-TRUNK-on-Hadoop-2.0.0/ws/trunk/hbase-server/target/surefire/surefirebooter8165895448783600179.jar> <https://builds.apache.org/job/HBase-TRUNK-on-Hadoop-2.0.0/ws/trunk/hbase-server/target/surefire/surefire8068259342654235245tmp> <https://builds.apache.org/job/HBase-TRUNK-on-Hadoop-2.0.0/ws/trunk/hbase-server/target/surefire/surefire_1022727550927922244703tmp>
Running org.apache.hadoop.hbase.regionserver.wal.TestLogRollAbort
Tests run: 1, Failures: 0, Errors: 0, Skipped: 0, Time elapsed: 47.216 sec
Forking command line: /bin/sh -c cd <https://builds.apache.org/job/HBase-TRUNK-on-Hadoop-2.0.0/ws/trunk/hbase-server> && /home/hudson/tools/java/jdk1.6.0_27-32/jre/bin/java -enableassertions -Xmx1900m -Djava.security.egd=file:/dev/./urandom -jar <https://builds.apache.org/job/HBase-TRUNK-on-Hadoop-2.0.0/ws/trunk/hbase-server/target/surefire/surefirebooter3020571808413368047.jar> <https://builds.apache.org/job/HBase-TRUNK-on-Hadoop-2.0.0/ws/trunk/hbase-server/target/surefire/surefire673666842149528951tmp> <https://builds.apache.org/job/HBase-TRUNK-on-Hadoop-2.0.0/ws/trunk/hbase-server/target/surefire/surefire_1036589195756005827160tmp>
Running org.apache.hadoop.hbase.regionserver.TestRpcMetrics
Tests run: 1, Failures: 0, Errors: 0, Skipped: 0, Time elapsed: 1.933 sec
Forking command line: /bin/sh -c cd <https://builds.apache.org/job/HBase-TRUNK-on-Hadoop-2.0.0/ws/trunk/hbase-server> && /home/hudson/tools/java/jdk1.6.0_27-32/jre/bin/java -enableassertions -Xmx1900m -Djava.security.egd=file:/dev/./urandom -jar <https://builds.apache.org/job/HBase-TRUNK-on-Hadoop-2.0.0/ws/trunk/hbase-server/target/surefire/surefirebooter421273169763024839.jar> <https://builds.apache.org/job/HBase-TRUNK-on-Hadoop-2.0.0/ws/trunk/hbase-server/target/surefire/surefire2063782139161374280tmp> <https://builds.apache.org/job/HBase-TRUNK-on-Hadoop-2.0.0/ws/trunk/hbase-server/target/surefire/surefire_1047771410534735559724tmp>
Running org.apache.hadoop.hbase.regionserver.TestGetClosestAtOrBefore
Tests run: 3, Failures: 0, Errors: 0, Skipped: 0, Time elapsed: 1.199 sec
Forking command line: /bin/sh -c cd <https://builds.apache.org/job/HBase-TRUNK-on-Hadoop-2.0.0/ws/trunk/hbase-server> && /home/hudson/tools/java/jdk1.6.0_27-32/jre/bin/java -enableassertions -Xmx1900m -Djava.security.egd=file:/dev/./urandom -jar <https://builds.apache.org/job/HBase-TRUNK-on-Hadoop-2.0.0/ws/trunk/hbase-server/target/surefire/surefirebooter5824713537968779396.jar> <https://builds.apache.org/job/HBase-TRUNK-on-Hadoop-2.0.0/ws/trunk/hbase-server/target/surefire/surefire6632274843614196631tmp> <https://builds.apache.org/job/HBase-TRUNK-on-Hadoop-2.0.0/ws/trunk/hbase-server/target/surefire/surefire_1058605021502234220739tmp>
Running org.apache.hadoop.hbase.regionserver.TestStoreScanner
Tests run: 16, Failures: 0, Errors: 0, Skipped: 0, Time elapsed: 0.184 sec
Forking command line: /bin/sh -c cd <https://builds.apache.org/job/HBase-TRUNK-on-Hadoop-2.0.0/ws/trunk/hbase-server> && /home/hudson/tools/java/jdk1.6.0_27-32/jre/bin/java -enableassertions -Xmx1900m -Djava.security.egd=file:/dev/./urandom -jar <https://builds.apache.org/job/HBase-TRUNK-on-Hadoop-2.0.0/ws/trunk/hbase-server/target/surefire/surefirebooter5128425917574840970.jar> <https://builds.apache.org/job/HBase-TRUNK-on-Hadoop-2.0.0/ws/trunk/hbase-server/target/surefire/surefire4540814412391535840tmp> <https://builds.apache.org/job/HBase-TRUNK-on-Hadoop-2.0.0/ws/trunk/hbase-server/target/surefire/surefire_1063749105130986039590tmp>
Running org.apache.hadoop.hbase.regionserver.metrics.TestSchemaMetrics
Running org.apache.hadoop.hbase.regionserver.TestCacheOnWriteInSchema
Tests run: 3, Failures: 0, Errors: 0, Skipped: 0, Time elapsed: 1.72 sec
Forking command line: /bin/sh -c cd <https://builds.apache.org/job/HBase-TRUNK-on-Hadoop-2.0.0/ws/trunk/hbase-server> && /home/hudson/tools/java/jdk1.6.0_27-32/jre/bin/java -enableassertions -Xmx1900m -Djava.security.egd=file:/dev/./urandom -jar <https://builds.apache.org/job/HBase-TRUNK-on-Hadoop-2.0.0/ws/trunk/hbase-server/target/surefire/surefirebooter3591787368851345458.jar> <https://builds.apache.org/job/HBase-TRUNK-on-Hadoop-2.0.0/ws/trunk/hbase-server/target/surefire/surefire1169192543499757901tmp> <https://builds.apache.org/job/HBase-TRUNK-on-Hadoop-2.0.0/ws/trunk/hbase-server/target/surefire/surefire_107409738095551296311tmp>
Tests run: 6, Failures: 0, Errors: 0, Skipped: 0, Time elapsed: 14.773 sec
Forking command line: /bin/sh -c cd <https://builds.apache.org/job/HBase-TRUNK-on-Hadoop-2.0.0/ws/trunk/hbase-server> && /home/hudson/tools/java/jdk1.6.0_27-32/jre/bin/java -enableassertions -Xmx1900m -Djava.security.egd=file:/dev/./urandom -jar <https://builds.apache.org/job/HBase-TRUNK-on-Hadoop-2.0.0/ws/trunk/hbase-server/target/surefire/surefirebooter5890387017153124671.jar> <https://builds.apache.org/job/HBase-TRUNK-on-Hadoop-2.0.0/ws/trunk/hbase-server/target/surefire/surefire1712510856572987659tmp> <https://builds.apache.org/job/HBase-TRUNK-on-Hadoop-2.0.0/ws/trunk/hbase-server/target/surefire/surefire_1084036830068325219909tmp>
Running org.apache.hadoop.hbase.regionserver.TestFSErrorsExposed
Tests run: 3, Failures: 0, Errors: 0, Skipped: 1, Time elapsed: 1.003 sec
Forking command line: /bin/sh -c cd <https://builds.apache.org/job/HBase-TRUNK-on-Hadoop-2.0.0/ws/trunk/hbase-server> && /home/hudson/tools/java/jdk1.6.0_27-32/jre/bin/java -enableassertions -Xmx1900m -Djava.security.egd=file:/dev/./urandom -jar <https://builds.apache.org/job/HBase-TRUNK-on-Hadoop-2.0.0/ws/trunk/hbase-server/target/surefire/surefirebooter7554553362413946640.jar> <https://builds.apache.org/job/HBase-TRUNK-on-Hadoop-2.0.0/ws/trunk/hbase-server/target/surefire/surefire7052066584063661439tmp> <https://builds.apache.org/job/HBase-TRUNK-on-Hadoop-2.0.0/ws/trunk/hbase-server/target/surefire/surefire_1095024912217203607684tmp>
Running org.apache.hadoop.hbase.regionserver.TestSeekOptimizations
Tests run: 6, Failures: 0, Errors: 0, Skipped: 0, Time elapsed: 3.308 sec
Forking command line: /bin/sh -c cd <https://builds.apache.org/job/HBase-TRUNK-on-Hadoop-2.0.0/ws/trunk/hbase-server> && /home/hudson/tools/java/jdk1.6.0_27-32/jre/bin/java -enableassertions -Xmx1900m -Djava.security.egd=file:/dev/./urandom -jar <https://builds.apache.org/job/HBase-TRUNK-on-Hadoop-2.0.0/ws/trunk/hbase-server/target/surefire/surefirebooter6727154701950393580.jar> <https://builds.apache.org/job/HBase-TRUNK-on-Hadoop-2.0.0/ws/trunk/hbase-server/target/surefire/surefire7354068926425318180tmp> <https://builds.apache.org/job/HBase-TRUNK-on-Hadoop-2.0.0/ws/trunk/hbase-server/target/surefire/surefire_1107189085694370253122tmp>
Running org.apache.hadoop.hbase.regionserver.TestSplitLogWorker
Tests run: 5, Failures: 0, Errors: 0, Skipped: 0, Time elapsed: 6.778 sec
Forking command line: /bin/sh -c cd <https://builds.apache.org/job/HBase-TRUNK-on-Hadoop-2.0.0/ws/trunk/hbase-server> && /home/hudson/tools/java/jdk1.6.0_27-32/jre/bin/java -enableassertions -Xmx1900m -Djava.security.egd=file:/dev/./urandom -jar <https://builds.apache.org/job/HBase-TRUNK-on-Hadoop-2.0.0/ws/trunk/hbase-server/target/surefire/surefirebooter5490200172747628683.jar> <https://builds.apache.org/job/HBase-TRUNK-on-Hadoop-2.0.0/ws/trunk/hbase-server/target/surefire/surefire6911872115450389258tmp> <https://builds.apache.org/job/HBase-TRUNK-on-Hadoop-2.0.0/ws/trunk/hbase-server/target/surefire/surefire_111890535939904458627tmp>
Running org.apache.hadoop.hbase.regionserver.TestCompoundBloomFilter
Tests run: 3, Failures: 0, Errors: 0, Skipped: 0, Time elapsed: 25.164 sec
Forking command line: /bin/sh -c cd <https://builds.apache.org/job/HBase-TRUNK-on-Hadoop-2.0.0/ws/trunk/hbase-server> && /home/hudson/tools/java/jdk1.6.0_27-32/jre/bin/java -enableassertions -Xmx1900m -Djava.security.egd=file:/dev/./urandom -jar <https://builds.apache.org/job/HBase-TRUNK-on-Hadoop-2.0.0/ws/trunk/hbase-server/target/surefire/surefirebooter5614598240077215959.jar> <https://builds.apache.org/job/HBase-TRUNK-on-Hadoop-2.0.0/ws/trunk/hbase-server/target/surefire/surefire3131149540796495796tmp> <https://builds.apache.org/job/HBase-TRUNK-on-Hadoop-2.0.0/ws/trunk/hbase-server/target/surefire/surefire_11259121930327641377tmp>
Running org.apache.hadoop.hbase.regionserver.TestMultiColumnScanner
Tests run: 12, Failures: 0, Errors: 0, Skipped: 0, Time elapsed: 42.322 sec
Forking command line: /bin/sh -c cd <https://builds.apache.org/job/HBase-TRUNK-on-Hadoop-2.0.0/ws/trunk/hbase-server> && /home/hudson/tools/java/jdk1.6.0_27-32/jre/bin/java -enableassertions -Xmx1900m -Djava.security.egd=file:/dev/./urandom -jar <https://builds.apache.org/job/HBase-TRUNK-on-Hadoop-2.0.0/ws/trunk/hbase-server/target/surefire/surefirebooter7305906238106328662.jar> <https://builds.apache.org/job/HBase-TRUNK-on-Hadoop-2.0.0/ws/trunk/hbase-server/target/surefire/surefire3599339983364706869tmp> <https://builds.apache.org/job/HBase-TRUNK-on-Hadoop-2.0.0/ws/trunk/hbase-server/target/surefire/surefire_1136156125444364552695tmp>
Running org.apache.hadoop.hbase.regionserver.TestClusterId
Tests run: 1, Failures: 0, Errors: 0, Skipped: 0, Time elapsed: 23.305 sec
Forking command line: /bin/sh -c cd <https://builds.apache.org/job/HBase-TRUNK-on-Hadoop-2.0.0/ws/trunk/hbase-server> && /home/hudson/tools/java/jdk1.6.0_27-32/jre/bin/java -enableassertions -Xmx1900m -Djava.security.egd=file:/dev/./urandom -jar <https://builds.apache.org/job/HBase-TRUNK-on-Hadoop-2.0.0/ws/trunk/hbase-server/target/surefire/surefirebooter19296039113992939.jar> <https://builds.apache.org/job/HBase-TRUNK-on-Hadoop-2.0.0/ws/trunk/hbase-server/target/surefire/surefire8392674326266802922tmp> <https://builds.apache.org/job/HBase-TRUNK-on-Hadoop-2.0.0/ws/trunk/hbase-server/target/surefire/surefire_1148545161624297191150tmp>
Running org.apache.hadoop.hbase.client.TestClientTimeouts
Tests run: 1, Failures: 0, Errors: 0, Skipped: 0, Time elapsed: 20.873 sec
Forking command line: /bin/sh -c cd <https://builds.apache.org/job/HBase-TRUNK-on-Hadoop-2.0.0/ws/trunk/hbase-server> && /home/hudson/tools/java/jdk1.6.0_27-32/jre/bin/java -enableassertions -Xmx1900m -Djava.security.egd=file:/dev/./urandom -jar <https://builds.apache.org/job/HBase-TRUNK-on-Hadoop-2.0.0/ws/trunk/hbase-server/target/surefire/surefirebooter3747607895180401137.jar> <https://builds.apache.org/job/HBase-TRUNK-on-Hadoop-2.0.0/ws/trunk/hbase-server/target/surefire/surefire534423304054498882tmp> <https://builds.apache.org/job/HBase-TRUNK-on-Hadoop-2.0.0/ws/trunk/hbase-server/target/surefire/surefire_115932065209336345645tmp>
Running org.apache.hadoop.hbase.client.replication.TestReplicationAdmin
Tests run: 1, Failures: 0, Errors: 0, Skipped: 0, Time elapsed: 2.454 sec
Forking command line: /bin/sh -c cd <https://builds.apache.org/job/HBase-TRUNK-on-Hadoop-2.0.0/ws/trunk/hbase-server> && /home/hudson/tools/java/jdk1.6.0_27-32/jre/bin/java -enableassertions -Xmx1900m -Djava.security.egd=file:/dev/./urandom -jar <https://builds.apache.org/job/HBase-TRUNK-on-Hadoop-2.0.0/ws/trunk/hbase-server/target/surefire/surefirebooter6397514063755957016.jar> <https://builds.apache.org/job/HBase-TRUNK-on-Hadoop-2.0.0/ws/trunk/hbase-server/target/surefire/surefire3294061485006822025tmp> <https://builds.apache.org/job/HBase-TRUNK-on-Hadoop-2.0.0/ws/trunk/hbase-server/target/surefire/surefire_1167478035478741732580tmp>
Running org.apache.hadoop.hbase.regionserver.TestHRegion
Tests run: 58, Failures: 0, Errors: 0, Skipped: 0, Time elapsed: 41.218 sec
Forking command line: /bin/sh -c cd <https://builds.apache.org/job/HBase-TRUNK-on-Hadoop-2.0.0/ws/trunk/hbase-server> && /home/hudson/tools/java/jdk1.6.0_27-32/jre/bin/java -enableassertions -Xmx1900m -Djava.security.egd=file:/dev/./urandom -jar <https://builds.apache.org/job/HBase-TRUNK-on-Hadoop-2.0.0/ws/trunk/hbase-server/target/surefire/surefirebooter4761976677301895078.jar> <https://builds.apache.org/job/HBase-TRUNK-on-Hadoop-2.0.0/ws/trunk/hbase-server/target/surefire/surefire2514286098392511793tmp> <https://builds.apache.org/job/HBase-TRUNK-on-Hadoop-2.0.0/ws/trunk/hbase-server/target/surefire/surefire_1176693183017140299411tmp>
Running org.apache.hadoop.hbase.client.TestTimestampsFilter
Tests run: 3, Failures: 0, Errors: 0, Skipped: 0, Time elapsed: 21.82 sec
Forking command line: /bin/sh -c cd <https://builds.apache.org/job/HBase-TRUNK-on-Hadoop-2.0.0/ws/trunk/hbase-server> && /home/hudson/tools/java/jdk1.6.0_27-32/jre/bin/java -enableassertions -Xmx1900m -Djava.security.egd=file:/dev/./urandom -jar <https://builds.apache.org/job/HBase-TRUNK-on-Hadoop-2.0.0/ws/trunk/hbase-server/target/surefire/surefirebooter2944018602797149473.jar> <https://builds.apache.org/job/HBase-TRUNK-on-Hadoop-2.0.0/ws/trunk/hbase-server/target/surefire/surefire121567057752872699tmp> <https://builds.apache.org/job/HBase-TRUNK-on-Hadoop-2.0.0/ws/trunk/hbase-server/target/surefire/surefire_1187834218489997650168tmp>
Running org.apache.hadoop.hbase.client.TestHTablePool$TestHTableReusablePool
Tests run: 8, Failures: 0, Errors: 0, Skipped: 0, Time elapsed: 4.658 sec
Running org.apache.hadoop.hbase.client.TestHTablePool$TestHTableThreadLocalPool
Tests run: 8, Failures: 0, Errors: 0, Skipped: 0, Time elapsed: 22.188 sec
Forking command line: /bin/sh -c cd <https://builds.apache.org/job/HBase-TRUNK-on-Hadoop-2.0.0/ws/trunk/hbase-server> && /home/hudson/tools/java/jdk1.6.0_27-32/jre/bin/java -enableassertions -Xmx1900m -Djava.security.egd=file:/dev/./urandom -jar <https://builds.apache.org/job/HBase-TRUNK-on-Hadoop-2.0.0/ws/trunk/hbase-server/target/surefire/surefirebooter6976675163366953768.jar> <https://builds.apache.org/job/HBase-TRUNK-on-Hadoop-2.0.0/ws/trunk/hbase-server/target/surefire/surefire1652771205034475984tmp> <https://builds.apache.org/job/HBase-TRUNK-on-Hadoop-2.0.0/ws/trunk/hbase-server/target/surefire/surefire_119277469067289532232tmp>
Running org.apache.hadoop.hbase.client.TestHTableUtil
Tests run: 2, Failures: 0, Errors: 0, Skipped: 0, Time elapsed: 13.579 sec
Forking command line: /bin/sh -c cd <https://builds.apache.org/job/HBase-TRUNK-on-Hadoop-2.0.0/ws/trunk/hbase-server> && /home/hudson/tools/java/jdk1.6.0_27-32/jre/bin/java -enableassertions -Xmx1900m -Djava.security.egd=file:/dev/./urandom -jar <https://builds.apache.org/job/HBase-TRUNK-on-Hadoop-2.0.0/ws/trunk/hbase-server/target/surefire/surefirebooter1921618366394675753.jar> <https://builds.apache.org/job/HBase-TRUNK-on-Hadoop-2.0.0/ws/trunk/hbase-server/target/surefire/surefire1853919347287876616tmp> <https://builds.apache.org/job/HBase-TRUNK-on-Hadoop-2.0.0/ws/trunk/hbase-server/target/surefire/surefire_1204795031001667153878tmp>
Running org.apache.hadoop.hbase.client.TestMetaScanner
Tests run: 1, Failures: 0, Errors: 0, Skipped: 0, Time elapsed: 14.997 sec
Forking command line: /bin/sh -c cd <https://builds.apache.org/job/HBase-TRUNK-on-Hadoop-2.0.0/ws/trunk/hbase-server> && /home/hudson/tools/java/jdk1.6.0_27-32/jre/bin/java -enableassertions -Xmx1900m -Djava.security.egd=file:/dev/./urandom -jar <https://builds.apache.org/job/HBase-TRUNK-on-Hadoop-2.0.0/ws/trunk/hbase-server/target/surefire/surefirebooter7704167988092968893.jar> <https://builds.apache.org/job/HBase-TRUNK-on-Hadoop-2.0.0/ws/trunk/hbase-server/target/surefire/surefire7869151725926037201tmp> <https://builds.apache.org/job/HBase-TRUNK-on-Hadoop-2.0.0/ws/trunk/hbase-server/target/surefire/surefire_1218811182835466229590tmp>
Running org.apache.hadoop.hbase.client.TestHCM
Tests run: 7, Failures: 0, Errors: 1, Skipped: 0, Time elapsed: 76.468 sec <<< FAILURE!
Forking command line: /bin/sh -c cd <https://builds.apache.org/job/HBase-TRUNK-on-Hadoop-2.0.0/ws/trunk/hbase-server> && /home/hudson/tools/java/jdk1.6.0_27-32/jre/bin/java -enableassertions -Xmx1900m -Djava.security.egd=file:/dev/./urandom -jar <https://builds.apache.org/job/HBase-TRUNK-on-Hadoop-2.0.0/ws/trunk/hbase-server/target/surefire/surefirebooter5371733749666233290.jar> <https://builds.apache.org/job/HBase-TRUNK-on-Hadoop-2.0.0/ws/trunk/hbase-server/target/surefire/surefire5563267119410986316tmp> <https://builds.apache.org/job/HBase-TRUNK-on-Hadoop-2.0.0/ws/trunk/hbase-server/target/surefire/surefire_122520934032881882176tmp>
Running org.apache.hadoop.hbase.client.TestScannersFromClientSide
Tests run: 4, Failures: 0, Errors: 0, Skipped: 0, Time elapsed: 17.809 sec
Forking command line: /bin/sh -c cd <https://builds.apache.org/job/HBase-TRUNK-on-Hadoop-2.0.0/ws/trunk/hbase-server> && /home/hudson/tools/java/jdk1.6.0_27-32/jre/bin/java -enableassertions -Xmx1900m -Djava.security.egd=file:/dev/./urandom -jar <https://builds.apache.org/job/HBase-TRUNK-on-Hadoop-2.0.0/ws/trunk/hbase-server/target/surefire/surefirebooter4753125251515643818.jar> <https://builds.apache.org/job/HBase-TRUNK-on-Hadoop-2.0.0/ws/trunk/hbase-server/target/surefire/surefire3706735375202111451tmp> <https://builds.apache.org/job/HBase-TRUNK-on-Hadoop-2.0.0/ws/trunk/hbase-server/target/surefire/surefire_1234256671336279598464tmp>
Running org.apache.hadoop.hbase.TestMultiVersions
Tests run: 3, Failures: 0, Errors: 0, Skipped: 0, Time elapsed: 22.981 sec
Forking command line: /bin/sh -c cd <https://builds.apache.org/job/HBase-TRUNK-on-Hadoop-2.0.0/ws/trunk/hbase-server> && /home/hudson/tools/java/jdk1.6.0_27-32/jre/bin/java -enableassertions -Xmx1900m -Djava.security.egd=file:/dev/./urandom -jar <https://builds.apache.org/job/HBase-TRUNK-on-Hadoop-2.0.0/ws/trunk/hbase-server/target/surefire/surefirebooter7347778788144252330.jar> <https://builds.apache.org/job/HBase-TRUNK-on-Hadoop-2.0.0/ws/trunk/hbase-server/target/surefire/surefire3317433217440621191tmp> <https://builds.apache.org/job/HBase-TRUNK-on-Hadoop-2.0.0/ws/trunk/hbase-server/target/surefire/surefire_1243693045273367305876tmp>
Running org.apache.hadoop.hbase.client.TestMultiParallel
Tests run: 11, Failures: 0, Errors: 0, Skipped: 0, Time elapsed: 45.893 sec
Forking command line: /bin/sh -c cd <https://builds.apache.org/job/HBase-TRUNK-on-Hadoop-2.0.0/ws/trunk/hbase-server> && /home/hudson/tools/java/jdk1.6.0_27-32/jre/bin/java -enableassertions -Xmx1900m -Djava.security.egd=file:/dev/./urandom -jar <https://builds.apache.org/job/HBase-TRUNK-on-Hadoop-2.0.0/ws/trunk/hbase-server/target/surefire/surefirebooter6279195899147321274.jar> <https://builds.apache.org/job/HBase-TRUNK-on-Hadoop-2.0.0/ws/trunk/hbase-server/target/surefire/surefire1609824315005911992tmp> <https://builds.apache.org/job/HBase-TRUNK-on-Hadoop-2.0.0/ws/trunk/hbase-server/target/surefire/surefire_125810595025458106244tmp>
Running org.apache.hadoop.hbase.master.TestActiveMasterManager
Tests run: 2, Failures: 0, Errors: 0, Skipped: 0, Time elapsed: 1.593 sec
Forking command line: /bin/sh -c cd <https://builds.apache.org/job/HBase-TRUNK-on-Hadoop-2.0.0/ws/trunk/hbase-server> && /home/hudson/tools/java/jdk1.6.0_27-32/jre/bin/java -enableassertions -Xmx1900m -Djava.security.egd=file:/dev/./urandom -jar <https://builds.apache.org/job/HBase-TRUNK-on-Hadoop-2.0.0/ws/trunk/hbase-server/target/surefire/surefirebooter8758581454721528931.jar> <https://builds.apache.org/job/HBase-TRUNK-on-Hadoop-2.0.0/ws/trunk/hbase-server/target/surefire/surefire1839203907950710724tmp> <https://builds.apache.org/job/HBase-TRUNK-on-Hadoop-2.0.0/ws/trunk/hbase-server/target/surefire/surefire_1268390705817383250918tmp>
Running org.apache.hadoop.hbase.master.TestMasterNoCluster
Tests run: 3, Failures: 0, Errors: 0, Skipped: 0, Time elapsed: 7.132 sec
Forking command line: /bin/sh -c cd <https://builds.apache.org/job/HBase-TRUNK-on-Hadoop-2.0.0/ws/trunk/hbase-server> && /home/hudson/tools/java/jdk1.6.0_27-32/jre/bin/java -enableassertions -Xmx1900m -Djava.security.egd=file:/dev/./urandom -jar <https://builds.apache.org/job/HBase-TRUNK-on-Hadoop-2.0.0/ws/trunk/hbase-server/target/surefire/surefirebooter9108364680314712997.jar> <https://builds.apache.org/job/HBase-TRUNK-on-Hadoop-2.0.0/ws/trunk/hbase-server/target/surefire/surefire638076270896131363tmp> <https://builds.apache.org/job/HBase-TRUNK-on-Hadoop-2.0.0/ws/trunk/hbase-server/target/surefire/surefire_1278315305110184576032tmp>
Running org.apache.hadoop.hbase.master.TestMasterMetrics
Tests run: 2, Failures: 0, Errors: 0, Skipped: 0, Time elapsed: 9.296 sec
Forking command line: /bin/sh -c cd <https://builds.apache.org/job/HBase-TRUNK-on-Hadoop-2.0.0/ws/trunk/hbase-server> && /home/hudson/tools/java/jdk1.6.0_27-32/jre/bin/java -enableassertions -Xmx1900m -Djava.security.egd=file:/dev/./urandom -jar <https://builds.apache.org/job/HBase-TRUNK-on-Hadoop-2.0.0/ws/trunk/hbase-server/target/surefire/surefirebooter4823634967972917020.jar> <https://builds.apache.org/job/HBase-TRUNK-on-Hadoop-2.0.0/ws/trunk/hbase-server/target/surefire/surefire1838744094158515836tmp> <https://builds.apache.org/job/HBase-TRUNK-on-Hadoop-2.0.0/ws/trunk/hbase-server/target/surefire/surefire_1287097422399015949897tmp>
Running org.apache.hadoop.hbase.thrift.TestThriftServer
Tests run: 1, Failures: 0, Errors: 0, Skipped: 0, Time elapsed: 76.748 sec
Forking command line: /bin/sh -c cd <https://builds.apache.org/job/HBase-TRUNK-on-Hadoop-2.0.0/ws/trunk/hbase-server> && /home/hudson/tools/java/jdk1.6.0_27-32/jre/bin/java -enableassertions -Xmx1900m -Djava.security.egd=file:/dev/./urandom -jar <https://builds.apache.org/job/HBase-TRUNK-on-Hadoop-2.0.0/ws/trunk/hbase-server/target/surefire/surefirebooter2769703895766025277.jar> <https://builds.apache.org/job/HBase-TRUNK-on-Hadoop-2.0.0/ws/trunk/hbase-server/target/surefire/surefire457893547337828372tmp> <https://builds.apache.org/job/HBase-TRUNK-on-Hadoop-2.0.0/ws/trunk/hbase-server/target/surefire/surefire_1297232257235499899720tmp>
Running org.apache.hadoop.hbase.master.balancer.TestDefaultLoadBalancer
Tests run: 1, Failures: 0, Errors: 0, Skipped: 0, Time elapsed: 1.554 sec
Forking command line: /bin/sh -c cd <https://builds.apache.org/job/HBase-TRUNK-on-Hadoop-2.0.0/ws/trunk/hbase-server> && /home/hudson/tools/java/jdk1.6.0_27-32/jre/bin/java -enableassertions -Xmx1900m -Djava.security.egd=file:/dev/./urandom -jar <https://builds.apache.org/job/HBase-TRUNK-on-Hadoop-2.0.0/ws/trunk/hbase-server/target/surefire/surefirebooter5982169366188976397.jar> <https://builds.apache.org/job/HBase-TRUNK-on-Hadoop-2.0.0/ws/trunk/hbase-server/target/surefire/surefire3352347954373489776tmp> <https://builds.apache.org/job/HBase-TRUNK-on-Hadoop-2.0.0/ws/trunk/hbase-server/target/surefire/surefire_1301194793474925946471tmp>
Running org.apache.hadoop.hbase.master.balancer.TestBaseLoadBalancer
Tests run: 3, Failures: 0, Errors: 0, Skipped: 0, Time elapsed: 0.425 sec
Forking command line: /bin/sh -c cd <https://builds.apache.org/job/HBase-TRUNK-on-Hadoop-2.0.0/ws/trunk/hbase-server> && /home/hudson/tools/java/jdk1.6.0_27-32/jre/bin/java -enableassertions -Xmx1900m -Djava.security.egd=file:/dev/./urandom -jar <https://builds.apache.org/job/HBase-TRUNK-on-Hadoop-2.0.0/ws/trunk/hbase-server/target/surefire/surefirebooter6106395168604946213.jar> <https://builds.apache.org/job/HBase-TRUNK-on-Hadoop-2.0.0/ws/trunk/hbase-server/target/surefire/surefire7410373154502767731tmp> <https://builds.apache.org/job/HBase-TRUNK-on-Hadoop-2.0.0/ws/trunk/hbase-server/target/surefire/surefire_1313666553306380828286tmp>
Running org.apache.hadoop.hbase.master.TestZKBasedOpenCloseRegion
Tests run: 4, Failures: 0, Errors: 0, Skipped: 0, Time elapsed: 17.76 sec
Forking command line: /bin/sh -c cd <https://builds.apache.org/job/HBase-TRUNK-on-Hadoop-2.0.0/ws/trunk/hbase-server> && /home/hudson/tools/java/jdk1.6.0_27-32/jre/bin/java -enableassertions -Xmx1900m -Djava.security.egd=file:/dev/./urandom -jar <https://builds.apache.org/job/HBase-TRUNK-on-Hadoop-2.0.0/ws/trunk/hbase-server/target/surefire/surefirebooter795045912116391967.jar> <https://builds.apache.org/job/HBase-TRUNK-on-Hadoop-2.0.0/ws/trunk/hbase-server/target/surefire/surefire3305291449068136460tmp> <https://builds.apache.org/job/HBase-TRUNK-on-Hadoop-2.0.0/ws/trunk/hbase-server/target/surefire/surefire_1325745751412862836349tmp>
Running org.apache.hadoop.hbase.master.TestMasterFileSystem
Tests run: 1, Failures: 0, Errors: 0, Skipped: 0, Time elapsed: 9.437 sec
Forking command line: /bin/sh -c cd <https://builds.apache.org/job/HBase-TRUNK-on-Hadoop-2.0.0/ws/trunk/hbase-server> && /home/hudson/tools/java/jdk1.6.0_27-32/jre/bin/java -enableassertions -Xmx1900m -Djava.security.egd=file:/dev/./urandom -jar <https://builds.apache.org/job/HBase-TRUNK-on-Hadoop-2.0.0/ws/trunk/hbase-server/target/surefire/surefirebooter3740287519995663762.jar> <https://builds.apache.org/job/HBase-TRUNK-on-Hadoop-2.0.0/ws/trunk/hbase-server/target/surefire/surefire4433182138455602248tmp> <https://builds.apache.org/job/HBase-TRUNK-on-Hadoop-2.0.0/ws/trunk/hbase-server/target/surefire/surefire_1331144150026630778133tmp>
Running org.apache.hadoop.hbase.master.TestMaster
Tests run: 1, Failures: 0, Errors: 0, Skipped: 0, Time elapsed: 13.126 sec
Forking command line: /bin/sh -c cd <https://builds.apache.org/job/HBase-TRUNK-on-Hadoop-2.0.0/ws/trunk/hbase-server> && /home/hudson/tools/java/jdk1.6.0_27-32/jre/bin/java -enableassertions -Xmx1900m -Djava.security.egd=file:/dev/./urandom -jar <https://builds.apache.org/job/HBase-TRUNK-on-Hadoop-2.0.0/ws/trunk/hbase-server/target/surefire/surefirebooter6100809579342849502.jar> <https://builds.apache.org/job/HBase-TRUNK-on-Hadoop-2.0.0/ws/trunk/hbase-server/target/surefire/surefire7659254545328808913tmp> <https://builds.apache.org/job/HBase-TRUNK-on-Hadoop-2.0.0/ws/trunk/hbase-server/target/surefire/surefire_1348661722678543068807tmp>
Running org.apache.hadoop.hbase.master.balancer.TestStochasticLoadBalancer
Tests run: 4, Failures: 0, Errors: 0, Skipped: 0, Time elapsed: 98.946 sec
Forking command line: /bin/sh -c cd <https://builds.apache.org/job/HBase-TRUNK-on-Hadoop-2.0.0/ws/trunk/hbase-server> && /home/hudson/tools/java/jdk1.6.0_27-32/jre/bin/java -enableassertions -Xmx1900m -Djava.security.egd=file:/dev/./urandom -jar <https://builds.apache.org/job/HBase-TRUNK-on-Hadoop-2.0.0/ws/trunk/hbase-server/target/surefire/surefirebooter3330699367219137167.jar> <https://builds.apache.org/job/HBase-TRUNK-on-Hadoop-2.0.0/ws/trunk/hbase-server/target/surefire/surefire3580300967051254772tmp> <https://builds.apache.org/job/HBase-TRUNK-on-Hadoop-2.0.0/ws/trunk/hbase-server/target/surefire/surefire_13599099204626688454tmp>
Running org.apache.hadoop.hbase.master.TestOpenedRegionHandler
Tests run: 2, Failures: 0, Errors: 0, Skipped: 0, Time elapsed: 14.645 sec
Forking command line: /bin/sh -c cd <https://builds.apache.org/job/HBase-TRUNK-on-Hadoop-2.0.0/ws/trunk/hbase-server> && /home/hudson/tools/java/jdk1.6.0_27-32/jre/bin/java -enableassertions -Xmx1900m -Djava.security.egd=file:/dev/./urandom -jar <https://builds.apache.org/job/HBase-TRUNK-on-Hadoop-2.0.0/ws/trunk/hbase-server/target/surefire/surefirebooter3251895779095181747.jar> <https://builds.apache.org/job/HBase-TRUNK-on-Hadoop-2.0.0/ws/trunk/hbase-server/target/surefire/surefire5705338104433220552tmp> <https://builds.apache.org/job/HBase-TRUNK-on-Hadoop-2.0.0/ws/trunk/hbase-server/target/surefire/surefire_1367156400934578545141tmp>
Running org.apache.hadoop.hbase.master.metrics.TestMasterMetricsWrapper
Tests run: 1, Failures: 0, Errors: 0, Skipped: 0, Time elapsed: 11.053 sec
Forking command line: /bin/sh -c cd <https://builds.apache.org/job/HBase-TRUNK-on-Hadoop-2.0.0/ws/trunk/hbase-server> && /home/hudson/tools/java/jdk1.6.0_27-32/jre/bin/java -enableassertions -Xmx1900m -Djava.security.egd=file:/dev/./urandom -jar <https://builds.apache.org/job/HBase-TRUNK-on-Hadoop-2.0.0/ws/trunk/hbase-server/target/surefire/surefirebooter4303168890939314636.jar> <https://builds.apache.org/job/HBase-TRUNK-on-Hadoop-2.0.0/ws/trunk/hbase-server/target/surefire/surefire3028564369774816255tmp> <https://builds.apache.org/job/HBase-TRUNK-on-Hadoop-2.0.0/ws/trunk/hbase-server/target/surefire/surefire_1373578305277558884664tmp>
Running org.apache.hadoop.hbase.master.TestSplitLogManager
Tests run: 13, Failures: 0, Errors: 0, Skipped: 0, Time elapsed: 19.05 sec
Forking command line: /bin/sh -c cd <https://builds.apache.org/job/HBase-TRUNK-on-Hadoop-2.0.0/ws/trunk/hbase-server> && /home/hudson/tools/java/jdk1.6.0_27-32/jre/bin/java -enableassertions -Xmx1900m -Djava.security.egd=file:/dev/./urandom -jar <https://builds.apache.org/job/HBase-TRUNK-on-Hadoop-2.0.0/ws/trunk/hbase-server/target/surefire/surefirebooter1548379587209757037.jar> <https://builds.apache.org/job/HBase-TRUNK-on-Hadoop-2.0.0/ws/trunk/hbase-server/target/surefire/surefire5165743277851370631tmp> <https://builds.apache.org/job/HBase-TRUNK-on-Hadoop-2.0.0/ws/trunk/hbase-server/target/surefire/surefire_1387132436360675136327tmp>
Running org.apache.hadoop.hbase.master.TestAssignmentManager
Tests run: 13, Failures: 0, Errors: 0, Skipped: 0, Time elapsed: 4.534 sec
Forking command line: /bin/sh -c cd <https://builds.apache.org/job/HBase-TRUNK-on-Hadoop-2.0.0/ws/trunk/hbase-server> && /home/hudson/tools/java/jdk1.6.0_27-32/jre/bin/java -enableassertions -Xmx1900m -Djava.security.egd=file:/dev/./urandom -jar <https://builds.apache.org/job/HBase-TRUNK-on-Hadoop-2.0.0/ws/trunk/hbase-server/target/surefire/surefirebooter442415267549101451.jar> <https://builds.apache.org/job/HBase-TRUNK-on-Hadoop-2.0.0/ws/trunk/hbase-server/target/surefire/surefire4444446791578966395tmp> <https://builds.apache.org/job/HBase-TRUNK-on-Hadoop-2.0.0/ws/trunk/hbase-server/target/surefire/surefire_1394137875894364447361tmp>
Running org.apache.hadoop.hbase.master.TestMasterStatusServlet
Tests run: 5, Failures: 0, Errors: 0, Skipped: 0, Time elapsed: 1.317 sec
Forking command line: /bin/sh -c cd <https://builds.apache.org/job/HBase-TRUNK-on-Hadoop-2.0.0/ws/trunk/hbase-server> && /home/hudson/tools/java/jdk1.6.0_27-32/jre/bin/java -enableassertions -Xmx1900m -Djava.security.egd=file:/dev/./urandom -jar <https://builds.apache.org/job/HBase-TRUNK-on-Hadoop-2.0.0/ws/trunk/hbase-server/target/surefire/surefirebooter6756454528814733045.jar> <https://builds.apache.org/job/HBase-TRUNK-on-Hadoop-2.0.0/ws/trunk/hbase-server/target/surefire/surefire7074020204029717969tmp> <https://builds.apache.org/job/HBase-TRUNK-on-Hadoop-2.0.0/ws/trunk/hbase-server/target/surefire/surefire_1401760838024628184529tmp>
Running org.apache.hadoop.hbase.master.TestHMasterRPCException
Tests run: 1, Failures: 0, Errors: 0, Skipped: 0, Time elapsed: 1.371 sec
Forking command line: /bin/sh -c cd <https://builds.apache.org/job/HBase-TRUNK-on-Hadoop-2.0.0/ws/trunk/hbase-server> && /home/hudson/tools/java/jdk1.6.0_27-32/jre/bin/java -enableassertions -Xmx1900m -Djava.security.egd=file:/dev/./urandom -jar <https://builds.apache.org/job/HBase-TRUNK-on-Hadoop-2.0.0/ws/trunk/hbase-server/target/surefire/surefirebooter8696433521064113137.jar> <https://builds.apache.org/job/HBase-TRUNK-on-Hadoop-2.0.0/ws/trunk/hbase-server/target/surefire/surefire6757741444104542484tmp> <https://builds.apache.org/job/HBase-TRUNK-on-Hadoop-2.0.0/ws/trunk/hbase-server/target/surefire/surefire_1413628843116123383597tmp>
Running org.apache.hadoop.hbase.master.cleaner.TestHFileCleaner
Tests run: 3, Failures: 0, Errors: 0, Skipped: 0, Time elapsed: 7.347 sec
Forking command line: /bin/sh -c cd <https://builds.apache.org/job/HBase-TRUNK-on-Hadoop-2.0.0/ws/trunk/hbase-server> && /home/hudson/tools/java/jdk1.6.0_27-32/jre/bin/java -enableassertions -Xmx1900m -Djava.security.egd=file:/dev/./urandom -jar <https://builds.apache.org/job/HBase-TRUNK-on-Hadoop-2.0.0/ws/trunk/hbase-server/target/surefire/surefirebooter5104072943746723810.jar> <https://builds.apache.org/job/HBase-TRUNK-on-Hadoop-2.0.0/ws/trunk/hbase-server/target/surefire/surefire6051654641892669132tmp> <https://builds.apache.org/job/HBase-TRUNK-on-Hadoop-2.0.0/ws/trunk/hbase-server/target/surefire/surefire_1422907692281514215893tmp>
Running org.apache.hadoop.hbase.master.TestAssignmentManagerOnCluster
Tests run: 3, Failures: 0, Errors: 0, Skipped: 0, Time elapsed: 21.954 sec
Forking command line: /bin/sh -c cd <https://builds.apache.org/job/HBase-TRUNK-on-Hadoop-2.0.0/ws/trunk/hbase-server> && /home/hudson/tools/java/jdk1.6.0_27-32/jre/bin/java -enableassertions -Xmx1900m -Djava.security.egd=file:/dev/./urandom -jar <https://builds.apache.org/job/HBase-TRUNK-on-Hadoop-2.0.0/ws/trunk/hbase-server/target/surefire/surefirebooter3076805810894580584.jar> <https://builds.apache.org/job/HBase-TRUNK-on-Hadoop-2.0.0/ws/trunk/hbase-server/target/surefire/surefire7955886012490418551tmp> <https://builds.apache.org/job/HBase-TRUNK-on-Hadoop-2.0.0/ws/trunk/hbase-server/target/surefire/surefire_1432875233954408331283tmp>
Running org.apache.hadoop.hbase.master.cleaner.TestLogsCleaner
Tests run: 1, Failures: 0, Errors: 0, Skipped: 0, Time elapsed: 3.593 sec
Forking command line: /bin/sh -c cd <https://builds.apache.org/job/HBase-TRUNK-on-Hadoop-2.0.0/ws/trunk/hbase-server> && /home/hudson/tools/java/jdk1.6.0_27-32/jre/bin/java -enableassertions -Xmx1900m -Djava.security.egd=file:/dev/./urandom -jar <https://builds.apache.org/job/HBase-TRUNK-on-Hadoop-2.0.0/ws/trunk/hbase-server/target/surefire/surefirebooter2111569910010859711.jar> <https://builds.apache.org/job/HBase-TRUNK-on-Hadoop-2.0.0/ws/trunk/hbase-server/target/surefire/surefire2998902089068667589tmp> <https://builds.apache.org/job/HBase-TRUNK-on-Hadoop-2.0.0/ws/trunk/hbase-server/target/surefire/surefire_1442064330247456321470tmp>
Running org.apache.hadoop.hbase.ipc.TestProtoBufRpc
Tests run: 1, Failures: 0, Errors: 0, Skipped: 0, Time elapsed: 0.845 sec
Forking command line: /bin/sh -c cd <https://builds.apache.org/job/HBase-TRUNK-on-Hadoop-2.0.0/ws/trunk/hbase-server> && /home/hudson/tools/java/jdk1.6.0_27-32/jre/bin/java -enableassertions -Xmx1900m -Djava.security.egd=file:/dev/./urandom -jar <https://builds.apache.org/job/HBase-TRUNK-on-Hadoop-2.0.0/ws/trunk/hbase-server/target/surefire/surefirebooter987288051261603730.jar> <https://builds.apache.org/job/HBase-TRUNK-on-Hadoop-2.0.0/ws/trunk/hbase-server/target/surefire/surefire7146606204264677356tmp> <https://builds.apache.org/job/HBase-TRUNK-on-Hadoop-2.0.0/ws/trunk/hbase-server/target/surefire/surefire_1454902413191744404300tmp>
Running org.apache.hadoop.hbase.ipc.TestDelayedRpc
Tests run: 4, Failures: 0, Errors: 0, Skipped: 0, Time elapsed: 2.422 sec
Forking command line: /bin/sh -c cd <https://builds.apache.org/job/HBase-TRUNK-on-Hadoop-2.0.0/ws/trunk/hbase-server> && /home/hudson/tools/java/jdk1.6.0_27-32/jre/bin/java -enableassertions -Xmx1900m -Djava.security.egd=file:/dev/./urandom -jar <https://builds.apache.org/job/HBase-TRUNK-on-Hadoop-2.0.0/ws/trunk/hbase-server/target/surefire/surefirebooter2285323757111775828.jar> <https://builds.apache.org/job/HBase-TRUNK-on-Hadoop-2.0.0/ws/trunk/hbase-server/target/surefire/surefire1678225298332370931tmp> <https://builds.apache.org/job/HBase-TRUNK-on-Hadoop-2.0.0/ws/trunk/hbase-server/target/surefire/surefire_146408969883641936815tmp>
Running org.apache.hadoop.hbase.ipc.TestHBaseClient
Tests run: 1, Failures: 0, Errors: 0, Skipped: 0, Time elapsed: 0.232 sec
Forking command line: /bin/sh -c cd <https://builds.apache.org/job/HBase-TRUNK-on-Hadoop-2.0.0/ws/trunk/hbase-server> && /home/hudson/tools/java/jdk1.6.0_27-32/jre/bin/java -enableassertions -Xmx1900m -Djava.security.egd=file:/dev/./urandom -jar <https://builds.apache.org/job/HBase-TRUNK-on-Hadoop-2.0.0/ws/trunk/hbase-server/target/surefire/surefirebooter1064295534899072755.jar> <https://builds.apache.org/job/HBase-TRUNK-on-Hadoop-2.0.0/ws/trunk/hbase-server/target/surefire/surefire1268714871475705739tmp> <https://builds.apache.org/job/HBase-TRUNK-on-Hadoop-2.0.0/ws/trunk/hbase-server/target/surefire/surefire_1472748230927407004469tmp>
Running org.apache.hadoop.hbase.thrift2.TestThriftHBaseServiceHandler
Tests run: 12, Failures: 0, Errors: 0, Skipped: 0, Time elapsed: 12.284 sec
Forking command line: /bin/sh -c cd <https://builds.apache.org/job/HBase-TRUNK-on-Hadoop-2.0.0/ws/trunk/hbase-server> && /home/hudson/tools/java/jdk1.6.0_27-32/jre/bin/java -enableassertions -Xmx1900m -Djava.security.egd=file:/dev/./urandom -jar <https://builds.apache.org/job/HBase-TRUNK-on-Hadoop-2.0.0/ws/trunk/hbase-server/target/surefire/surefirebooter1191131365205570988.jar> <https://builds.apache.org/job/HBase-TRUNK-on-Hadoop-2.0.0/ws/trunk/hbase-server/target/surefire/surefire8568480159344464930tmp> <https://builds.apache.org/job/HBase-TRUNK-on-Hadoop-2.0.0/ws/trunk/hbase-server/target/surefire/surefire_1485355404563841962199tmp>
Running org.apache.hadoop.hbase.TestInfoServers
Tests run: 3, Failures: 0, Errors: 0, Skipped: 0, Time elapsed: 14.359 sec
Running org.apache.hadoop.hbase.TestAcidGuarantees
Tests run: 3, Failures: 0, Errors: 0, Skipped: 0, Time elapsed: 88.832 sec

Results :

Failed tests:   testMROnTable(org.apache.hadoop.hbase.mapreduce.TestImportTsv)

Tests in error: 
  testRegionCaching(org.apache.hadoop.hbase.client.TestHCM): test timed out after 60000 milliseconds

Tests run: 724, Failures: 1, Errors: 1, Skipped: 2

[INFO]                                                                         
[INFO] ------------------------------------------------------------------------
[INFO] Skipping HBase
[INFO] This project has been banned from the build due to previous failures.
[INFO] ------------------------------------------------------------------------
[INFO] ------------------------------------------------------------------------
[INFO] Reactor Summary:
[INFO] 
[INFO] HBase ............................................. SUCCESS [3.839s]
[INFO] HBase - Common .................................... SUCCESS [14.529s]
[INFO] HBase - Hadoop Compatibility ...................... SUCCESS [0.903s]
[INFO] HBase - Hadoop Two Compatibility .................. SUCCESS [2.498s]
[INFO] HBase - Server .................................... FAILURE [31:31.927s]
[INFO] HBase - Hadoop One Compatibility .................. SKIPPED
[INFO] HBase - Integration Tests ......................... SKIPPED
[INFO] ------------------------------------------------------------------------
[INFO] BUILD FAILURE
[INFO] ------------------------------------------------------------------------
[INFO] Total time: 31:56.791s
[INFO] Finished at: Wed Oct 24 12:24:58 UTC 2012
[INFO] Final Memory: 54M/766M
[INFO] ------------------------------------------------------------------------
[ERROR] Failed to execute goal org.apache.maven.plugins:maven-surefire-plugin:2.12-TRUNK-HBASE-2:test (secondPartTestsExecution) on project hbase-server: There are test failures.
[ERROR] 
[ERROR] Please refer to <https://builds.apache.org/job/HBase-TRUNK-on-Hadoop-2.0.0/ws/trunk/hbase-server/target/surefire-reports> for the individual test results.
[ERROR] -> [Help 1]
org.apache.maven.lifecycle.LifecycleExecutionException: Failed to execute goal org.apache.maven.plugins:maven-surefire-plugin:2.12-TRUNK-HBASE-2:test (secondPartTestsExecution) on project hbase-server: There are test failures.

Please refer to <https://builds.apache.org/job/HBase-TRUNK-on-Hadoop-2.0.0/ws/trunk/hbase-server/target/surefire-reports> for the individual test results.
	at org.apache.maven.lifecycle.internal.MojoExecutor.execute(MojoExecutor.java:213)
	at org.apache.maven.lifecycle.internal.MojoExecutor.execute(MojoExecutor.java:153)
	at org.apache.maven.lifecycle.internal.MojoExecutor.execute(MojoExecutor.java:145)
	at org.apache.maven.lifecycle.internal.LifecycleModuleBuilder.buildProject(LifecycleModuleBuilder.java:84)
	at org.apache.maven.lifecycle.internal.LifecycleModuleBuilder.buildProject(LifecycleModuleBuilder.java:59)
	at org.apache.maven.lifecycle.internal.LifecycleStarter.singleThreadedBuild(LifecycleStarter.java:183)
	at org.apache.maven.lifecycle.internal.LifecycleStarter.execute(LifecycleStarter.java:161)
	at org.apache.maven.DefaultMaven.doExecute(DefaultMaven.java:319)
	at org.apache.maven.DefaultMaven.execute(DefaultMaven.java:156)
	at org.apache.maven.cli.MavenCli.execute(MavenCli.java:537)
	at org.apache.maven.cli.MavenCli.doMain(MavenCli.java:196)
	at org.apache.maven.cli.MavenCli.main(MavenCli.java:141)
	at sun.reflect.NativeMethodAccessorImpl.invoke0(Native Method)
	at sun.reflect.NativeMethodAccessorImpl.invoke(NativeMethodAccessorImpl.java:39)
	at sun.reflect.DelegatingMethodAccessorImpl.invoke(DelegatingMethodAccessorImpl.java:25)
	at java.lang.reflect.Method.invoke(Method.java:597)
	at org.codehaus.plexus.classworlds.launcher.Launcher.launchEnhanced(Launcher.java:290)
	at org.codehaus.plexus.classworlds.launcher.Launcher.launch(Launcher.java:230)
	at org.codehaus.plexus.classworlds.launcher.Launcher.mainWithExitCode(Launcher.java:409)
	at org.codehaus.plexus.classworlds.launcher.Launcher.main(Launcher.java:352)
Caused by: org.apache.maven.plugin.MojoFailureException: There are test failures.

Please refer to <https://builds.apache.org/job/HBase-TRUNK-on-Hadoop-2.0.0/ws/trunk/hbase-server/target/surefire-reports> for the individual test results.
	at org.apache.maven.plugin.surefire.SurefireHelper.reportExecution(SurefireHelper.java:87)
	at org.apache.maven.plugin.surefire.SurefirePlugin.writeSummary(SurefirePlugin.java:651)
	at org.apache.maven.plugin.surefire.SurefirePlugin.handleSummary(SurefirePlugin.java:625)
	at org.apache.maven.plugin.surefire.AbstractSurefireMojo.executeAfterPreconditionsChecked(AbstractSurefireMojo.java:137)
	at org.apache.maven.plugin.surefire.AbstractSurefireMojo.execute(AbstractSurefireMojo.java:98)
	at org.apache.maven.plugin.DefaultBuildPluginManager.executeMojo(DefaultBuildPluginManager.java:101)
	at org.apache.maven.lifecycle.internal.MojoExecutor.execute(MojoExecutor.java:209)
	... 19 more
[ERROR] 
[ERROR] 
[ERROR] For more information about the errors and possible solutions, please read the following articles:
[ERROR] [Help 1] http://cwiki.apache.org/confluence/display/MAVEN/MojoFailureException
[ERROR] 
[ERROR] After correcting the problems, you can resume the build with the command
[ERROR]   mvn <goals> -rf :hbase-server
Build step 'Invoke top-level Maven targets' marked build as failure
Archiving artifacts
Recording test results
Updating HBASE-6843
Updating HBASE-7018
Updating HBASE-7037

Mime
View raw message