hbase-dev mailing list archives

Site index · List index
Message view « Date » · « Thread »
Top « Date » · « Thread »
From Apache Jenkins Server <jenk...@builds.apache.org>
Subject Build failed in Jenkins: HBase-TRUNK #3399
Date Mon, 01 Oct 2012 19:05:49 GMT
See <https://builds.apache.org/job/HBase-TRUNK/3399/changes>

Changes:

[jxiang] HBASE-6901 Store file compactSelection throws ArrayIndexOutOfBoundsException

------------------------------------------
[...truncated 3041 lines...]
Tests run: 10, Failures: 0, Errors: 4, Skipped: 0, Time elapsed: 455.458 sec <<<
FAILURE!
Running org.apache.hadoop.hbase.mapreduce.TestImportTsv
Tests run: 13, Failures: 0, Errors: 4, Skipped: 0, Time elapsed: 443.421 sec <<<
FAILURE!

Results :

Failed tests:   testLeaderSelection(org.apache.hadoop.hbase.zookeeper.TestZKLeaderManager):
Leader should exist

Tests in error: 
  org.apache.hadoop.hbase.io.encoding.TestChangingEncoding: Shutting down
  org.apache.hadoop.hbase.io.encoding.TestUpgradeFromHFileV1ToEncoding: Shutting down
  loadTest[0](org.apache.hadoop.hbase.io.encoding.TestLoadAndSwitchEncodeOnDisk): Shutting
down
  testRebalanceOnRegionServerNumberChange[0](org.apache.hadoop.hbase.TestRegionRebalancing):
Shutting down
  testRebalanceOnRegionServerNumberChange[1](org.apache.hadoop.hbase.TestRegionRebalancing):
Shutting down
  org.apache.hadoop.hbase.security.access.TestAccessControlFilter: Shutting down
  org.apache.hadoop.hbase.security.access.TestTablePermissions: Shutting down
  org.apache.hadoop.hbase.security.access.TestAccessController: Shutting down
  org.apache.hadoop.hbase.security.access.TestZKPermissionsWatcher: Shutting down
  testLocalHBaseCluster(org.apache.hadoop.hbase.TestLocalHBaseCluster): Failed construction
of Master: class org.apache.hadoop.hbase.TestLocalHBaseCluster$MyHMasterKeeperErrorCode =
ConnectionLoss for /hbase
  org.apache.hadoop.hbase.security.token.TestTokenAuthentication: Shutting down
  org.apache.hadoop.hbase.TestInfoServers: Shutting down
  testTableStates(org.apache.hadoop.hbase.zookeeper.TestZKTable): testDisabled-0x13a1d6803790000-0x13a1d6803790000-0x13a1d6803790000-0x13a1d6803790000
Unexpected KeeperException creating base node
  org.apache.hadoop.hbase.util.TestHBaseFsck: Shutting down
  testMetaRebuildOverlapFail(org.apache.hadoop.hbase.util.hbck.TestOfflineMetaRebuildOverlap):
Shutting down
  testMetaRebuild(org.apache.hadoop.hbase.util.hbck.TestOfflineMetaRebuildBase): Shutting
down
  testMetaRebuildHoleFail(org.apache.hadoop.hbase.util.hbck.TestOfflineMetaRebuildHole): Shutting
down
  testNodeTracker(org.apache.hadoop.hbase.zookeeper.TestZooKeeperNodeTracker): KeeperErrorCode
= ConnectionLoss for /hbase
  testCleanZNode(org.apache.hadoop.hbase.zookeeper.TestZooKeeperNodeTracker): KeeperErrorCode
= ConnectionLoss for /hbase
  testGetAtomicity(org.apache.hadoop.hbase.TestAcidGuarantees): Shutting down
  testScanAtomicity(org.apache.hadoop.hbase.TestAcidGuarantees): Shutting down
  testMixedAtomicity(org.apache.hadoop.hbase.TestAcidGuarantees): Shutting down
  org.apache.hadoop.hbase.util.TestRegionSplitter: Shutting down
  testMergeTable(org.apache.hadoop.hbase.util.TestMergeTable): Shutting down
  org.apache.hadoop.hbase.util.TestCoprocessorScanPolicy: Shutting down
  loadTest[0](org.apache.hadoop.hbase.util.TestMiniClusterLoadEncoded): Shutting down
  loadTest[1](org.apache.hadoop.hbase.util.TestMiniClusterLoadEncoded): Shutting down
  loadTest[2](org.apache.hadoop.hbase.util.TestMiniClusterLoadEncoded): Shutting down
  loadTest[3](org.apache.hadoop.hbase.util.TestMiniClusterLoadEncoded): Shutting down
  loadTest[0](org.apache.hadoop.hbase.util.TestMiniClusterLoadSequential): Shutting down
  loadTest[1](org.apache.hadoop.hbase.util.TestMiniClusterLoadSequential): Shutting down
  loadTest[2](org.apache.hadoop.hbase.util.TestMiniClusterLoadSequential): Shutting down
  loadTest[3](org.apache.hadoop.hbase.util.TestMiniClusterLoadSequential): Shutting down
  org.apache.hadoop.hbase.rest.TestScannersWithFilters: Shutting down
  loadTest[0](org.apache.hadoop.hbase.util.TestMiniClusterLoadParallel): Shutting down
  loadTest[1](org.apache.hadoop.hbase.util.TestMiniClusterLoadParallel): Shutting down
  loadTest[2](org.apache.hadoop.hbase.util.TestMiniClusterLoadParallel): Shutting down
  loadTest[3](org.apache.hadoop.hbase.util.TestMiniClusterLoadParallel): Shutting down
  org.apache.hadoop.hbase.rest.TestScannerResource: Shutting down
  org.apache.hadoop.hbase.rest.TestGzipFilter: Shutting down
  org.apache.hadoop.hbase.rest.client.TestRemoteAdmin: Shutting down
  org.apache.hadoop.hbase.rest.client.TestRemoteTable: Shutting down
  org.apache.hadoop.hbase.rest.client.TestRemoteTable
  org.apache.hadoop.hbase.rest.TestTableResource: Shutting down
  org.apache.hadoop.hbase.rest.TestRowResource: Shutting down
  org.apache.hadoop.hbase.rest.TestSchemaResource: Shutting down
  org.apache.hadoop.hbase.rest.TestVersionResource: Shutting down
  org.apache.hadoop.hbase.rest.TestMultiRowResource: Shutting down
  org.apache.hadoop.hbase.rest.TestStatusResource: Shutting down
  org.apache.hadoop.hbase.constraint.TestConstraint: Shutting down
  org.apache.hadoop.hbase.filter.TestFilterWrapper: Shutting down
  org.apache.hadoop.hbase.filter.TestFilterWithScanLimits: Shutting down
  org.apache.hadoop.hbase.filter.TestColumnRangeFilter: Shutting down
  org.apache.hadoop.hbase.client.TestScannersFromClientSide: Shutting down
  org.apache.hadoop.hbase.client.TestAdmin: Shutting down
  org.apache.hadoop.hbase.client.TestShell: Shutting down
  org.apache.hadoop.hbase.client.TestScannerTimeout: Shutting down
  org.apache.hadoop.hbase.client.TestFromClientSide: Shutting down
  org.apache.hadoop.hbase.client.TestTimestampsFilter: Shutting down
  org.apache.hadoop.hbase.client.TestMetaScanner: Shutting down
  org.apache.hadoop.hbase.client.TestMultiParallel: Shutting down
  org.apache.hadoop.hbase.client.TestHTableUtil: Shutting down
  org.apache.hadoop.hbase.client.TestMultipleTimestamps: Shutting down
  org.apache.hadoop.hbase.client.TestFromClientSide3: Shutting down
  org.apache.hadoop.hbase.client.TestHCM: Shutting down
  org.apache.hadoop.hbase.client.replication.TestReplicationAdmin: Unable setup the ZooKeeper
connection
  org.apache.hadoop.hbase.client.TestFromClientSideWithCoprocessor: Shutting down
  testMasterShutdown(org.apache.hadoop.hbase.master.TestMasterShutdown): Shutting down
  org.apache.hadoop.hbase.master.TestMasterMetrics: Shutting down
  testRPCException(org.apache.hadoop.hbase.master.TestHMasterRPCException): master:51304-0x13a1d7fbfe90000-0x13a1d7fbfe90000-0x13a1d7fbfe90000-0x13a1d7fbfe90000
Unexpected KeeperException creating base node
  testBasicRollingRestart(org.apache.hadoop.hbase.master.TestRollingRestart): Shutting down
  org.apache.hadoop.hbase.master.TestAssignmentManagerOnCluster: Shutting down
  testActiveMasterManagerFromZK(org.apache.hadoop.hbase.master.TestActiveMasterManager): testActiveMasterManagerFromZK-0x13a1d7f37740000-0x13a1d7f37740000-0x13a1d7f37740000-0x13a1d7f37740000
Unexpected KeeperException creating base node
  testRestartMaster(org.apache.hadoop.hbase.master.TestActiveMasterManager): testActiveMasterManagerFromZK-0x13a1d7f37740001-0x13a1d7f37740001-0x13a1d7f37740001-0x13a1d7f37740001
Unexpected KeeperException creating base node
  org.apache.hadoop.hbase.master.metrics.TestMasterMetricsWrapper: Shutting down
  org.apache.hadoop.hbase.master.TestMasterTransitions: Shutting down
  testShouldNotCompeleteOpenedRegionSuccessfullyIfVersionMismatches(org.apache.hadoop.hbase.master.TestOpenedRegionHandler):
MockServer,123,-1-0x13a1d81d4430000-0x13a1d81d4430000-0x13a1d81d4430000-0x13a1d81d4430000
Unexpected KeeperException creating base node
  testOpenedRegionHandlerOnMasterRestart(org.apache.hadoop.hbase.master.TestOpenedRegionHandler):
Shutting down
  org.apache.hadoop.hbase.master.TestZKBasedOpenCloseRegion: Shutting down
  testLogCleaning(org.apache.hadoop.hbase.master.cleaner.TestLogsCleaner): KeeperErrorCode
= ConnectionLoss for /hbase/replication/peers
  testClusterRestart(org.apache.hadoop.hbase.master.TestRestartCluster): Shutting down
  testRestartClusterAfterKill(org.apache.hadoop.hbase.master.TestRestartCluster): cluster1-0x13a1d8653ae0000-0x13a1d8653ae0000-0x13a1d8653ae0000-0x13a1d8653ae0000
Unexpected KeeperException creating base node
  org.apache.hadoop.hbase.master.TestMaster: Shutting down
  testRecoveredEdits(org.apache.hadoop.hbase.master.TestDistributedLogSplitting): Shutting
down
  testWorkerAbort(org.apache.hadoop.hbase.master.TestDistributedLogSplitting): Shutting down
  testThreeRSAbort(org.apache.hadoop.hbase.master.TestDistributedLogSplitting): Shutting down
  testDelayedDeleteOnFailure(org.apache.hadoop.hbase.master.TestDistributedLogSplitting):
test timed out after 25000 milliseconds
  testMasterFailoverWithMockedRITOnDeadRS(org.apache.hadoop.hbase.master.TestMasterFailover):
Shutting down
  testShouldCheckMasterFailOverWhenMETAIsInOpenedState(org.apache.hadoop.hbase.master.TestMasterFailover):
Shutting down
  testSimpleMasterFailover(org.apache.hadoop.hbase.master.TestMasterFailover): Shutting down
  testMasterFailoverBalancerPersistence(org.apache.hadoop.hbase.master.TestMasterFailover):
Shutting down
  testMasterFailoverWithMockedRIT(org.apache.hadoop.hbase.master.TestMasterFailover): Shutting
down
  testForCheckingIfEnableAndDisableWorksFineAfterSwitch(org.apache.hadoop.hbase.master.TestMasterRestartAfterDisablingTable):
Shutting down
  org.apache.hadoop.hbase.TestFullLogReconstruction: Shutting down
  org.apache.hadoop.hbase.master.TestMasterFileSystem: Shutting down
  org.apache.hadoop.hbase.TestZooKeeper: Shutting down
  testStopDuringStart(org.apache.hadoop.hbase.master.TestMasterNoCluster): KeeperErrorCode
= ConnectionLoss for /hbase
  testFailover(org.apache.hadoop.hbase.master.TestMasterNoCluster): KeeperErrorCode = ConnectionLoss
for /hbase
  testCatalogDeploys(org.apache.hadoop.hbase.master.TestMasterNoCluster): KeeperErrorCode
= ConnectionLoss for /hbase
  testGlobalMemStore(org.apache.hadoop.hbase.TestGlobalMemStoreSize): Shutting down
  org.apache.hadoop.hbase.replication.TestReplicationZookeeper: KeeperErrorCode = ConnectionLoss
for /hbase/replication/peers
  org.apache.hadoop.hbase.replication.TestReplication: cluster1-0x13a1d90cb6e0000-0x13a1d90cb6e0000
Unexpected KeeperException creating base node
  org.apache.hadoop.hbase.replication.TestReplication
  org.apache.hadoop.hbase.replication.regionserver.TestReplicationSink: Shutting down
  org.apache.hadoop.hbase.replication.regionserver.TestReplicationSourceManager: KeeperErrorCode
= ConnectionLoss for /hbase/replication
  org.apache.hadoop.hbase.replication.regionserver.TestReplicationSourceManager
  org.apache.hadoop.hbase.replication.TestMultiSlaveReplication: cluster1-0x13a1d91a3c50000-0x13a1d91a3c50000-0x13a1d91a3c50000-0x13a1d91a3c50000
Unexpected KeeperException creating base node
  testCyclicReplication(org.apache.hadoop.hbase.replication.TestMasterReplication): cluster1-0x13a1d908b2f0000-0x13a1d908b2f0000-0x13a1d908b2f0000-0x13a1d908b2f0000
Unexpected KeeperException creating base node
  testSimplePutDelete(org.apache.hadoop.hbase.replication.TestMasterReplication): cluster1-0x13a1d9237f30000-0x13a1d9237f30000-0x13a1d9237f30000-0x13a1d9237f30000
Unexpected KeeperException creating base node
  org.apache.hadoop.hbase.TestMultiVersions: Shutting down
  testRideOverServerNotRunning(org.apache.hadoop.hbase.catalog.TestMetaReaderEditorNoCluster):
TestMetaReaderEditorNoCluster-0x13a1d93510f0000-0x13a1d93510f0000-0x13a1d93510f0000-0x13a1d93510f0000
Unexpected KeeperException creating base node
  org.apache.hadoop.hbase.catalog.TestMetaReaderEditor: Shutting down
  org.apache.hadoop.hbase.catalog.TestMetaReaderEditor
  testBadOriginalRootLocation(org.apache.hadoop.hbase.catalog.TestCatalogTrackerOnCluster):
Shutting down
  org.apache.hadoop.hbase.catalog.TestMetaMigrationConvertingToPB: Shutting down
  testMultiClusters(org.apache.hadoop.hbase.TestHBaseTestingUtility): Shutting down
  testMiniCluster(org.apache.hadoop.hbase.TestHBaseTestingUtility): Shutting down
  testMultipleStartStop(org.apache.hadoop.hbase.TestHBaseTestingUtility): Shutting down
  org.apache.hadoop.hbase.coprocessor.TestAggregateProtocol: Shutting down
  org.apache.hadoop.hbase.coprocessor.TestRowProcessorEndpoint: Shutting down
  org.apache.hadoop.hbase.coprocessor.TestMasterObserver: Shutting down
  org.apache.hadoop.hbase.coprocessor.TestCoprocessorEndpoint: Shutting down
  org.apache.hadoop.hbase.coprocessor.TestClassLoading: Shutting down
  org.apache.hadoop.hbase.coprocessor.TestRegionObserverInterface: Shutting down
  org.apache.hadoop.hbase.coprocessor.TestMasterCoprocessorExceptionWithRemove: Shutting down
  org.apache.hadoop.hbase.coprocessor.TestRegionServerCoprocessorExceptionWithRemove: Shutting
down
  org.apache.hadoop.hbase.coprocessor.TestMasterCoprocessorExceptionWithAbort: Shutting down
  org.apache.hadoop.hbase.coprocessor.TestWALObserver: Shutting down
  org.apache.hadoop.hbase.coprocessor.example.TestRowCountEndpoint: Shutting down
  org.apache.hadoop.hbase.coprocessor.example.TestZooKeeperScanPolicyObserver: Shutting down
  org.apache.hadoop.hbase.coprocessor.TestRegionServerCoprocessorExceptionWithAbort: Shutting
down
  org.apache.hadoop.hbase.coprocessor.TestRegionObserverBypass: Shutting down
  org.apache.hadoop.hbase.thrift2.TestThriftHBaseServiceHandler: Shutting down
  org.apache.hadoop.hbase.thrift.TestThriftServerCmdLine: Shutting down
  org.apache.hadoop.hbase.thrift.TestThriftServer: Shutting down
  org.apache.hadoop.hbase.trace.TestHTraceHooks: Shutting down
  testDataCorrectnessReplayingRecoveredEdits(org.apache.hadoop.hbase.regionserver.TestHRegionOnCluster):
Shutting down
  testMasterAddressManagerFromZK(org.apache.hadoop.hbase.regionserver.TestMasterAddressManager):
KeeperErrorCode = ConnectionLoss for /hbase
  testgetHDFSBlocksDistribution(org.apache.hadoop.hbase.regionserver.TestHRegion): Shutting
down
  org.apache.hadoop.hbase.regionserver.TestServerCustomProtocol: Shutting down
  org.apache.hadoop.hbase.regionserver.TestStoreFileBlockCacheSummary: Shutting down
  testClusterId(org.apache.hadoop.hbase.regionserver.TestClusterId): Shutting down
  org.apache.hadoop.hbase.regionserver.TestCompactionState: Shutting down
  org.apache.hadoop.hbase.regionserver.TestRSKilledWhenMasterInitializing: Shutting down
  org.apache.hadoop.hbase.regionserver.TestRSKilledWhenMasterInitializing: null not an instance
of org.apache.hadoop.hbase.MiniHBaseCluster
  org.apache.hadoop.hbase.regionserver.TestSplitTransactionOnCluster: Shutting down
  testZKClosingNodeVersionMismatch(org.apache.hadoop.hbase.regionserver.handler.TestCloseRegionHandler):
MockServer,123,-1-0x13a1da503ea0000-0x13a1da503ea0000-0x13a1da503ea0000-0x13a1da503ea0000
Unexpected KeeperException creating base node
  testCloseRegion(org.apache.hadoop.hbase.regionserver.handler.TestCloseRegionHandler): MockServer,123,-1-0x13a1da503ea0001-0x13a1da503ea0001-0x13a1da503ea0001-0x13a1da503ea0001
Unexpected KeeperException creating base node
  testAtomicBulkLoad(org.apache.hadoop.hbase.regionserver.TestHRegionServerBulkLoad): Shutting
down
  testOperationMetrics(org.apache.hadoop.hbase.regionserver.TestRegionServerMetrics): Shutting
down
  testCheckAndMutateMetrics(org.apache.hadoop.hbase.regionserver.TestRegionServerMetrics):
Shutting down
  testRemoveRegionMetrics(org.apache.hadoop.hbase.regionserver.TestRegionServerMetrics): Shutting
down
  testMultipleRegions(org.apache.hadoop.hbase.regionserver.TestRegionServerMetrics): Shutting
down
  testGetNextSize(org.apache.hadoop.hbase.regionserver.TestRegionServerMetrics): Shutting
down
  testAcquireTaskAtStartup(org.apache.hadoop.hbase.regionserver.TestSplitLogWorker): KeeperErrorCode
= ConnectionLoss for /hbase
  testRaceForTask(org.apache.hadoop.hbase.regionserver.TestSplitLogWorker): KeeperErrorCode
= ConnectionLoss for /hbase
  testPreemptTask(org.apache.hadoop.hbase.regionserver.TestSplitLogWorker): KeeperErrorCode
= ConnectionLoss for /hbase
  testMultipleTasks(org.apache.hadoop.hbase.regionserver.TestSplitLogWorker): KeeperErrorCode
= ConnectionLoss for /hbase
  testRescan(org.apache.hadoop.hbase.regionserver.TestSplitLogWorker): KeeperErrorCode = ConnectionLoss
for /hbase
  testFailedUpdateMeta(org.apache.hadoop.hbase.regionserver.handler.TestOpenRegionHandler):
MockServer,123,-1-0x13a1da531db0000-0x13a1da531db0000-0x13a1da531db0000-0x13a1da531db0000
Unexpected KeeperException creating base node
  testYankingRegionFromUnderIt(org.apache.hadoop.hbase.regionserver.handler.TestOpenRegionHandler):
MockServer,123,-1-0x13a1da531db0001-0x13a1da531db0001-0x13a1da531db0001-0x13a1da531db0001
Unexpected KeeperException creating base node
  testFailedOpenRegion(org.apache.hadoop.hbase.regionserver.handler.TestOpenRegionHandler):
MockServer,123,-1-0x13a1da531db0002-0x13a1da531db0002-0x13a1da531db0002-0x13a1da531db0002
Unexpected KeeperException creating base node
  testRSAbortWithUnflushedEdits(org.apache.hadoop.hbase.regionserver.wal.TestLogRollAbort):
Shutting down
  org.apache.hadoop.hbase.regionserver.wal.TestWALReplay: Shutting down
  org.apache.hadoop.hbase.regionserver.wal.TestWALReplayCompressed: Shutting down
  testFlushedSequenceIdsSentToHMaster(org.apache.hadoop.hbase.regionserver.wal.TestHLogFiltering):
Shutting down
  testLogRollOnDatanodeDeath(org.apache.hadoop.hbase.regionserver.wal.TestLogRolling): Shutting
down
  testLogRolling(org.apache.hadoop.hbase.regionserver.wal.TestLogRolling): Shutting down
  org.apache.hadoop.hbase.regionserver.TestEndToEndSplitTransaction: Shutting down
  org.apache.hadoop.hbase.regionserver.TestMXBean: Shutting down
  org.apache.hadoop.hbase.mapred.TestTableMapReduce: Shutting down
  org.apache.hadoop.hbase.mapred.TestTableInputFormat: Shutting down
  org.apache.hadoop.hbase.backup.TestHFileArchiving: Shutting down
  org.apache.hadoop.hbase.backup.example.TestZooKeeperTableArchiveClient: Shutting down
  org.apache.hadoop.hbase.TestDrainingServer: Shutting down
  org.apache.hadoop.hbase.mapreduce.TestTimeRangeMapRed: Shutting down
  testBlockLocation(org.apache.hadoop.hbase.fs.TestBlockReorder): Shutting down
  testHBaseCluster(org.apache.hadoop.hbase.fs.TestBlockReorder): Shutting down
  org.apache.hadoop.hbase.mapreduce.TestRowCounter: Shutting down
  testBootMasterFirst(org.apache.hadoop.hbase.TestClusterBootOrder): Failed construction of
Master: class org.apache.hadoop.hbase.master.HMasterKeeperErrorCode = ConnectionLoss for /hbase
  testBootRegionServerFirst(org.apache.hadoop.hbase.TestClusterBootOrder): Failed construction
of Master: class org.apache.hadoop.hbase.master.HMasterKeeperErrorCode = ConnectionLoss for
/hbase
  org.apache.hadoop.hbase.mapreduce.TestTableInputFormatScan: Shutting down
  org.apache.hadoop.hbase.mapreduce.TestImportExport: Shutting down
  org.apache.hadoop.hbase.mapreduce.TestWALPlayer: Shutting down
  org.apache.hadoop.hbase.mapreduce.TestMultithreadedTableMapper: Shutting down
  org.apache.hadoop.hbase.mapreduce.TestLoadIncrementalHFilesSplitRecovery: Shutting down
  org.apache.hadoop.hbase.mapreduce.TestTableMapReduce: Shutting down
  org.apache.hadoop.hbase.mapreduce.TestLoadIncrementalHFiles: Shutting down
  testMRIncrementalLoad(org.apache.hadoop.hbase.mapreduce.TestHFileOutputFormat): Shutting
down
  testMRIncrementalLoadWithSplit(org.apache.hadoop.hbase.mapreduce.TestHFileOutputFormat):
Shutting down
  testExcludeAllFromMinorCompaction(org.apache.hadoop.hbase.mapreduce.TestHFileOutputFormat):
Shutting down
  testExcludeMinorCompaction(org.apache.hadoop.hbase.mapreduce.TestHFileOutputFormat): Shutting
down
  testBulkOutputWithoutAnExistingTable(org.apache.hadoop.hbase.mapreduce.TestImportTsv): Shutting
down
  testMROnTable(org.apache.hadoop.hbase.mapreduce.TestImportTsv): Shutting down
  testMROnTableWithTimestamp(org.apache.hadoop.hbase.mapreduce.TestImportTsv): Shutting down
  testMROnTableWithCustomMapper(org.apache.hadoop.hbase.mapreduce.TestImportTsv): Shutting
down

Tests run: 617, Failures: 1, Errors: 196, Skipped: 2

[INFO]                                                                         
[INFO] ------------------------------------------------------------------------
[INFO] Skipping HBase
[INFO] This project has been banned from the build due to previous failures.
[INFO] ------------------------------------------------------------------------
[INFO]                                                                         
[INFO] ------------------------------------------------------------------------
[INFO] Skipping HBase
[INFO] This project has been banned from the build due to previous failures.
[INFO] ------------------------------------------------------------------------
[INFO] ------------------------------------------------------------------------
[INFO] Reactor Summary:
[INFO] 
[INFO] HBase ............................................. SUCCESS [9.437s]
[INFO] HBase - Common .................................... SUCCESS [15.534s]
[INFO] HBase - Hadoop Compatibility ...................... SUCCESS [0.699s]
[INFO] HBase - Hadoop One Compatibility .................. SUCCESS [1.405s]
[INFO] HBase - Server .................................... FAILURE [1:34:46.985s]
[INFO] HBase - Hadoop Two Compatibility .................. SKIPPED
[INFO] HBase - Integration Tests ......................... SKIPPED
[INFO] ------------------------------------------------------------------------
[INFO] BUILD FAILURE
[INFO] ------------------------------------------------------------------------
[INFO] Total time: 1:35:15.743s
[INFO] Finished at: Mon Oct 01 19:05:13 UTC 2012
[INFO] Final Memory: 58M/615M
[INFO] ------------------------------------------------------------------------
[ERROR] Failed to execute goal org.apache.maven.plugins:maven-surefire-plugin:2.12-TRUNK-HBASE-2:test
(secondPartTestsExecution) on project hbase-server: Failure or timeout -> [Help 1]
[ERROR] 
[ERROR] To see the full stack trace of the errors, re-run Maven with the -e switch.
[ERROR] Re-run Maven using the -X switch to enable full debug logging.
[ERROR] 
[ERROR] For more information about the errors and possible solutions, please read the following
articles:
[ERROR] [Help 1] http://cwiki.apache.org/confluence/display/MAVEN/MojoExecutionException
[ERROR] 
[ERROR] After correcting the problems, you can resume the build with the command
[ERROR]   mvn <goals> -rf :hbase-server
Build step 'Invoke top-level Maven targets' marked build as failure
Archiving artifacts
Recording test results
Updating HBASE-6901

Mime
View raw message