hbase-dev mailing list archives

Site index · List index
Message view « Date » · « Thread »
Top « Date » · « Thread »
From Apache Jenkins Server <jenk...@builds.apache.org>
Subject Build failed in Jenkins: HBase-TRUNK-on-Hadoop-2.0.0 #205
Date Wed, 03 Oct 2012 11:41:59 GMT
See <https://builds.apache.org/job/HBase-TRUNK-on-Hadoop-2.0.0/205/changes>

Changes:

[stack] HBASE-6928 TestStoreFile sometimes fails with 'Column family prefix used twice'

------------------------------------------
[...truncated 13301 lines...]
Running org.apache.hadoop.hbase.catalog.TestMetaMigrationConvertingToPB
Tests run: 3, Failures: 0, Errors: 0, Skipped: 0, Time elapsed: 30.011 sec
Forking command line: /bin/sh -c cd <https://builds.apache.org/job/HBase-TRUNK-on-Hadoop-2.0.0/ws/trunk/hbase-server> && /home/jenkins/tools/java/jdk1.6.0_27-32/jre/bin/java -enableassertions -Xmx1900m -Djava.security.egd=file:/dev/./urandom -jar <https://builds.apache.org/job/HBase-TRUNK-on-Hadoop-2.0.0/ws/trunk/hbase-server/target/surefire/surefirebooter1317317427549985838.jar> <https://builds.apache.org/job/HBase-TRUNK-on-Hadoop-2.0.0/ws/trunk/hbase-server/target/surefire/surefire8709372368497191295tmp> <https://builds.apache.org/job/HBase-TRUNK-on-Hadoop-2.0.0/ws/trunk/hbase-server/target/surefire/surefire_917385176467409537848tmp>
Running org.apache.hadoop.hbase.coprocessor.TestRowProcessorEndpoint
Tests run: 4, Failures: 0, Errors: 0, Skipped: 0, Time elapsed: 29.465 sec
Forking command line: /bin/sh -c cd <https://builds.apache.org/job/HBase-TRUNK-on-Hadoop-2.0.0/ws/trunk/hbase-server> && /home/jenkins/tools/java/jdk1.6.0_27-32/jre/bin/java -enableassertions -Xmx1900m -Djava.security.egd=file:/dev/./urandom -jar <https://builds.apache.org/job/HBase-TRUNK-on-Hadoop-2.0.0/ws/trunk/hbase-server/target/surefire/surefirebooter8177570533454722209.jar> <https://builds.apache.org/job/HBase-TRUNK-on-Hadoop-2.0.0/ws/trunk/hbase-server/target/surefire/surefire1271312306191117628tmp> <https://builds.apache.org/job/HBase-TRUNK-on-Hadoop-2.0.0/ws/trunk/hbase-server/target/surefire/surefire_9211867014938209006tmp>
Running org.apache.hadoop.hbase.coprocessor.TestMasterObserver
Tests run: 3, Failures: 0, Errors: 0, Skipped: 0, Time elapsed: 23.624 sec
Forking command line: /bin/sh -c cd <https://builds.apache.org/job/HBase-TRUNK-on-Hadoop-2.0.0/ws/trunk/hbase-server> && /home/jenkins/tools/java/jdk1.6.0_27-32/jre/bin/java -enableassertions -Xmx1900m -Djava.security.egd=file:/dev/./urandom -jar <https://builds.apache.org/job/HBase-TRUNK-on-Hadoop-2.0.0/ws/trunk/hbase-server/target/surefire/surefirebooter3467611568988903914.jar> <https://builds.apache.org/job/HBase-TRUNK-on-Hadoop-2.0.0/ws/trunk/hbase-server/target/surefire/surefire1985104414616178164tmp> <https://builds.apache.org/job/HBase-TRUNK-on-Hadoop-2.0.0/ws/trunk/hbase-server/target/surefire/surefire_937527850634552458906tmp>
Running org.apache.hadoop.hbase.coprocessor.TestCoprocessorEndpoint
Tests run: 3, Failures: 0, Errors: 0, Skipped: 0, Time elapsed: 9.637 sec
Forking command line: /bin/sh -c cd <https://builds.apache.org/job/HBase-TRUNK-on-Hadoop-2.0.0/ws/trunk/hbase-server> && /home/jenkins/tools/java/jdk1.6.0_27-32/jre/bin/java -enableassertions -Xmx1900m -Djava.security.egd=file:/dev/./urandom -jar <https://builds.apache.org/job/HBase-TRUNK-on-Hadoop-2.0.0/ws/trunk/hbase-server/target/surefire/surefirebooter84652287726659388.jar> <https://builds.apache.org/job/HBase-TRUNK-on-Hadoop-2.0.0/ws/trunk/hbase-server/target/surefire/surefire4470949628378310808tmp> <https://builds.apache.org/job/HBase-TRUNK-on-Hadoop-2.0.0/ws/trunk/hbase-server/target/surefire/surefire_948337189189468436936tmp>
Running org.apache.hadoop.hbase.coprocessor.TestClassLoading
Tests run: 7, Failures: 0, Errors: 0, Skipped: 0, Time elapsed: 33.351 sec
Forking command line: /bin/sh -c cd <https://builds.apache.org/job/HBase-TRUNK-on-Hadoop-2.0.0/ws/trunk/hbase-server> && /home/jenkins/tools/java/jdk1.6.0_27-32/jre/bin/java -enableassertions -Xmx1900m -Djava.security.egd=file:/dev/./urandom -jar <https://builds.apache.org/job/HBase-TRUNK-on-Hadoop-2.0.0/ws/trunk/hbase-server/target/surefire/surefirebooter8200505289822914214.jar> <https://builds.apache.org/job/HBase-TRUNK-on-Hadoop-2.0.0/ws/trunk/hbase-server/target/surefire/surefire7062191006320697314tmp> <https://builds.apache.org/job/HBase-TRUNK-on-Hadoop-2.0.0/ws/trunk/hbase-server/target/surefire/surefire_957641628674001679390tmp>
Running org.apache.hadoop.hbase.coprocessor.TestRegionObserverInterface
Tests run: 7, Failures: 0, Errors: 0, Skipped: 0, Time elapsed: 28.421 sec
Forking command line: /bin/sh -c cd <https://builds.apache.org/job/HBase-TRUNK-on-Hadoop-2.0.0/ws/trunk/hbase-server> && /home/jenkins/tools/java/jdk1.6.0_27-32/jre/bin/java -enableassertions -Xmx1900m -Djava.security.egd=file:/dev/./urandom -jar <https://builds.apache.org/job/HBase-TRUNK-on-Hadoop-2.0.0/ws/trunk/hbase-server/target/surefire/surefirebooter7952628095050778290.jar> <https://builds.apache.org/job/HBase-TRUNK-on-Hadoop-2.0.0/ws/trunk/hbase-server/target/surefire/surefire4805879646752427806tmp> <https://builds.apache.org/job/HBase-TRUNK-on-Hadoop-2.0.0/ws/trunk/hbase-server/target/surefire/surefire_96325950870285796346tmp>
Running org.apache.hadoop.hbase.coprocessor.TestMasterCoprocessorExceptionWithRemove
Tests run: 1, Failures: 0, Errors: 0, Skipped: 0, Time elapsed: 12.583 sec
Forking command line: /bin/sh -c cd <https://builds.apache.org/job/HBase-TRUNK-on-Hadoop-2.0.0/ws/trunk/hbase-server> && /home/jenkins/tools/java/jdk1.6.0_27-32/jre/bin/java -enableassertions -Xmx1900m -Djava.security.egd=file:/dev/./urandom -jar <https://builds.apache.org/job/HBase-TRUNK-on-Hadoop-2.0.0/ws/trunk/hbase-server/target/surefire/surefirebooter2782042790283198099.jar> <https://builds.apache.org/job/HBase-TRUNK-on-Hadoop-2.0.0/ws/trunk/hbase-server/target/surefire/surefire8940988578104114679tmp> <https://builds.apache.org/job/HBase-TRUNK-on-Hadoop-2.0.0/ws/trunk/hbase-server/target/surefire/surefire_978065678349774553623tmp>
Running org.apache.hadoop.hbase.coprocessor.TestRegionServerCoprocessorExceptionWithRemove
Tests run: 1, Failures: 0, Errors: 0, Skipped: 0, Time elapsed: 12.907 sec
Forking command line: /bin/sh -c cd <https://builds.apache.org/job/HBase-TRUNK-on-Hadoop-2.0.0/ws/trunk/hbase-server> && /home/jenkins/tools/java/jdk1.6.0_27-32/jre/bin/java -enableassertions -Xmx1900m -Djava.security.egd=file:/dev/./urandom -jar <https://builds.apache.org/job/HBase-TRUNK-on-Hadoop-2.0.0/ws/trunk/hbase-server/target/surefire/surefirebooter6723405816436528664.jar> <https://builds.apache.org/job/HBase-TRUNK-on-Hadoop-2.0.0/ws/trunk/hbase-server/target/surefire/surefire1615192473944279415tmp> <https://builds.apache.org/job/HBase-TRUNK-on-Hadoop-2.0.0/ws/trunk/hbase-server/target/surefire/surefire_986572042106015539568tmp>
Running org.apache.hadoop.hbase.coprocessor.TestWALObserver
Tests run: 3, Failures: 0, Errors: 0, Skipped: 0, Time elapsed: 11.573 sec
Forking command line: /bin/sh -c cd <https://builds.apache.org/job/HBase-TRUNK-on-Hadoop-2.0.0/ws/trunk/hbase-server> && /home/jenkins/tools/java/jdk1.6.0_27-32/jre/bin/java -enableassertions -Xmx1900m -Djava.security.egd=file:/dev/./urandom -jar <https://builds.apache.org/job/HBase-TRUNK-on-Hadoop-2.0.0/ws/trunk/hbase-server/target/surefire/surefirebooter274474404357803664.jar> <https://builds.apache.org/job/HBase-TRUNK-on-Hadoop-2.0.0/ws/trunk/hbase-server/target/surefire/surefire2604919907891701614tmp> <https://builds.apache.org/job/HBase-TRUNK-on-Hadoop-2.0.0/ws/trunk/hbase-server/target/surefire/surefire_996311669511255087457tmp>
Running org.apache.hadoop.hbase.coprocessor.TestMasterCoprocessorExceptionWithAbort
Tests run: 1, Failures: 0, Errors: 0, Skipped: 0, Time elapsed: 22.152 sec
Forking command line: /bin/sh -c cd <https://builds.apache.org/job/HBase-TRUNK-on-Hadoop-2.0.0/ws/trunk/hbase-server> && /home/jenkins/tools/java/jdk1.6.0_27-32/jre/bin/java -enableassertions -Xmx1900m -Djava.security.egd=file:/dev/./urandom -jar <https://builds.apache.org/job/HBase-TRUNK-on-Hadoop-2.0.0/ws/trunk/hbase-server/target/surefire/surefirebooter5168016316328871940.jar> <https://builds.apache.org/job/HBase-TRUNK-on-Hadoop-2.0.0/ws/trunk/hbase-server/target/surefire/surefire7321016639568878805tmp> <https://builds.apache.org/job/HBase-TRUNK-on-Hadoop-2.0.0/ws/trunk/hbase-server/target/surefire/surefire_1003401889280664308284tmp>
Running org.apache.hadoop.hbase.coprocessor.example.TestRowCountEndpoint
Tests run: 1, Failures: 0, Errors: 0, Skipped: 0, Time elapsed: 9.419 sec
Forking command line: /bin/sh -c cd <https://builds.apache.org/job/HBase-TRUNK-on-Hadoop-2.0.0/ws/trunk/hbase-server> && /home/jenkins/tools/java/jdk1.6.0_27-32/jre/bin/java -enableassertions -Xmx1900m -Djava.security.egd=file:/dev/./urandom -jar <https://builds.apache.org/job/HBase-TRUNK-on-Hadoop-2.0.0/ws/trunk/hbase-server/target/surefire/surefirebooter8346253214949997926.jar> <https://builds.apache.org/job/HBase-TRUNK-on-Hadoop-2.0.0/ws/trunk/hbase-server/target/surefire/surefire4309836610189369178tmp> <https://builds.apache.org/job/HBase-TRUNK-on-Hadoop-2.0.0/ws/trunk/hbase-server/target/surefire/surefire_1012590903250443593275tmp>
Running org.apache.hadoop.hbase.coprocessor.example.TestZooKeeperScanPolicyObserver
Tests run: 1, Failures: 0, Errors: 0, Skipped: 0, Time elapsed: 8.379 sec
Forking command line: /bin/sh -c cd <https://builds.apache.org/job/HBase-TRUNK-on-Hadoop-2.0.0/ws/trunk/hbase-server> && /home/jenkins/tools/java/jdk1.6.0_27-32/jre/bin/java -enableassertions -Xmx1900m -Djava.security.egd=file:/dev/./urandom -jar <https://builds.apache.org/job/HBase-TRUNK-on-Hadoop-2.0.0/ws/trunk/hbase-server/target/surefire/surefirebooter1075194194372500348.jar> <https://builds.apache.org/job/HBase-TRUNK-on-Hadoop-2.0.0/ws/trunk/hbase-server/target/surefire/surefire2276761695175632657tmp> <https://builds.apache.org/job/HBase-TRUNK-on-Hadoop-2.0.0/ws/trunk/hbase-server/target/surefire/surefire_1021831331203780398708tmp>
Running org.apache.hadoop.hbase.coprocessor.TestRegionServerCoprocessorExceptionWithAbort
Tests run: 1, Failures: 0, Errors: 0, Skipped: 0, Time elapsed: 13.711 sec
Forking command line: /bin/sh -c cd <https://builds.apache.org/job/HBase-TRUNK-on-Hadoop-2.0.0/ws/trunk/hbase-server> && /home/jenkins/tools/java/jdk1.6.0_27-32/jre/bin/java -enableassertions -Xmx1900m -Djava.security.egd=file:/dev/./urandom -jar <https://builds.apache.org/job/HBase-TRUNK-on-Hadoop-2.0.0/ws/trunk/hbase-server/target/surefire/surefirebooter3753499431187271004.jar> <https://builds.apache.org/job/HBase-TRUNK-on-Hadoop-2.0.0/ws/trunk/hbase-server/target/surefire/surefire3365284634376180458tmp> <https://builds.apache.org/job/HBase-TRUNK-on-Hadoop-2.0.0/ws/trunk/hbase-server/target/surefire/surefire_1035843999600193330488tmp>
Running org.apache.hadoop.hbase.coprocessor.TestRegionObserverBypass
Tests run: 2, Failures: 0, Errors: 0, Skipped: 0, Time elapsed: 9.428 sec
Forking command line: /bin/sh -c cd <https://builds.apache.org/job/HBase-TRUNK-on-Hadoop-2.0.0/ws/trunk/hbase-server> && /home/jenkins/tools/java/jdk1.6.0_27-32/jre/bin/java -enableassertions -Xmx1900m -Djava.security.egd=file:/dev/./urandom -jar <https://builds.apache.org/job/HBase-TRUNK-on-Hadoop-2.0.0/ws/trunk/hbase-server/target/surefire/surefirebooter9101448449863961989.jar> <https://builds.apache.org/job/HBase-TRUNK-on-Hadoop-2.0.0/ws/trunk/hbase-server/target/surefire/surefire8188862494224639475tmp> <https://builds.apache.org/job/HBase-TRUNK-on-Hadoop-2.0.0/ws/trunk/hbase-server/target/surefire/surefire_1041597809834412835432tmp>
Running org.apache.hadoop.hbase.thrift2.TestThriftHBaseServiceHandler
Tests run: 12, Failures: 0, Errors: 0, Skipped: 0, Time elapsed: 8.831 sec
Forking command line: /bin/sh -c cd <https://builds.apache.org/job/HBase-TRUNK-on-Hadoop-2.0.0/ws/trunk/hbase-server> && /home/jenkins/tools/java/jdk1.6.0_27-32/jre/bin/java -enableassertions -Xmx1900m -Djava.security.egd=file:/dev/./urandom -jar <https://builds.apache.org/job/HBase-TRUNK-on-Hadoop-2.0.0/ws/trunk/hbase-server/target/surefire/surefirebooter3890219460147237550.jar> <https://builds.apache.org/job/HBase-TRUNK-on-Hadoop-2.0.0/ws/trunk/hbase-server/target/surefire/surefire484047740948345967tmp> <https://builds.apache.org/job/HBase-TRUNK-on-Hadoop-2.0.0/ws/trunk/hbase-server/target/surefire/surefire_1053698502954932158369tmp>
Running org.apache.hadoop.hbase.trace.TestHTraceHooks
Tests run: 1, Failures: 0, Errors: 0, Skipped: 0, Time elapsed: 9.062 sec
Forking command line: /bin/sh -c cd <https://builds.apache.org/job/HBase-TRUNK-on-Hadoop-2.0.0/ws/trunk/hbase-server> && /home/jenkins/tools/java/jdk1.6.0_27-32/jre/bin/java -enableassertions -Xmx1900m -Djava.security.egd=file:/dev/./urandom -jar <https://builds.apache.org/job/HBase-TRUNK-on-Hadoop-2.0.0/ws/trunk/hbase-server/target/surefire/surefirebooter6061514595238876990.jar> <https://builds.apache.org/job/HBase-TRUNK-on-Hadoop-2.0.0/ws/trunk/hbase-server/target/surefire/surefire327068875878475592tmp> <https://builds.apache.org/job/HBase-TRUNK-on-Hadoop-2.0.0/ws/trunk/hbase-server/target/surefire/surefire_1067628869505388308518tmp>
Running org.apache.hadoop.hbase.regionserver.TestHRegionOnCluster
Tests run: 1, Failures: 0, Errors: 0, Skipped: 0, Time elapsed: 16.069 sec
Forking command line: /bin/sh -c cd <https://builds.apache.org/job/HBase-TRUNK-on-Hadoop-2.0.0/ws/trunk/hbase-server> && /home/jenkins/tools/java/jdk1.6.0_27-32/jre/bin/java -enableassertions -Xmx1900m -Djava.security.egd=file:/dev/./urandom -jar <https://builds.apache.org/job/HBase-TRUNK-on-Hadoop-2.0.0/ws/trunk/hbase-server/target/surefire/surefirebooter1699595609152607255.jar> <https://builds.apache.org/job/HBase-TRUNK-on-Hadoop-2.0.0/ws/trunk/hbase-server/target/surefire/surefire2263214250756427673tmp> <https://builds.apache.org/job/HBase-TRUNK-on-Hadoop-2.0.0/ws/trunk/hbase-server/target/surefire/surefire_1073192269607900091475tmp>
Running org.apache.hadoop.hbase.regionserver.TestMemStore
Tests run: 21, Failures: 0, Errors: 0, Skipped: 0, Time elapsed: 31.68 sec
Forking command line: /bin/sh -c cd <https://builds.apache.org/job/HBase-TRUNK-on-Hadoop-2.0.0/ws/trunk/hbase-server> && /home/jenkins/tools/java/jdk1.6.0_27-32/jre/bin/java -enableassertions -Xmx1900m -Djava.security.egd=file:/dev/./urandom -jar <https://builds.apache.org/job/HBase-TRUNK-on-Hadoop-2.0.0/ws/trunk/hbase-server/target/surefire/surefirebooter1914862130871123986.jar> <https://builds.apache.org/job/HBase-TRUNK-on-Hadoop-2.0.0/ws/trunk/hbase-server/target/surefire/surefire8166806403211253155tmp> <https://builds.apache.org/job/HBase-TRUNK-on-Hadoop-2.0.0/ws/trunk/hbase-server/target/surefire/surefire_1087107688229469774599tmp>
Running org.apache.hadoop.hbase.thrift.TestThriftServer
Tests run: 1, Failures: 0, Errors: 0, Skipped: 0, Time elapsed: 73.346 sec
Forking command line: /bin/sh -c cd <https://builds.apache.org/job/HBase-TRUNK-on-Hadoop-2.0.0/ws/trunk/hbase-server> && /home/jenkins/tools/java/jdk1.6.0_27-32/jre/bin/java -enableassertions -Xmx1900m -Djava.security.egd=file:/dev/./urandom -jar <https://builds.apache.org/job/HBase-TRUNK-on-Hadoop-2.0.0/ws/trunk/hbase-server/target/surefire/surefirebooter7736719500845360964.jar> <https://builds.apache.org/job/HBase-TRUNK-on-Hadoop-2.0.0/ws/trunk/hbase-server/target/surefire/surefire8805611463358812342tmp> <https://builds.apache.org/job/HBase-TRUNK-on-Hadoop-2.0.0/ws/trunk/hbase-server/target/surefire/surefire_1091461716459642714364tmp>
Running org.apache.hadoop.hbase.regionserver.TestMasterAddressManager
Tests run: 1, Failures: 0, Errors: 0, Skipped: 0, Time elapsed: 0.806 sec
Forking command line: /bin/sh -c cd <https://builds.apache.org/job/HBase-TRUNK-on-Hadoop-2.0.0/ws/trunk/hbase-server> && /home/jenkins/tools/java/jdk1.6.0_27-32/jre/bin/java -enableassertions -Xmx1900m -Djava.security.egd=file:/dev/./urandom -jar <https://builds.apache.org/job/HBase-TRUNK-on-Hadoop-2.0.0/ws/trunk/hbase-server/target/surefire/surefirebooter1739825948296626599.jar> <https://builds.apache.org/job/HBase-TRUNK-on-Hadoop-2.0.0/ws/trunk/hbase-server/target/surefire/surefire8573472740768286527tmp> <https://builds.apache.org/job/HBase-TRUNK-on-Hadoop-2.0.0/ws/trunk/hbase-server/target/surefire/surefire_1103345838809722668101tmp>
Running org.apache.hadoop.hbase.regionserver.TestHRegion
Tests run: 68, Failures: 0, Errors: 0, Skipped: 0, Time elapsed: 36.59 sec
Forking command line: /bin/sh -c cd <https://builds.apache.org/job/HBase-TRUNK-on-Hadoop-2.0.0/ws/trunk/hbase-server> && /home/jenkins/tools/java/jdk1.6.0_27-32/jre/bin/java -enableassertions -Xmx1900m -Djava.security.egd=file:/dev/./urandom -jar <https://builds.apache.org/job/HBase-TRUNK-on-Hadoop-2.0.0/ws/trunk/hbase-server/target/surefire/surefirebooter6178105466264189783.jar> <https://builds.apache.org/job/HBase-TRUNK-on-Hadoop-2.0.0/ws/trunk/hbase-server/target/surefire/surefire2887352948226854678tmp> <https://builds.apache.org/job/HBase-TRUNK-on-Hadoop-2.0.0/ws/trunk/hbase-server/target/surefire/surefire_1117613177444311046044tmp>
Running org.apache.hadoop.hbase.regionserver.TestRegionServerMetrics
Tests run: 5, Failures: 0, Errors: 0, Skipped: 0, Time elapsed: 44.115 sec
Forking command line: /bin/sh -c cd <https://builds.apache.org/job/HBase-TRUNK-on-Hadoop-2.0.0/ws/trunk/hbase-server> && /home/jenkins/tools/java/jdk1.6.0_27-32/jre/bin/java -enableassertions -Xmx1900m -Djava.security.egd=file:/dev/./urandom -jar <https://builds.apache.org/job/HBase-TRUNK-on-Hadoop-2.0.0/ws/trunk/hbase-server/target/surefire/surefirebooter5710293201341471663.jar> <https://builds.apache.org/job/HBase-TRUNK-on-Hadoop-2.0.0/ws/trunk/hbase-server/target/surefire/surefire1599557905233985797tmp> <https://builds.apache.org/job/HBase-TRUNK-on-Hadoop-2.0.0/ws/trunk/hbase-server/target/surefire/surefire_1124059212787727379476tmp>
Running org.apache.hadoop.hbase.regionserver.TestCompoundBloomFilter
Tests run: 3, Failures: 0, Errors: 0, Skipped: 0, Time elapsed: 24.93 sec
Forking command line: /bin/sh -c cd <https://builds.apache.org/job/HBase-TRUNK-on-Hadoop-2.0.0/ws/trunk/hbase-server> && /home/jenkins/tools/java/jdk1.6.0_27-32/jre/bin/java -enableassertions -Xmx1900m -Djava.security.egd=file:/dev/./urandom -jar <https://builds.apache.org/job/HBase-TRUNK-on-Hadoop-2.0.0/ws/trunk/hbase-server/target/surefire/surefirebooter8733880315926861219.jar> <https://builds.apache.org/job/HBase-TRUNK-on-Hadoop-2.0.0/ws/trunk/hbase-server/target/surefire/surefire6366684200802372920tmp> <https://builds.apache.org/job/HBase-TRUNK-on-Hadoop-2.0.0/ws/trunk/hbase-server/target/surefire/surefire_1134831810243541748861tmp>
Running org.apache.hadoop.hbase.regionserver.TestCompactionWithCoprocessor
Tests run: 15, Failures: 0, Errors: 0, Skipped: 0, Time elapsed: 39.275 sec
Forking command line: /bin/sh -c cd <https://builds.apache.org/job/HBase-TRUNK-on-Hadoop-2.0.0/ws/trunk/hbase-server> && /home/jenkins/tools/java/jdk1.6.0_27-32/jre/bin/java -enableassertions -Xmx1900m -Djava.security.egd=file:/dev/./urandom -jar <https://builds.apache.org/job/HBase-TRUNK-on-Hadoop-2.0.0/ws/trunk/hbase-server/target/surefire/surefirebooter5310534981686676799.jar> <https://builds.apache.org/job/HBase-TRUNK-on-Hadoop-2.0.0/ws/trunk/hbase-server/target/surefire/surefire1016075436017787372tmp> <https://builds.apache.org/job/HBase-TRUNK-on-Hadoop-2.0.0/ws/trunk/hbase-server/target/surefire/surefire_1143298199692040284030tmp>
Running org.apache.hadoop.hbase.regionserver.TestSplitLogWorker
Tests run: 5, Failures: 0, Errors: 0, Skipped: 0, Time elapsed: 2.367 sec
Forking command line: /bin/sh -c cd <https://builds.apache.org/job/HBase-TRUNK-on-Hadoop-2.0.0/ws/trunk/hbase-server> && /home/jenkins/tools/java/jdk1.6.0_27-32/jre/bin/java -enableassertions -Xmx1900m -Djava.security.egd=file:/dev/./urandom -jar <https://builds.apache.org/job/HBase-TRUNK-on-Hadoop-2.0.0/ws/trunk/hbase-server/target/surefire/surefirebooter4626895799769550839.jar> <https://builds.apache.org/job/HBase-TRUNK-on-Hadoop-2.0.0/ws/trunk/hbase-server/target/surefire/surefire457346349351403608tmp> <https://builds.apache.org/job/HBase-TRUNK-on-Hadoop-2.0.0/ws/trunk/hbase-server/target/surefire/surefire_1152477350300632791892tmp>
Running org.apache.hadoop.hbase.regionserver.TestServerCustomProtocol
Tests run: 7, Failures: 0, Errors: 0, Skipped: 0, Time elapsed: 11.1 sec
Forking command line: /bin/sh -c cd <https://builds.apache.org/job/HBase-TRUNK-on-Hadoop-2.0.0/ws/trunk/hbase-server> && /home/jenkins/tools/java/jdk1.6.0_27-32/jre/bin/java -enableassertions -Xmx1900m -Djava.security.egd=file:/dev/./urandom -jar <https://builds.apache.org/job/HBase-TRUNK-on-Hadoop-2.0.0/ws/trunk/hbase-server/target/surefire/surefirebooter2779881963621410298.jar> <https://builds.apache.org/job/HBase-TRUNK-on-Hadoop-2.0.0/ws/trunk/hbase-server/target/surefire/surefire6939485062175846750tmp> <https://builds.apache.org/job/HBase-TRUNK-on-Hadoop-2.0.0/ws/trunk/hbase-server/target/surefire/surefire_1168793141965140420029tmp>
Running org.apache.hadoop.hbase.regionserver.TestStoreFileBlockCacheSummary
Tests run: 1, Failures: 0, Errors: 0, Skipped: 0, Time elapsed: 10.145 sec
Forking command line: /bin/sh -c cd <https://builds.apache.org/job/HBase-TRUNK-on-Hadoop-2.0.0/ws/trunk/hbase-server> && /home/jenkins/tools/java/jdk1.6.0_27-32/jre/bin/java -enableassertions -Xmx1900m -Djava.security.egd=file:/dev/./urandom -jar <https://builds.apache.org/job/HBase-TRUNK-on-Hadoop-2.0.0/ws/trunk/hbase-server/target/surefire/surefirebooter8898727758478777784.jar> <https://builds.apache.org/job/HBase-TRUNK-on-Hadoop-2.0.0/ws/trunk/hbase-server/target/surefire/surefire2698374950268784586tmp> <https://builds.apache.org/job/HBase-TRUNK-on-Hadoop-2.0.0/ws/trunk/hbase-server/target/surefire/surefire_1172363676805888941176tmp>
Running org.apache.hadoop.hbase.regionserver.TestStore
Tests run: 12, Failures: 0, Errors: 0, Skipped: 0, Time elapsed: 10.065 sec
Forking command line: /bin/sh -c cd <https://builds.apache.org/job/HBase-TRUNK-on-Hadoop-2.0.0/ws/trunk/hbase-server> && /home/jenkins/tools/java/jdk1.6.0_27-32/jre/bin/java -enableassertions -Xmx1900m -Djava.security.egd=file:/dev/./urandom -jar <https://builds.apache.org/job/HBase-TRUNK-on-Hadoop-2.0.0/ws/trunk/hbase-server/target/surefire/surefirebooter7730495060925645288.jar> <https://builds.apache.org/job/HBase-TRUNK-on-Hadoop-2.0.0/ws/trunk/hbase-server/target/surefire/surefire3012174572781953407tmp> <https://builds.apache.org/job/HBase-TRUNK-on-Hadoop-2.0.0/ws/trunk/hbase-server/target/surefire/surefire_1182124278374384599433tmp>
Running org.apache.hadoop.hbase.regionserver.TestAtomicOperation
Tests run: 5, Failures: 0, Errors: 0, Skipped: 0, Time elapsed: 20.28 sec
Forking command line: /bin/sh -c cd <https://builds.apache.org/job/HBase-TRUNK-on-Hadoop-2.0.0/ws/trunk/hbase-server> && /home/jenkins/tools/java/jdk1.6.0_27-32/jre/bin/java -enableassertions -Xmx1900m -Djava.security.egd=file:/dev/./urandom -jar <https://builds.apache.org/job/HBase-TRUNK-on-Hadoop-2.0.0/ws/trunk/hbase-server/target/surefire/surefirebooter2209049029553736520.jar> <https://builds.apache.org/job/HBase-TRUNK-on-Hadoop-2.0.0/ws/trunk/hbase-server/target/surefire/surefire716035829284435612tmp> <https://builds.apache.org/job/HBase-TRUNK-on-Hadoop-2.0.0/ws/trunk/hbase-server/target/surefire/surefire_1195184250856004369996tmp>
Running org.apache.hadoop.hbase.regionserver.TestBlocksRead
Tests run: 4, Failures: 0, Errors: 0, Skipped: 0, Time elapsed: 1.465 sec
Forking command line: /bin/sh -c cd <https://builds.apache.org/job/HBase-TRUNK-on-Hadoop-2.0.0/ws/trunk/hbase-server> && /home/jenkins/tools/java/jdk1.6.0_27-32/jre/bin/java -enableassertions -Xmx1900m -Djava.security.egd=file:/dev/./urandom -jar <https://builds.apache.org/job/HBase-TRUNK-on-Hadoop-2.0.0/ws/trunk/hbase-server/target/surefire/surefirebooter7084962566025051142.jar> <https://builds.apache.org/job/HBase-TRUNK-on-Hadoop-2.0.0/ws/trunk/hbase-server/target/surefire/surefire6894505289798205096tmp> <https://builds.apache.org/job/HBase-TRUNK-on-Hadoop-2.0.0/ws/trunk/hbase-server/target/surefire/surefire_1201858124443098561283tmp>
Running org.apache.hadoop.hbase.regionserver.TestFSErrorsExposed
Tests run: 3, Failures: 0, Errors: 0, Skipped: 1, Time elapsed: 1.008 sec
Forking command line: /bin/sh -c cd <https://builds.apache.org/job/HBase-TRUNK-on-Hadoop-2.0.0/ws/trunk/hbase-server> && /home/jenkins/tools/java/jdk1.6.0_27-32/jre/bin/java -enableassertions -Xmx1900m -Djava.security.egd=file:/dev/./urandom -jar <https://builds.apache.org/job/HBase-TRUNK-on-Hadoop-2.0.0/ws/trunk/hbase-server/target/surefire/surefirebooter9037358514431044956.jar> <https://builds.apache.org/job/HBase-TRUNK-on-Hadoop-2.0.0/ws/trunk/hbase-server/target/surefire/surefire9015749202046334248tmp> <https://builds.apache.org/job/HBase-TRUNK-on-Hadoop-2.0.0/ws/trunk/hbase-server/target/surefire/surefire_1215809299334398631527tmp>
Running org.apache.hadoop.hbase.regionserver.TestSeekOptimizations
Tests run: 6, Failures: 0, Errors: 0, Skipped: 0, Time elapsed: 3.142 sec
Forking command line: /bin/sh -c cd <https://builds.apache.org/job/HBase-TRUNK-on-Hadoop-2.0.0/ws/trunk/hbase-server> && /home/jenkins/tools/java/jdk1.6.0_27-32/jre/bin/java -enableassertions -Xmx1900m -Djava.security.egd=file:/dev/./urandom -jar <https://builds.apache.org/job/HBase-TRUNK-on-Hadoop-2.0.0/ws/trunk/hbase-server/target/surefire/surefirebooter1561701257444468833.jar> <https://builds.apache.org/job/HBase-TRUNK-on-Hadoop-2.0.0/ws/trunk/hbase-server/target/surefire/surefire6314786573772771877tmp> <https://builds.apache.org/job/HBase-TRUNK-on-Hadoop-2.0.0/ws/trunk/hbase-server/target/surefire/surefire_1225874459142315644462tmp>
Running org.apache.hadoop.hbase.regionserver.TestClusterId
Tests run: 1, Failures: 0, Errors: 0, Skipped: 0, Time elapsed: 20.266 sec
Forking command line: /bin/sh -c cd <https://builds.apache.org/job/HBase-TRUNK-on-Hadoop-2.0.0/ws/trunk/hbase-server> && /home/jenkins/tools/java/jdk1.6.0_27-32/jre/bin/java -enableassertions -Xmx1900m -Djava.security.egd=file:/dev/./urandom -jar <https://builds.apache.org/job/HBase-TRUNK-on-Hadoop-2.0.0/ws/trunk/hbase-server/target/surefire/surefirebooter8475887437300868849.jar> <https://builds.apache.org/job/HBase-TRUNK-on-Hadoop-2.0.0/ws/trunk/hbase-server/target/surefire/surefire913567817594183290tmp> <https://builds.apache.org/job/HBase-TRUNK-on-Hadoop-2.0.0/ws/trunk/hbase-server/target/surefire/surefire_1233897583002697500533tmp>
Running org.apache.hadoop.hbase.regionserver.handler.TestCloseRegionHandler
Tests run: 3, Failures: 0, Errors: 0, Skipped: 0, Time elapsed: 1.524 sec
Forking command line: /bin/sh -c cd <https://builds.apache.org/job/HBase-TRUNK-on-Hadoop-2.0.0/ws/trunk/hbase-server> && /home/jenkins/tools/java/jdk1.6.0_27-32/jre/bin/java -enableassertions -Xmx1900m -Djava.security.egd=file:/dev/./urandom -jar <https://builds.apache.org/job/HBase-TRUNK-on-Hadoop-2.0.0/ws/trunk/hbase-server/target/surefire/surefirebooter2101688887494613340.jar> <https://builds.apache.org/job/HBase-TRUNK-on-Hadoop-2.0.0/ws/trunk/hbase-server/target/surefire/surefire4680272146267031195tmp> <https://builds.apache.org/job/HBase-TRUNK-on-Hadoop-2.0.0/ws/trunk/hbase-server/target/surefire/surefire_1242180016787049485423tmp>
Running org.apache.hadoop.hbase.regionserver.handler.TestOpenRegionHandler
Tests run: 3, Failures: 0, Errors: 0, Skipped: 0, Time elapsed: 1.281 sec
Forking command line: /bin/sh -c cd <https://builds.apache.org/job/HBase-TRUNK-on-Hadoop-2.0.0/ws/trunk/hbase-server> && /home/jenkins/tools/java/jdk1.6.0_27-32/jre/bin/java -enableassertions -Xmx1900m -Djava.security.egd=file:/dev/./urandom -jar <https://builds.apache.org/job/HBase-TRUNK-on-Hadoop-2.0.0/ws/trunk/hbase-server/target/surefire/surefirebooter6452470254930033635.jar> <https://builds.apache.org/job/HBase-TRUNK-on-Hadoop-2.0.0/ws/trunk/hbase-server/target/surefire/surefire605773345149851116tmp> <https://builds.apache.org/job/HBase-TRUNK-on-Hadoop-2.0.0/ws/trunk/hbase-server/target/surefire/surefire_1254136171274739626991tmp>
Running org.apache.hadoop.hbase.regionserver.TestGetClosestAtOrBefore
Tests run: 3, Failures: 0, Errors: 0, Skipped: 0, Time elapsed: 1.233 sec
Forking command line: /bin/sh -c cd <https://builds.apache.org/job/HBase-TRUNK-on-Hadoop-2.0.0/ws/trunk/hbase-server> && /home/jenkins/tools/java/jdk1.6.0_27-32/jre/bin/java -enableassertions -Xmx1900m -Djava.security.egd=file:/dev/./urandom -jar <https://builds.apache.org/job/HBase-TRUNK-on-Hadoop-2.0.0/ws/trunk/hbase-server/target/surefire/surefirebooter5037338050892173060.jar> <https://builds.apache.org/job/HBase-TRUNK-on-Hadoop-2.0.0/ws/trunk/hbase-server/target/surefire/surefire3649073190674443064tmp> <https://builds.apache.org/job/HBase-TRUNK-on-Hadoop-2.0.0/ws/trunk/hbase-server/target/surefire/surefire_1262305544185043101164tmp>
Running org.apache.hadoop.hbase.regionserver.TestParallelPut
Tests run: 2, Failures: 0, Errors: 0, Skipped: 0, Time elapsed: 5.172 sec
Forking command line: /bin/sh -c cd <https://builds.apache.org/job/HBase-TRUNK-on-Hadoop-2.0.0/ws/trunk/hbase-server> && /home/jenkins/tools/java/jdk1.6.0_27-32/jre/bin/java -enableassertions -Xmx1900m -Djava.security.egd=file:/dev/./urandom -jar <https://builds.apache.org/job/HBase-TRUNK-on-Hadoop-2.0.0/ws/trunk/hbase-server/target/surefire/surefirebooter3178502999051473530.jar> <https://builds.apache.org/job/HBase-TRUNK-on-Hadoop-2.0.0/ws/trunk/hbase-server/target/surefire/surefire8056143839091387929tmp> <https://builds.apache.org/job/HBase-TRUNK-on-Hadoop-2.0.0/ws/trunk/hbase-server/target/surefire/surefire_1274073374223473714959tmp>
Running org.apache.hadoop.hbase.regionserver.metrics.TestSchemaMetrics
Running org.apache.hadoop.hbase.regionserver.TestCacheOnWriteInSchema
Tests run: 3, Failures: 0, Errors: 0, Skipped: 0, Time elapsed: 1.761 sec
Forking command line: /bin/sh -c cd <https://builds.apache.org/job/HBase-TRUNK-on-Hadoop-2.0.0/ws/trunk/hbase-server> && /home/jenkins/tools/java/jdk1.6.0_27-32/jre/bin/java -enableassertions -Xmx1900m -Djava.security.egd=file:/dev/./urandom -jar <https://builds.apache.org/job/HBase-TRUNK-on-Hadoop-2.0.0/ws/trunk/hbase-server/target/surefire/surefirebooter6790541836951000872.jar> <https://builds.apache.org/job/HBase-TRUNK-on-Hadoop-2.0.0/ws/trunk/hbase-server/target/surefire/surefire8415896625783160824tmp> <https://builds.apache.org/job/HBase-TRUNK-on-Hadoop-2.0.0/ws/trunk/hbase-server/target/surefire/surefire_1283216884915668535240tmp>
Tests run: 6, Failures: 0, Errors: 0, Skipped: 0, Time elapsed: 15.058 sec
Forking command line: /bin/sh -c cd <https://builds.apache.org/job/HBase-TRUNK-on-Hadoop-2.0.0/ws/trunk/hbase-server> && /home/jenkins/tools/java/jdk1.6.0_27-32/jre/bin/java -enableassertions -Xmx1900m -Djava.security.egd=file:/dev/./urandom -jar <https://builds.apache.org/job/HBase-TRUNK-on-Hadoop-2.0.0/ws/trunk/hbase-server/target/surefire/surefirebooter367766712984575678.jar> <https://builds.apache.org/job/HBase-TRUNK-on-Hadoop-2.0.0/ws/trunk/hbase-server/target/surefire/surefire2819746739402718532tmp> <https://builds.apache.org/job/HBase-TRUNK-on-Hadoop-2.0.0/ws/trunk/hbase-server/target/surefire/surefire_1291606329919872922004tmp>
Running org.apache.hadoop.hbase.regionserver.TestPriorityRpc
Tests run: 3, Failures: 0, Errors: 0, Skipped: 0, Time elapsed: 1.194 sec
Forking command line: /bin/sh -c cd <https://builds.apache.org/job/HBase-TRUNK-on-Hadoop-2.0.0/ws/trunk/hbase-server> && /home/jenkins/tools/java/jdk1.6.0_27-32/jre/bin/java -enableassertions -Xmx1900m -Djava.security.egd=file:/dev/./urandom -jar <https://builds.apache.org/job/HBase-TRUNK-on-Hadoop-2.0.0/ws/trunk/hbase-server/target/surefire/surefirebooter7836446455433450515.jar> <https://builds.apache.org/job/HBase-TRUNK-on-Hadoop-2.0.0/ws/trunk/hbase-server/target/surefire/surefire7535090008873983475tmp> <https://builds.apache.org/job/HBase-TRUNK-on-Hadoop-2.0.0/ws/trunk/hbase-server/target/surefire/surefire_1307012042685787109593tmp>
Running org.apache.hadoop.hbase.regionserver.wal.TestWALReplay
Tests run: 7, Failures: 0, Errors: 0, Skipped: 0, Time elapsed: 28.777 sec
Forking command line: /bin/sh -c cd <https://builds.apache.org/job/HBase-TRUNK-on-Hadoop-2.0.0/ws/trunk/hbase-server> && /home/jenkins/tools/java/jdk1.6.0_27-32/jre/bin/java -enableassertions -Xmx1900m -Djava.security.egd=file:/dev/./urandom -jar <https://builds.apache.org/job/HBase-TRUNK-on-Hadoop-2.0.0/ws/trunk/hbase-server/target/surefire/surefirebooter7950385619187849076.jar> <https://builds.apache.org/job/HBase-TRUNK-on-Hadoop-2.0.0/ws/trunk/hbase-server/target/surefire/surefire7065710612423244007tmp> <https://builds.apache.org/job/HBase-TRUNK-on-Hadoop-2.0.0/ws/trunk/hbase-server/target/surefire/surefire_131297294781725978754tmp>
Running org.apache.hadoop.hbase.regionserver.wal.TestLogRollAbort
Tests run: 1, Failures: 0, Errors: 0, Skipped: 0, Time elapsed: 54.269 sec
Forking command line: /bin/sh -c cd <https://builds.apache.org/job/HBase-TRUNK-on-Hadoop-2.0.0/ws/trunk/hbase-server> && /home/jenkins/tools/java/jdk1.6.0_27-32/jre/bin/java -enableassertions -Xmx1900m -Djava.security.egd=file:/dev/./urandom -jar <https://builds.apache.org/job/HBase-TRUNK-on-Hadoop-2.0.0/ws/trunk/hbase-server/target/surefire/surefirebooter7435591150624568785.jar> <https://builds.apache.org/job/HBase-TRUNK-on-Hadoop-2.0.0/ws/trunk/hbase-server/target/surefire/surefire4220240935196795788tmp> <https://builds.apache.org/job/HBase-TRUNK-on-Hadoop-2.0.0/ws/trunk/hbase-server/target/surefire/surefire_1325159635692269648761tmp>
Running org.apache.hadoop.hbase.regionserver.wal.TestWALReplayCompressed
Tests run: 7, Failures: 0, Errors: 0, Skipped: 0, Time elapsed: 29.009 sec
Forking command line: /bin/sh -c cd <https://builds.apache.org/job/HBase-TRUNK-on-Hadoop-2.0.0/ws/trunk/hbase-server> && /home/jenkins/tools/java/jdk1.6.0_27-32/jre/bin/java -enableassertions -Xmx1900m -Djava.security.egd=file:/dev/./urandom -jar <https://builds.apache.org/job/HBase-TRUNK-on-Hadoop-2.0.0/ws/trunk/hbase-server/target/surefire/surefirebooter1148525606084795770.jar> <https://builds.apache.org/job/HBase-TRUNK-on-Hadoop-2.0.0/ws/trunk/hbase-server/target/surefire/surefire6091849178389682088tmp> <https://builds.apache.org/job/HBase-TRUNK-on-Hadoop-2.0.0/ws/trunk/hbase-server/target/surefire/surefire_1335805034069192690412tmp>
Running org.apache.hadoop.hbase.regionserver.TestStoreScanner
Tests run: 16, Failures: 0, Errors: 0, Skipped: 0, Time elapsed: 0.186 sec
Forking command line: /bin/sh -c cd <https://builds.apache.org/job/HBase-TRUNK-on-Hadoop-2.0.0/ws/trunk/hbase-server> && /home/jenkins/tools/java/jdk1.6.0_27-32/jre/bin/java -enableassertions -Xmx1900m -Djava.security.egd=file:/dev/./urandom -jar <https://builds.apache.org/job/HBase-TRUNK-on-Hadoop-2.0.0/ws/trunk/hbase-server/target/surefire/surefirebooter8501171275401222580.jar> <https://builds.apache.org/job/HBase-TRUNK-on-Hadoop-2.0.0/ws/trunk/hbase-server/target/surefire/surefire681966204972512217tmp> <https://builds.apache.org/job/HBase-TRUNK-on-Hadoop-2.0.0/ws/trunk/hbase-server/target/surefire/surefire_1341749214993146342247tmp>
Running org.apache.hadoop.hbase.regionserver.wal.TestHLogFiltering
Tests run: 1, Failures: 0, Errors: 0, Skipped: 0, Time elapsed: 22.204 sec
Forking command line: /bin/sh -c cd <https://builds.apache.org/job/HBase-TRUNK-on-Hadoop-2.0.0/ws/trunk/hbase-server> && /home/jenkins/tools/java/jdk1.6.0_27-32/jre/bin/java -enableassertions -Xmx1900m -Djava.security.egd=file:/dev/./urandom -jar <https://builds.apache.org/job/HBase-TRUNK-on-Hadoop-2.0.0/ws/trunk/hbase-server/target/surefire/surefirebooter3933170131211426085.jar> <https://builds.apache.org/job/HBase-TRUNK-on-Hadoop-2.0.0/ws/trunk/hbase-server/target/surefire/surefire8924041843549283217tmp> <https://builds.apache.org/job/HBase-TRUNK-on-Hadoop-2.0.0/ws/trunk/hbase-server/target/surefire/surefire_1353817342330461468392tmp>
Running org.apache.hadoop.hbase.regionserver.TestMXBean
Tests run: 1, Failures: 0, Errors: 0, Skipped: 0, Time elapsed: 7.573 sec
Forking command line: /bin/sh -c cd <https://builds.apache.org/job/HBase-TRUNK-on-Hadoop-2.0.0/ws/trunk/hbase-server> && /home/jenkins/tools/java/jdk1.6.0_27-32/jre/bin/java -enableassertions -Xmx1900m -Djava.security.egd=file:/dev/./urandom -jar <https://builds.apache.org/job/HBase-TRUNK-on-Hadoop-2.0.0/ws/trunk/hbase-server/target/surefire/surefirebooter374570010615897321.jar> <https://builds.apache.org/job/HBase-TRUNK-on-Hadoop-2.0.0/ws/trunk/hbase-server/target/surefire/surefire316576302009273446tmp> <https://builds.apache.org/job/HBase-TRUNK-on-Hadoop-2.0.0/ws/trunk/hbase-server/target/surefire/surefire_1367823456807289914053tmp>
Running org.apache.hadoop.hbase.regionserver.TestRpcMetrics
Tests run: 1, Failures: 0, Errors: 0, Skipped: 0, Time elapsed: 1.975 sec
Forking command line: /bin/sh -c cd <https://builds.apache.org/job/HBase-TRUNK-on-Hadoop-2.0.0/ws/trunk/hbase-server> && /home/jenkins/tools/java/jdk1.6.0_27-32/jre/bin/java -enableassertions -Xmx1900m -Djava.security.egd=file:/dev/./urandom -jar <https://builds.apache.org/job/HBase-TRUNK-on-Hadoop-2.0.0/ws/trunk/hbase-server/target/surefire/surefirebooter4024869600903076482.jar> <https://builds.apache.org/job/HBase-TRUNK-on-Hadoop-2.0.0/ws/trunk/hbase-server/target/surefire/surefire3083655546993542515tmp> <https://builds.apache.org/job/HBase-TRUNK-on-Hadoop-2.0.0/ws/trunk/hbase-server/target/surefire/surefire_1371205578885300466986tmp>
Running org.apache.hadoop.hbase.regionserver.TestCompaction
Tests run: 15, Failures: 0, Errors: 0, Skipped: 0, Time elapsed: 40.257 sec
Forking command line: /bin/sh -c cd <https://builds.apache.org/job/HBase-TRUNK-on-Hadoop-2.0.0/ws/trunk/hbase-server> && /home/jenkins/tools/java/jdk1.6.0_27-32/jre/bin/java -enableassertions -Xmx1900m -Djava.security.egd=file:/dev/./urandom -jar <https://builds.apache.org/job/HBase-TRUNK-on-Hadoop-2.0.0/ws/trunk/hbase-server/target/surefire/surefirebooter2517218138492693637.jar> <https://builds.apache.org/job/HBase-TRUNK-on-Hadoop-2.0.0/ws/trunk/hbase-server/target/surefire/surefire6920163380495101729tmp> <https://builds.apache.org/job/HBase-TRUNK-on-Hadoop-2.0.0/ws/trunk/hbase-server/target/surefire/surefire_1381925959261252085846tmp>
Running org.apache.hadoop.hbase.regionserver.TestMultiColumnScanner
Tests run: 12, Failures: 0, Errors: 0, Skipped: 0, Time elapsed: 42.284 sec
Forking command line: /bin/sh -c cd <https://builds.apache.org/job/HBase-TRUNK-on-Hadoop-2.0.0/ws/trunk/hbase-server> && /home/jenkins/tools/java/jdk1.6.0_27-32/jre/bin/java -enableassertions -Xmx1900m -Djava.security.egd=file:/dev/./urandom -jar <https://builds.apache.org/job/HBase-TRUNK-on-Hadoop-2.0.0/ws/trunk/hbase-server/target/surefire/surefirebooter5910071191246124146.jar> <https://builds.apache.org/job/HBase-TRUNK-on-Hadoop-2.0.0/ws/trunk/hbase-server/target/surefire/surefire5381869316558809727tmp> <https://builds.apache.org/job/HBase-TRUNK-on-Hadoop-2.0.0/ws/trunk/hbase-server/target/surefire/surefire_1397113701707931611943tmp>
Running org.apache.hadoop.hbase.backup.example.TestZooKeeperTableArchiveClient
Tests run: 3, Failures: 0, Errors: 0, Skipped: 0, Time elapsed: 4.954 sec
Forking command line: /bin/sh -c cd <https://builds.apache.org/job/HBase-TRUNK-on-Hadoop-2.0.0/ws/trunk/hbase-server> && /home/jenkins/tools/java/jdk1.6.0_27-32/jre/bin/java -enableassertions -Xmx1900m -Djava.security.egd=file:/dev/./urandom -jar <https://builds.apache.org/job/HBase-TRUNK-on-Hadoop-2.0.0/ws/trunk/hbase-server/target/surefire/surefirebooter5649086828718792007.jar> <https://builds.apache.org/job/HBase-TRUNK-on-Hadoop-2.0.0/ws/trunk/hbase-server/target/surefire/surefire866125008827958282tmp> <https://builds.apache.org/job/HBase-TRUNK-on-Hadoop-2.0.0/ws/trunk/hbase-server/target/surefire/surefire_1406813098149640702199tmp>
Running org.apache.hadoop.hbase.backup.TestHFileArchiving
Tests run: 3, Failures: 0, Errors: 0, Skipped: 0, Time elapsed: 42.204 sec
Forking command line: /bin/sh -c cd <https://builds.apache.org/job/HBase-TRUNK-on-Hadoop-2.0.0/ws/trunk/hbase-server> && /home/jenkins/tools/java/jdk1.6.0_27-32/jre/bin/java -enableassertions -Xmx1900m -Djava.security.egd=file:/dev/./urandom -jar <https://builds.apache.org/job/HBase-TRUNK-on-Hadoop-2.0.0/ws/trunk/hbase-server/target/surefire/surefirebooter8624098152852967821.jar> <https://builds.apache.org/job/HBase-TRUNK-on-Hadoop-2.0.0/ws/trunk/hbase-server/target/surefire/surefire7903780320087158390tmp> <https://builds.apache.org/job/HBase-TRUNK-on-Hadoop-2.0.0/ws/trunk/hbase-server/target/surefire/surefire_1411852929457802970798tmp>
Running org.apache.hadoop.hbase.TestDrainingServer
Tests run: 2, Failures: 0, Errors: 0, Skipped: 0, Time elapsed: 13.709 sec
Forking command line: /bin/sh -c cd <https://builds.apache.org/job/HBase-TRUNK-on-Hadoop-2.0.0/ws/trunk/hbase-server> && /home/jenkins/tools/java/jdk1.6.0_27-32/jre/bin/java -enableassertions -Xmx1900m -Djava.security.egd=file:/dev/./urandom -jar <https://builds.apache.org/job/HBase-TRUNK-on-Hadoop-2.0.0/ws/trunk/hbase-server/target/surefire/surefirebooter5079130208834423506.jar> <https://builds.apache.org/job/HBase-TRUNK-on-Hadoop-2.0.0/ws/trunk/hbase-server/target/surefire/surefire185631643207898673tmp> <https://builds.apache.org/job/HBase-TRUNK-on-Hadoop-2.0.0/ws/trunk/hbase-server/target/surefire/surefire_1428545571095131640187tmp>
Running org.apache.hadoop.hbase.TestClusterBootOrder
Tests run: 2, Failures: 0, Errors: 0, Skipped: 0, Time elapsed: 22.998 sec
Forking command line: /bin/sh -c cd <https://builds.apache.org/job/HBase-TRUNK-on-Hadoop-2.0.0/ws/trunk/hbase-server> && /home/jenkins/tools/java/jdk1.6.0_27-32/jre/bin/java -enableassertions -Xmx1900m -Djava.security.egd=file:/dev/./urandom -jar <https://builds.apache.org/job/HBase-TRUNK-on-Hadoop-2.0.0/ws/trunk/hbase-server/target/surefire/surefirebooter1651883686035248818.jar> <https://builds.apache.org/job/HBase-TRUNK-on-Hadoop-2.0.0/ws/trunk/hbase-server/target/surefire/surefire7163959118652429315tmp> <https://builds.apache.org/job/HBase-TRUNK-on-Hadoop-2.0.0/ws/trunk/hbase-server/target/surefire/surefire_1435418104477382913493tmp>
Running org.apache.hadoop.hbase.mapreduce.TestRowCounter
Tests run: 3, Failures: 1, Errors: 0, Skipped: 0, Time elapsed: 74.138 sec <<< FAILURE!
Forking command line: /bin/sh -c cd <https://builds.apache.org/job/HBase-TRUNK-on-Hadoop-2.0.0/ws/trunk/hbase-server> && /home/jenkins/tools/java/jdk1.6.0_27-32/jre/bin/java -enableassertions -Xmx1900m -Djava.security.egd=file:/dev/./urandom -jar <https://builds.apache.org/job/HBase-TRUNK-on-Hadoop-2.0.0/ws/trunk/hbase-server/target/surefire/surefirebooter1360277142563876920.jar> <https://builds.apache.org/job/HBase-TRUNK-on-Hadoop-2.0.0/ws/trunk/hbase-server/target/surefire/surefire3915486574116333291tmp> <https://builds.apache.org/job/HBase-TRUNK-on-Hadoop-2.0.0/ws/trunk/hbase-server/target/surefire/surefire_1447785625792397646368tmp>
Running org.apache.hadoop.hbase.mapreduce.TestImportTsv
Tests run: 13, Failures: 1, Errors: 0, Skipped: 0, Time elapsed: 127.595 sec <<< FAILURE!
Forking command line: /bin/sh -c cd <https://builds.apache.org/job/HBase-TRUNK-on-Hadoop-2.0.0/ws/trunk/hbase-server> && /home/jenkins/tools/java/jdk1.6.0_27-32/jre/bin/java -enableassertions -Xmx1900m -Djava.security.egd=file:/dev/./urandom -jar <https://builds.apache.org/job/HBase-TRUNK-on-Hadoop-2.0.0/ws/trunk/hbase-server/target/surefire/surefirebooter5734392217384789391.jar> <https://builds.apache.org/job/HBase-TRUNK-on-Hadoop-2.0.0/ws/trunk/hbase-server/target/surefire/surefire960327688932545292tmp> <https://builds.apache.org/job/HBase-TRUNK-on-Hadoop-2.0.0/ws/trunk/hbase-server/target/surefire/surefire_1456963087110576807428tmp>
Running org.apache.hadoop.hbase.mapreduce.TestHLogRecordReader
Tests run: 2, Failures: 0, Errors: 0, Skipped: 0, Time elapsed: 4.256 sec
Running org.apache.hadoop.hbase.mapreduce.TestImportExport
Tests run: 3, Failures: 1, Errors: 0, Skipped: 0, Time elapsed: 99.331 sec <<< FAILURE!

Results :

Failed tests:   testRowCounterExclusiveColumn(org.apache.hadoop.hbase.mapreduce.TestRowCounter)
  testMROnTableWithCustomMapper(org.apache.hadoop.hbase.mapreduce.TestImportTsv)
  testSimpleCase(org.apache.hadoop.hbase.mapreduce.TestImportExport)

Tests run: 716, Failures: 3, Errors: 0, Skipped: 2

[INFO]                                                                         
[INFO] ------------------------------------------------------------------------
[INFO] Skipping HBase
[INFO] This project has been banned from the build due to previous failures.
[INFO] ------------------------------------------------------------------------
[INFO] ------------------------------------------------------------------------
[INFO] Reactor Summary:
[INFO] 
[INFO] HBase ............................................. SUCCESS [5.339s]
[INFO] HBase - Common .................................... SUCCESS [19.562s]
[INFO] HBase - Hadoop Compatibility ...................... SUCCESS [0.699s]
[INFO] HBase - Hadoop Two Compatibility .................. SUCCESS [2.623s]
[INFO] HBase - Server .................................... FAILURE [23:31.891s]
[INFO] HBase - Hadoop One Compatibility .................. SKIPPED
[INFO] HBase - Integration Tests ......................... SKIPPED
[INFO] ------------------------------------------------------------------------
[INFO] BUILD FAILURE
[INFO] ------------------------------------------------------------------------
[INFO] Total time: 24:04.172s
[INFO] Finished at: Wed Oct 03 11:41:37 UTC 2012
[INFO] Final Memory: 51M/791M
[INFO] ------------------------------------------------------------------------
[ERROR] Failed to execute goal org.apache.maven.plugins:maven-surefire-plugin:2.12-TRUNK-HBASE-2:test (secondPartTestsExecution) on project hbase-server: There are test failures.
[ERROR] 
[ERROR] Please refer to <https://builds.apache.org/job/HBase-TRUNK-on-Hadoop-2.0.0/ws/trunk/hbase-server/target/surefire-reports> for the individual test results.
[ERROR] -> [Help 1]
org.apache.maven.lifecycle.LifecycleExecutionException: Failed to execute goal org.apache.maven.plugins:maven-surefire-plugin:2.12-TRUNK-HBASE-2:test (secondPartTestsExecution) on project hbase-server: There are test failures.

Please refer to <https://builds.apache.org/job/HBase-TRUNK-on-Hadoop-2.0.0/ws/trunk/hbase-server/target/surefire-reports> for the individual test results.
	at org.apache.maven.lifecycle.internal.MojoExecutor.execute(MojoExecutor.java:213)
	at org.apache.maven.lifecycle.internal.MojoExecutor.execute(MojoExecutor.java:153)
	at org.apache.maven.lifecycle.internal.MojoExecutor.execute(MojoExecutor.java:145)
	at org.apache.maven.lifecycle.internal.LifecycleModuleBuilder.buildProject(LifecycleModuleBuilder.java:84)
	at org.apache.maven.lifecycle.internal.LifecycleModuleBuilder.buildProject(LifecycleModuleBuilder.java:59)
	at org.apache.maven.lifecycle.internal.LifecycleStarter.singleThreadedBuild(LifecycleStarter.java:183)
	at org.apache.maven.lifecycle.internal.LifecycleStarter.execute(LifecycleStarter.java:161)
	at org.apache.maven.DefaultMaven.doExecute(DefaultMaven.java:319)
	at org.apache.maven.DefaultMaven.execute(DefaultMaven.java:156)
	at org.apache.maven.cli.MavenCli.execute(MavenCli.java:537)
	at org.apache.maven.cli.MavenCli.doMain(MavenCli.java:196)
	at org.apache.maven.cli.MavenCli.main(MavenCli.java:141)
	at sun.reflect.NativeMethodAccessorImpl.invoke0(Native Method)
	at sun.reflect.NativeMethodAccessorImpl.invoke(NativeMethodAccessorImpl.java:39)
	at sun.reflect.DelegatingMethodAccessorImpl.invoke(DelegatingMethodAccessorImpl.java:25)
	at java.lang.reflect.Method.invoke(Method.java:597)
	at org.codehaus.plexus.classworlds.launcher.Launcher.launchEnhanced(Launcher.java:290)
	at org.codehaus.plexus.classworlds.launcher.Launcher.launch(Launcher.java:230)
	at org.codehaus.plexus.classworlds.launcher.Launcher.mainWithExitCode(Launcher.java:409)
	at org.codehaus.plexus.classworlds.launcher.Launcher.main(Launcher.java:352)
Caused by: org.apache.maven.plugin.MojoFailureException: There are test failures.

Please refer to <https://builds.apache.org/job/HBase-TRUNK-on-Hadoop-2.0.0/ws/trunk/hbase-server/target/surefire-reports> for the individual test results.
	at org.apache.maven.plugin.surefire.SurefireHelper.reportExecution(SurefireHelper.java:87)
	at org.apache.maven.plugin.surefire.SurefirePlugin.writeSummary(SurefirePlugin.java:651)
	at org.apache.maven.plugin.surefire.SurefirePlugin.handleSummary(SurefirePlugin.java:625)
	at org.apache.maven.plugin.surefire.AbstractSurefireMojo.executeAfterPreconditionsChecked(AbstractSurefireMojo.java:137)
	at org.apache.maven.plugin.surefire.AbstractSurefireMojo.execute(AbstractSurefireMojo.java:98)
	at org.apache.maven.plugin.DefaultBuildPluginManager.executeMojo(DefaultBuildPluginManager.java:101)
	at org.apache.maven.lifecycle.internal.MojoExecutor.execute(MojoExecutor.java:209)
	... 19 more
[ERROR] 
[ERROR] 
[ERROR] For more information about the errors and possible solutions, please read the following articles:
[ERROR] [Help 1] http://cwiki.apache.org/confluence/display/MAVEN/MojoFailureException
[ERROR] 
[ERROR] After correcting the problems, you can resume the build with the command
[ERROR]   mvn <goals> -rf :hbase-server
Build step 'Invoke top-level Maven targets' marked build as failure
Archiving artifacts
Recording test results
Updating HBASE-6928

Mime
View raw message