hbase-dev mailing list archives

Site index · List index
Message view « Date » · « Thread »
Top « Date » · « Thread »
From Apache Jenkins Server <jenk...@builds.apache.org>
Subject Build failed in Jenkins: HBase-0.92 #599
Date Thu, 25 Oct 2012 17:27:06 GMT
See <https://builds.apache.org/job/HBase-0.92/599/changes>

Changes:

[tedyu] HBASE-5257 Allow INCLUDE_AND_NEXT_COL in filters and use it in ColumnPaginationFilter
(Varun)

------------------------------------------
[...truncated 1299 lines...]
A         src/packages/rpm/init.d
A         src/packages/rpm/init.d/hbase-regionserver
A         src/packages/rpm/init.d/hbase-master
A         src/packages/rpm/spec
A         src/packages/rpm/spec/conf-pseudo.spec
A         src/packages/rpm/spec/hbase.spec
A         bin
AU        bin/hbase-daemons.sh
AU        bin/hbase
A         bin/hirb.rb
AU        bin/start-hbase.sh
A         bin/region_status.rb
AU        bin/hbase-daemon.sh
A         bin/region_mover.rb
A         bin/hbase-config.sh
A         bin/local-regionservers.sh
AU        bin/zookeepers.sh
A         bin/local-master-backup.sh
AU        bin/rolling-restart.sh
A         bin/graceful_stop.sh
AU        bin/regionservers.sh
AU        bin/master-backup.sh
A         bin/replication
A         bin/replication/copy_tables_desc.rb
AU        bin/stop-hbase.sh
A         .arcconfig
A         pom.xml
A         README.txt
 U        .
At revision 1402223
[HBase-0.92] $ /bin/bash -xe /tmp/hudson149787629017810405.sh
+ uname -a
Linux minerva 3.2.0-31-generic #50-Ubuntu SMP Fri Sep 7 16:16:45 UTC 2012 x86_64 x86_64 x86_64
GNU/Linux
[HBase-0.92] $ /bin/bash -xe /tmp/hudson2244341411946755997.sh
+ ulimit -a
core file size          (blocks, -c) 0
data seg size           (kbytes, -d) unlimited
scheduling priority             (-e) 0
file size               (blocks, -f) unlimited
pending signals                 (-i) 63721
max locked memory       (kbytes, -l) 64
max memory size         (kbytes, -m) unlimited
open files                      (-n) 4096
pipe size            (512 bytes, -p) 8
POSIX message queues     (bytes, -q) 819200
real-time priority              (-r) 0
stack size              (kbytes, -s) 8192
cpu time               (seconds, -t) unlimited
max user processes              (-u) 63721
virtual memory          (kbytes, -v) unlimited
file locks                      (-x) unlimited
[trunk] $ /home/hudson/tools/maven/latest3/bin/mvn clean -Dmaven.test.redirectTestOutputToFile=true
site install assembly:single -Prelease
[INFO] Scanning for projects...
[WARNING] 
[WARNING] Some problems were encountered while building the effective model for org.apache.hbase:hbase:jar:0.92.2
[WARNING] The expression ${artifactId} is deprecated. Please use ${project.artifactId} instead.
[WARNING] The expression ${version} is deprecated. Please use ${project.version} instead.
[WARNING] 
[WARNING] It is highly recommended to fix these problems because they threaten the stability
of your build.
[WARNING] 
[WARNING] For this reason, future Maven versions might no longer support building such malformed
projects.
[WARNING] 
[INFO]                                                                         
[INFO] ------------------------------------------------------------------------
[INFO] Building HBase 0.92.2
[INFO] ------------------------------------------------------------------------
[INFO] 
[INFO] --- maven-clean-plugin:2.4.1:clean (default-clean) @ hbase ---
[INFO] 
[INFO] --- xml-maven-plugin:1.0-beta-3:transform (default) @ hbase ---
[INFO] Transforming file: <https://builds.apache.org/job/HBase-0.92/ws/trunk/src/main/resources/hbase-default.xml>
[INFO] Transformed 1 file(s).
[INFO] 
[INFO] --- docbkx-maven-plugin:2.0.13:generate-html (multipage) @ hbase ---
[INFO] Processing input file: upgrading.xml
[INFO] Chunking output.
[INFO] See <https://builds.apache.org/job/HBase-0.92/ws/trunk/target/site/book/upgrading>
for generated file(s)
[INFO] Processing input file: build.xml
[INFO] Chunking output.
[INFO] See <https://builds.apache.org/job/HBase-0.92/ws/trunk/target/site/book/build>
for generated file(s)
[INFO] Processing input file: preface.xml
[INFO] Chunking output.
[INFO] See <https://builds.apache.org/job/HBase-0.92/ws/trunk/target/site/book/preface>
for generated file(s)
[INFO] Processing input file: configuration.xml
[INFO] Chunking output.
[INFO] See <https://builds.apache.org/job/HBase-0.92/ws/trunk/target/site/book/configuration>
for generated file(s)
[INFO] Processing input file: shell.xml
[INFO] Chunking output.
[INFO] See <https://builds.apache.org/job/HBase-0.92/ws/trunk/target/site/book/shell>
for generated file(s)
[INFO] Processing input file: performance.xml
[INFO] Chunking output.
[INFO] See <https://builds.apache.org/job/HBase-0.92/ws/trunk/target/site/book/performance>
for generated file(s)
[INFO] Processing input file: getting_started.xml
[INFO] Chunking output.
[INFO] See <https://builds.apache.org/job/HBase-0.92/ws/trunk/target/site/book/getting_started>
for generated file(s)
[INFO] Processing input file: external_apis.xml
[INFO] Chunking output.
[INFO] See <https://builds.apache.org/job/HBase-0.92/ws/trunk/target/site/book/external_apis>
for generated file(s)
[INFO] Processing input file: book.xml
[INFO] Chunking output.
[INFO] See <https://builds.apache.org/job/HBase-0.92/ws/trunk/target/site/book/book>
for generated file(s)
[INFO] Processing input file: ops_mgt.xml
[INFO] Chunking output.
[INFO] See <https://builds.apache.org/job/HBase-0.92/ws/trunk/target/site/book/ops_mgt>
for generated file(s)
[INFO] Processing input file: troubleshooting.xml
[INFO] Chunking output.
[INFO] See <https://builds.apache.org/job/HBase-0.92/ws/trunk/target/site/book/troubleshooting>
for generated file(s)
[INFO] Processing input file: developer.xml
[INFO] Chunking output.
[INFO] See <https://builds.apache.org/job/HBase-0.92/ws/trunk/target/site/book/developer>
for generated file(s)
[INFO] 
[INFO] --- docbkx-maven-plugin:2.0.13:generate-html (onepage) @ hbase ---
[INFO] Processing input file: upgrading.xml
[INFO] <https://builds.apache.org/job/HBase-0.92/599/artifact/trunk/target/site/upgrading.html>
has been generated.
[INFO] Processing input file: build.xml
[INFO] <https://builds.apache.org/job/HBase-0.92/599/artifact/trunk/target/site/build.html>
has been generated.
[INFO] Processing input file: preface.xml
[INFO] <https://builds.apache.org/job/HBase-0.92/599/artifact/trunk/target/site/preface.html>
has been generated.
[INFO] Processing input file: configuration.xml
[INFO] <https://builds.apache.org/job/HBase-0.92/599/artifact/trunk/target/site/configuration.html>
has been generated.
[INFO] Processing input file: shell.xml
[INFO] <https://builds.apache.org/job/HBase-0.92/599/artifact/trunk/target/site/shell.html>
has been generated.
[INFO] Processing input file: performance.xml
[INFO] <https://builds.apache.org/job/HBase-0.92/599/artifact/trunk/target/site/performance.html>
has been generated.
[INFO] Processing input file: getting_started.xml
[INFO] <https://builds.apache.org/job/HBase-0.92/599/artifact/trunk/target/site/getting_started.html>
has been generated.
[INFO] Processing input file: external_apis.xml
[INFO] <https://builds.apache.org/job/HBase-0.92/599/artifact/trunk/target/site/external_apis.html>
has been generated.
[INFO] Processing input file: book.xml
[INFO] <https://builds.apache.org/job/HBase-0.92/599/artifact/trunk/target/site/book.html>
has been generated.
[INFO] Processing input file: ops_mgt.xml
[INFO] <https://builds.apache.org/job/HBase-0.92/599/artifact/trunk/target/site/ops_mgt.html>
has been generated.
[INFO] Processing input file: troubleshooting.xml
[INFO] <https://builds.apache.org/job/HBase-0.92/599/artifact/trunk/target/site/troubleshooting.html>
has been generated.
[INFO] Processing input file: developer.xml
[INFO] <https://builds.apache.org/job/HBase-0.92/599/artifact/trunk/target/site/developer.html>
has been generated.
[INFO] 
[INFO] --- maven-site-plugin:2.0.1:site (default-site) @ hbase ---
[INFO] Unable to load parent project from a relative path: 1 problem was encountered while
building the effective model
[FATAL] Non-readable POM <https://builds.apache.org/job/HBase-0.92/ws/pom.xml>: <https://builds.apache.org/job/HBase-0.92/ws/pom.xml>
(No such file or directory) @ 
 for project  at <https://builds.apache.org/job/HBase-0.92/ws/pom.xml> for project 
at <https://builds.apache.org/job/HBase-0.92/ws/pom.xml>
[INFO] Parent project loaded from repository.
[INFO] Unable to load parent project from a relative path: 1 problem was encountered while
building the effective model
[FATAL] Non-readable POM <https://builds.apache.org/job/HBase-0.92/ws/pom.xml>: <https://builds.apache.org/job/HBase-0.92/ws/pom.xml>
(No such file or directory) @ 
 for project  at <https://builds.apache.org/job/HBase-0.92/ws/pom.xml> for project 
at <https://builds.apache.org/job/HBase-0.92/ws/pom.xml>
[INFO] Parent project loaded from repository.
Downloading: https://repository.apache.org/content/repositories/releases/org/apache/maven/skins/maven-stylus-skin/maven-metadata.xml
Downloading: http://download.java.net/maven/2/org/apache/maven/skins/maven-stylus-skin/maven-metadata.xml
Downloading: http://people.apache.org/~stack/m2/repository/org/apache/maven/skins/maven-stylus-skin/maven-metadata.xml
Downloading: http://repository.codehaus.org/org/apache/maven/skins/maven-stylus-skin/maven-metadata.xml

Downloading: http://repository.jboss.org/nexus/content/groups/public-jboss/org/apache/maven/skins/maven-stylus-skin/maven-metadata.xml

Downloading: http://people.apache.org/~garyh/mvn/org/apache/maven/skins/maven-stylus-skin/maven-metadata.xml

Downloading: http://repo1.maven.org/maven2/org/apache/maven/skins/maven-stylus-skin/maven-metadata.xml


516 B   
516 B   516 B   
                
Downloaded: http://repo1.maven.org/maven2/org/apache/maven/skins/maven-stylus-skin/maven-metadata.xml
(516 B at 1.2 KB/sec)
                
Downloaded: https://repository.apache.org/content/repositories/releases/org/apache/maven/skins/maven-stylus-skin/maven-metadata.xml
(516 B at 0.8 KB/sec)
[WARNING] Could not transfer metadata org.apache.maven.skins:maven-stylus-skin/maven-metadata.xml
from/to repository.jboss.org (http://repository.jboss.org/nexus/content/groups/public-jboss/):
Error transferring file: Server returned HTTP response code: 503 for URL: http://repository.jboss.org/nexus/content/groups/public-jboss/org/apache/maven/skins/maven-stylus-skin/maven-metadata.xml
[INFO] 
[INFO] --- maven-antrun-plugin:1.6:run (arc-setup) @ hbase ---
[WARNING] Parameter tasks is deprecated, use target instead
[INFO] Executing tasks

main:
[INFO] Executed tasks
[INFO] 
[INFO] --- avro-maven-plugin:1.5.3:schema (generate-avro-sources) @ hbase ---
[INFO] 
[INFO] --- avro-maven-plugin:1.5.3:protocol (generate-avro-sources) @ hbase ---
[INFO] 
[INFO] --- maven-antrun-plugin:1.6:run (generate) @ hbase ---
[INFO] Executing tasks

main:
    [mkdir] Created dir: <https://builds.apache.org/job/HBase-0.92/ws/trunk/target/hbase-webapps>
     [copy] Copying 5 files to <https://builds.apache.org/job/HBase-0.92/ws/trunk/target/hbase-webapps>
12/10/25 17:26:45 INFO mortbay.log: Logging to org.slf4j.impl.Log4jLoggerAdapter(org.mortbay.log)
via org.mortbay.log.Slf4jLog
    [mkdir] Created dir: <https://builds.apache.org/job/HBase-0.92/ws/trunk/target/hbase-webapps/master/WEB-INF>
    [mkdir] Created dir: <https://builds.apache.org/job/HBase-0.92/ws/trunk/target/hbase-webapps/regionserver/WEB-INF>
[INFO] Executed tasks
[INFO] 
[INFO] --- build-helper-maven-plugin:1.5:add-source (jspcSource-packageInfo-Avro-source) @
hbase ---
[INFO] Source directory: <https://builds.apache.org/job/HBase-0.92/ws/trunk/target/generated-jamon>
added.
[INFO] Source directory: <https://builds.apache.org/job/HBase-0.92/ws/trunk/target/generated-sources/java>
added.
[INFO] 
[INFO] --- jamon-maven-plugin:2.3.4:translate (default) @ hbase ---
[INFO] Translating 4 templates from <https://builds.apache.org/job/HBase-0.92/ws/trunk/src/main/jamon>
to <https://builds.apache.org/job/HBase-0.92/ws/trunk/target/generated-jamon>
[INFO] 
[INFO] --- maven-remote-resources-plugin:1.1:process (default) @ hbase ---
[INFO] Setting property: classpath.resource.loader.class => 'org.codehaus.plexus.velocity.ContextClassLoaderResourceLoader'.
[INFO] Setting property: velocimacro.messages.on => 'false'.
[INFO] Setting property: resource.loader => 'classpath'.
[INFO] Setting property: resource.manager.logwhenfound => 'false'.
[INFO] 
[INFO] --- maven-resources-plugin:2.4:resources (default-resources) @ hbase ---
[INFO] Using 'UTF-8' encoding to copy filtered resources.
[INFO] Copying 1 resource
[INFO] Copying 7 resources
[INFO] Copying 3 resources
[INFO] 
[INFO] --- maven-antrun-plugin:1.6:run (default) @ hbase ---
[INFO] Executing tasks

main:
    [mkdir] Created dir: <https://builds.apache.org/job/HBase-0.92/ws/trunk/target/nativelib>
     [exec] tar: hadoop-snappy-nativelibs.tar: Cannot open: No such file or directory
     [exec] tar: Error is not recoverable: exiting now
     [exec] Result: 2
[INFO] Executed tasks
[INFO] 
[INFO] --- maven-compiler-plugin:2.0.2:compile (default-compile) @ hbase ---
[INFO] Compiling 625 source files to <https://builds.apache.org/job/HBase-0.92/ws/trunk/target/classes>
[INFO] ------------------------------------------------------------------------
[INFO] BUILD FAILURE
[INFO] ------------------------------------------------------------------------
[INFO] Total time: 42.617s
[INFO] Finished at: Thu Oct 25 17:26:58 UTC 2012
[INFO] Final Memory: 42M/615M
[INFO] ------------------------------------------------------------------------
[ERROR] Failed to execute goal org.apache.maven.plugins:maven-compiler-plugin:2.0.2:compile
(default-compile) on project hbase: Compilation failure: Compilation failure:
[ERROR] <https://builds.apache.org/job/HBase-0.92/ws/trunk/src/main/java/org/apache/hadoop/hbase/util/Bytes.java>:[44,15]
sun.misc.Unsafe is Sun proprietary API and may be removed in a future release
[ERROR] 
[ERROR] <https://builds.apache.org/job/HBase-0.92/ws/trunk/src/main/java/org/apache/hadoop/hbase/util/Bytes.java>:[1035,19]
sun.misc.Unsafe is Sun proprietary API and may be removed in a future release
[ERROR] 
[ERROR] <https://builds.apache.org/job/HBase-0.92/ws/trunk/src/main/java/org/apache/hadoop/hbase/util/Bytes.java>:[1041,21]
sun.misc.Unsafe is Sun proprietary API and may be removed in a future release
[ERROR] 
[ERROR] <https://builds.apache.org/job/HBase-0.92/ws/trunk/src/main/java/org/apache/hadoop/hbase/util/Bytes.java>:[1046,28]
sun.misc.Unsafe is Sun proprietary API and may be removed in a future release
[ERROR] 
[ERROR] <https://builds.apache.org/job/HBase-0.92/ws/trunk/src/main/java/org/apache/hadoop/hbase/filter/ColumnCountGetFilter.java>:[68,44]
cannot find symbol
[ERROR] symbol  : variable INCLUDE_AND_NEXT_COLUMN
[ERROR] location: class org.apache.hadoop.hbase.filter.Filter.ReturnCode
[ERROR] -> [Help 1]
[ERROR] 
[ERROR] To see the full stack trace of the errors, re-run Maven with the -e switch.
[ERROR] Re-run Maven using the -X switch to enable full debug logging.
[ERROR] 
[ERROR] For more information about the errors and possible solutions, please read the following
articles:
[ERROR] [Help 1] http://cwiki.apache.org/confluence/display/MAVEN/MojoFailureException
Build step 'Invoke top-level Maven targets' marked build as failure
Archiving artifacts
Recording test results
Updating HBASE-5257

Mime
View raw message