hbase-dev mailing list archives

Site index · List index
Message view « Date » · « Thread »
Top « Date » · « Thread »
From Apache Jenkins Server <jenk...@builds.apache.org>
Subject Build failed in Jenkins: HBase-0.94-security #62
Date Sat, 06 Oct 2012 03:34:48 GMT
See <https://builds.apache.org/job/HBase-0.94-security/62/changes>

Changes:

[larsh] HBASE-6920 Addendum - fix SecureRpcEngine

------------------------------------------
[...truncated 7580 lines...]
Tests run: 1, Failures: 0, Errors: 0, Skipped: 0, Time elapsed: 19.21 sec
Forking command line: /bin/sh -c cd /x1/jenkins/jenkins-slave/workspace/HBase-0.94-security/trunk
&& /x1/jenkins/tools/java/jdk1.6.0_32-32/jre/bin/java -enableassertions -Xmx1900m
-Djava.security.egd=file:/dev/./urandom -jar /x1/jenkins/jenkins-slave/workspace/HBase-0.94-security/trunk/target/surefire/surefirebooter314612024232932170.jar
/x1/jenkins/jenkins-slave/workspace/HBase-0.94-security/trunk/target/surefire/surefire8877026736679610115tmp
/x1/jenkins/jenkins-slave/workspace/HBase-0.94-security/trunk/target/surefire/surefire_693717363871977135234tmp
Running org.apache.hadoop.hbase.regionserver.TestServerCustomProtocol
Tests run: 7, Failures: 0, Errors: 0, Skipped: 0, Time elapsed: 12.497 sec
Forking command line: /bin/sh -c cd /x1/jenkins/jenkins-slave/workspace/HBase-0.94-security/trunk
&& /x1/jenkins/tools/java/jdk1.6.0_32-32/jre/bin/java -enableassertions -Xmx1900m
-Djava.security.egd=file:/dev/./urandom -jar /x1/jenkins/jenkins-slave/workspace/HBase-0.94-security/trunk/target/surefire/surefirebooter8773139018008542818.jar
/x1/jenkins/jenkins-slave/workspace/HBase-0.94-security/trunk/target/surefire/surefire1550454098153388382tmp
/x1/jenkins/jenkins-slave/workspace/HBase-0.94-security/trunk/target/surefire/surefire_709739266146530151tmp
Running org.apache.hadoop.hbase.regionserver.TestRpcMetrics
Tests run: 1, Failures: 0, Errors: 0, Skipped: 0, Time elapsed: 1.774 sec
Running org.apache.hadoop.hbase.regionserver.TestParallelPut
Tests run: 2, Failures: 0, Errors: 0, Skipped: 0, Time elapsed: 3.668 sec
Forking command line: /bin/sh -c cd /x1/jenkins/jenkins-slave/workspace/HBase-0.94-security/trunk
&& /x1/jenkins/tools/java/jdk1.6.0_32-32/jre/bin/java -enableassertions -Xmx1900m
-Djava.security.egd=file:/dev/./urandom -jar /x1/jenkins/jenkins-slave/workspace/HBase-0.94-security/trunk/target/surefire/surefirebooter1260025419949816150.jar
/x1/jenkins/jenkins-slave/workspace/HBase-0.94-security/trunk/target/surefire/surefire7611199347025632921tmp
/x1/jenkins/jenkins-slave/workspace/HBase-0.94-security/trunk/target/surefire/surefire_714789664091554995587tmp
Forking command line: /bin/sh -c cd /x1/jenkins/jenkins-slave/workspace/HBase-0.94-security/trunk
&& /x1/jenkins/tools/java/jdk1.6.0_32-32/jre/bin/java -enableassertions -Xmx1900m
-Djava.security.egd=file:/dev/./urandom -jar /x1/jenkins/jenkins-slave/workspace/HBase-0.94-security/trunk/target/surefire/surefirebooter56470720653900571.jar
/x1/jenkins/jenkins-slave/workspace/HBase-0.94-security/trunk/target/surefire/surefire501058320422515864tmp
/x1/jenkins/jenkins-slave/workspace/HBase-0.94-security/trunk/target/surefire/surefire_728018640183210907845tmp
Running org.apache.hadoop.hbase.regionserver.handler.TestCloseRegionHandler
Tests run: 3, Failures: 0, Errors: 0, Skipped: 0, Time elapsed: 1.065 sec
Forking command line: /bin/sh -c cd /x1/jenkins/jenkins-slave/workspace/HBase-0.94-security/trunk
&& /x1/jenkins/tools/java/jdk1.6.0_32-32/jre/bin/java -enableassertions -Xmx1900m
-Djava.security.egd=file:/dev/./urandom -jar /x1/jenkins/jenkins-slave/workspace/HBase-0.94-security/trunk/target/surefire/surefirebooter330336248662146838.jar
/x1/jenkins/jenkins-slave/workspace/HBase-0.94-security/trunk/target/surefire/surefire6103842982202836863tmp
/x1/jenkins/jenkins-slave/workspace/HBase-0.94-security/trunk/target/surefire/surefire_73232716636609049989tmp
Running org.apache.hadoop.hbase.regionserver.handler.TestOpenRegionHandler
Tests run: 3, Failures: 0, Errors: 0, Skipped: 0, Time elapsed: 0.772 sec
Forking command line: /bin/sh -c cd /x1/jenkins/jenkins-slave/workspace/HBase-0.94-security/trunk
&& /x1/jenkins/tools/java/jdk1.6.0_32-32/jre/bin/java -enableassertions -Xmx1900m
-Djava.security.egd=file:/dev/./urandom -jar /x1/jenkins/jenkins-slave/workspace/HBase-0.94-security/trunk/target/surefire/surefirebooter6370982518756389577.jar
/x1/jenkins/jenkins-slave/workspace/HBase-0.94-security/trunk/target/surefire/surefire1122860096501583430tmp
/x1/jenkins/jenkins-slave/workspace/HBase-0.94-security/trunk/target/surefire/surefire_745873515356223092628tmp
Running org.apache.hadoop.hbase.regionserver.TestSeekOptimizations
Tests run: 6, Failures: 0, Errors: 0, Skipped: 0, Time elapsed: 2.297 sec
Forking command line: /bin/sh -c cd /x1/jenkins/jenkins-slave/workspace/HBase-0.94-security/trunk
&& /x1/jenkins/tools/java/jdk1.6.0_32-32/jre/bin/java -enableassertions -Xmx1900m
-Djava.security.egd=file:/dev/./urandom -jar /x1/jenkins/jenkins-slave/workspace/HBase-0.94-security/trunk/target/surefire/surefirebooter771573440973608980.jar
/x1/jenkins/jenkins-slave/workspace/HBase-0.94-security/trunk/target/surefire/surefire1305445900502100460tmp
/x1/jenkins/jenkins-slave/workspace/HBase-0.94-security/trunk/target/surefire/surefire_754612995828542717893tmp
Running org.apache.hadoop.hbase.regionserver.TestBlocksRead
Tests run: 4, Failures: 0, Errors: 0, Skipped: 0, Time elapsed: 1.004 sec
Forking command line: /bin/sh -c cd /x1/jenkins/jenkins-slave/workspace/HBase-0.94-security/trunk
&& /x1/jenkins/tools/java/jdk1.6.0_32-32/jre/bin/java -enableassertions -Xmx1900m
-Djava.security.egd=file:/dev/./urandom -jar /x1/jenkins/jenkins-slave/workspace/HBase-0.94-security/trunk/target/surefire/surefirebooter6246498753204459777.jar
/x1/jenkins/jenkins-slave/workspace/HBase-0.94-security/trunk/target/surefire/surefire1167546323576554880tmp
/x1/jenkins/jenkins-slave/workspace/HBase-0.94-security/trunk/target/surefire/surefire_762219271539469175463tmp
Running org.apache.hadoop.hbase.regionserver.TestStoreScanner
Tests run: 16, Failures: 0, Errors: 0, Skipped: 0, Time elapsed: 0.067 sec
Forking command line: /bin/sh -c cd /x1/jenkins/jenkins-slave/workspace/HBase-0.94-security/trunk
&& /x1/jenkins/tools/java/jdk1.6.0_32-32/jre/bin/java -enableassertions -Xmx1900m
-Djava.security.egd=file:/dev/./urandom -jar /x1/jenkins/jenkins-slave/workspace/HBase-0.94-security/trunk/target/surefire/surefirebooter5895644283689139838.jar
/x1/jenkins/jenkins-slave/workspace/HBase-0.94-security/trunk/target/surefire/surefire5676665385369545329tmp
/x1/jenkins/jenkins-slave/workspace/HBase-0.94-security/trunk/target/surefire/surefire_775879524762444724667tmp
Running org.apache.hadoop.hbase.regionserver.TestSplitLogWorker
Tests run: 5, Failures: 0, Errors: 0, Skipped: 0, Time elapsed: 2.054 sec
Forking command line: /bin/sh -c cd /x1/jenkins/jenkins-slave/workspace/HBase-0.94-security/trunk
&& /x1/jenkins/tools/java/jdk1.6.0_32-32/jre/bin/java -enableassertions -Xmx1900m
-Djava.security.egd=file:/dev/./urandom -jar /x1/jenkins/jenkins-slave/workspace/HBase-0.94-security/trunk/target/surefire/surefirebooter610311917700012644.jar
/x1/jenkins/jenkins-slave/workspace/HBase-0.94-security/trunk/target/surefire/surefire397154156061602542tmp
/x1/jenkins/jenkins-slave/workspace/HBase-0.94-security/trunk/target/surefire/surefire_784022154645724775681tmp
Running org.apache.hadoop.hbase.regionserver.metrics.TestSchemaMetrics
Tests run: 6, Failures: 0, Errors: 0, Skipped: 0, Time elapsed: 12.196 sec
Forking command line: /bin/sh -c cd /x1/jenkins/jenkins-slave/workspace/HBase-0.94-security/trunk
&& /x1/jenkins/tools/java/jdk1.6.0_32-32/jre/bin/java -enableassertions -Xmx1900m
-Djava.security.egd=file:/dev/./urandom -jar /x1/jenkins/jenkins-slave/workspace/HBase-0.94-security/trunk/target/surefire/surefirebooter529875126483067444.jar
/x1/jenkins/jenkins-slave/workspace/HBase-0.94-security/trunk/target/surefire/surefire2566250306235893824tmp
/x1/jenkins/jenkins-slave/workspace/HBase-0.94-security/trunk/target/surefire/surefire_797918046350637255070tmp
Running org.apache.hadoop.hbase.regionserver.TestStoreFileBlockCacheSummary
Tests run: 1, Failures: 0, Errors: 0, Skipped: 0, Time elapsed: 13.855 sec
Forking command line: /bin/sh -c cd /x1/jenkins/jenkins-slave/workspace/HBase-0.94-security/trunk
&& /x1/jenkins/tools/java/jdk1.6.0_32-32/jre/bin/java -enableassertions -Xmx1900m
-Djava.security.egd=file:/dev/./urandom -jar /x1/jenkins/jenkins-slave/workspace/HBase-0.94-security/trunk/target/surefire/surefirebooter3103220788778542392.jar
/x1/jenkins/jenkins-slave/workspace/HBase-0.94-security/trunk/target/surefire/surefire6513212023456845859tmp
/x1/jenkins/jenkins-slave/workspace/HBase-0.94-security/trunk/target/surefire/surefire_805353106494576645822tmp
Running org.apache.hadoop.hbase.regionserver.TestMasterAddressManager
Tests run: 1, Failures: 0, Errors: 0, Skipped: 0, Time elapsed: 0.501 sec
Forking command line: /bin/sh -c cd /x1/jenkins/jenkins-slave/workspace/HBase-0.94-security/trunk
&& /x1/jenkins/tools/java/jdk1.6.0_32-32/jre/bin/java -enableassertions -Xmx1900m
-Djava.security.egd=file:/dev/./urandom -jar /x1/jenkins/jenkins-slave/workspace/HBase-0.94-security/trunk/target/surefire/surefirebooter6744566656978761845.jar
/x1/jenkins/jenkins-slave/workspace/HBase-0.94-security/trunk/target/surefire/surefire3431004974757053433tmp
/x1/jenkins/jenkins-slave/workspace/HBase-0.94-security/trunk/target/surefire/surefire_818523079508697677763tmp
Running org.apache.hadoop.hbase.regionserver.TestMultiColumnScanner
Tests run: 12, Failures: 0, Errors: 0, Skipped: 0, Time elapsed: 31.197 sec
Forking command line: /bin/sh -c cd /x1/jenkins/jenkins-slave/workspace/HBase-0.94-security/trunk
&& /x1/jenkins/tools/java/jdk1.6.0_32-32/jre/bin/java -enableassertions -Xmx1900m
-Djava.security.egd=file:/dev/./urandom -jar /x1/jenkins/jenkins-slave/workspace/HBase-0.94-security/trunk/target/surefire/surefirebooter2389778222852999599.jar
/x1/jenkins/jenkins-slave/workspace/HBase-0.94-security/trunk/target/surefire/surefire7124785153101778353tmp
/x1/jenkins/jenkins-slave/workspace/HBase-0.94-security/trunk/target/surefire/surefire_825181341724692993962tmp
Running org.apache.hadoop.hbase.TestLocalHBaseCluster
Tests run: 1, Failures: 0, Errors: 0, Skipped: 0, Time elapsed: 5.823 sec
Forking command line: /bin/sh -c cd /x1/jenkins/jenkins-slave/workspace/HBase-0.94-security/trunk
&& /x1/jenkins/tools/java/jdk1.6.0_32-32/jre/bin/java -enableassertions -Xmx1900m
-Djava.security.egd=file:/dev/./urandom -jar /x1/jenkins/jenkins-slave/workspace/HBase-0.94-security/trunk/target/surefire/surefirebooter1628568077311929513.jar
/x1/jenkins/jenkins-slave/workspace/HBase-0.94-security/trunk/target/surefire/surefire8080201803113894284tmp
/x1/jenkins/jenkins-slave/workspace/HBase-0.94-security/trunk/target/surefire/surefire_838430962627382035929tmp
Running org.apache.hadoop.hbase.ipc.TestDelayedRpc
Tests run: 4, Failures: 0, Errors: 0, Skipped: 0, Time elapsed: 2.328 sec
Forking command line: /bin/sh -c cd /x1/jenkins/jenkins-slave/workspace/HBase-0.94-security/trunk
&& /x1/jenkins/tools/java/jdk1.6.0_32-32/jre/bin/java -enableassertions -Xmx1900m
-Djava.security.egd=file:/dev/./urandom -jar /x1/jenkins/jenkins-slave/workspace/HBase-0.94-security/trunk/target/surefire/surefirebooter6182811105874001122.jar
/x1/jenkins/jenkins-slave/workspace/HBase-0.94-security/trunk/target/surefire/surefire6458611746796993827tmp
/x1/jenkins/jenkins-slave/workspace/HBase-0.94-security/trunk/target/surefire/surefire_846146213084370331945tmp
Running org.apache.hadoop.hbase.regionserver.TestHRegion
Tests run: 69, Failures: 0, Errors: 0, Skipped: 0, Time elapsed: 39.71 sec
Forking command line: /bin/sh -c cd /x1/jenkins/jenkins-slave/workspace/HBase-0.94-security/trunk
&& /x1/jenkins/tools/java/jdk1.6.0_32-32/jre/bin/java -enableassertions -Xmx1900m
-Djava.security.egd=file:/dev/./urandom -jar /x1/jenkins/jenkins-slave/workspace/HBase-0.94-security/trunk/target/surefire/surefirebooter8499026275736287641.jar
/x1/jenkins/jenkins-slave/workspace/HBase-0.94-security/trunk/target/surefire/surefire6892962971689650196tmp
/x1/jenkins/jenkins-slave/workspace/HBase-0.94-security/trunk/target/surefire/surefire_857512512140299743559tmp
Running org.apache.hadoop.hbase.TestGlobalMemStoreSize
Tests run: 1, Failures: 0, Errors: 0, Skipped: 0, Time elapsed: 14.809 sec
Forking command line: /bin/sh -c cd /x1/jenkins/jenkins-slave/workspace/HBase-0.94-security/trunk
&& /x1/jenkins/tools/java/jdk1.6.0_32-32/jre/bin/java -enableassertions -Xmx1900m
-Djava.security.egd=file:/dev/./urandom -jar /x1/jenkins/jenkins-slave/workspace/HBase-0.94-security/trunk/target/surefire/surefirebooter320745241991085991.jar
/x1/jenkins/jenkins-slave/workspace/HBase-0.94-security/trunk/target/surefire/surefire1820708770260062276tmp
/x1/jenkins/jenkins-slave/workspace/HBase-0.94-security/trunk/target/surefire/surefire_868211950536059788394tmp
Running org.apache.hadoop.hbase.constraint.TestConstraint
Tests run: 5, Failures: 0, Errors: 0, Skipped: 0, Time elapsed: 28.988 sec
Forking command line: /bin/sh -c cd /x1/jenkins/jenkins-slave/workspace/HBase-0.94-security/trunk
&& /x1/jenkins/tools/java/jdk1.6.0_32-32/jre/bin/java -enableassertions -Xmx1900m
-Djava.security.egd=file:/dev/./urandom -jar /x1/jenkins/jenkins-slave/workspace/HBase-0.94-security/trunk/target/surefire/surefirebooter1314935979151445351.jar
/x1/jenkins/jenkins-slave/workspace/HBase-0.94-security/trunk/target/surefire/surefire8500852511672545087tmp
/x1/jenkins/jenkins-slave/workspace/HBase-0.94-security/trunk/target/surefire/surefire_87593350419319045477tmp
Running org.apache.hadoop.hbase.rest.TestSchemaResource
Tests run: 2, Failures: 0, Errors: 0, Skipped: 0, Time elapsed: 20.802 sec
Forking command line: /bin/sh -c cd /x1/jenkins/jenkins-slave/workspace/HBase-0.94-security/trunk
&& /x1/jenkins/tools/java/jdk1.6.0_32-32/jre/bin/java -enableassertions -Xmx1900m
-Djava.security.egd=file:/dev/./urandom -jar /x1/jenkins/jenkins-slave/workspace/HBase-0.94-security/trunk/target/surefire/surefirebooter964619539211061234.jar
/x1/jenkins/jenkins-slave/workspace/HBase-0.94-security/trunk/target/surefire/surefire4038127736744765703tmp
/x1/jenkins/jenkins-slave/workspace/HBase-0.94-security/trunk/target/surefire/surefire_881284086874558019865tmp
Running org.apache.hadoop.hbase.rest.client.TestRemoteAdmin
Tests run: 1, Failures: 0, Errors: 0, Skipped: 0, Time elapsed: 14.317 sec
Forking command line: /bin/sh -c cd /x1/jenkins/jenkins-slave/workspace/HBase-0.94-security/trunk
&& /x1/jenkins/tools/java/jdk1.6.0_32-32/jre/bin/java -enableassertions -Xmx1900m
-Djava.security.egd=file:/dev/./urandom -jar /x1/jenkins/jenkins-slave/workspace/HBase-0.94-security/trunk/target/surefire/surefirebooter9004240725570184197.jar
/x1/jenkins/jenkins-slave/workspace/HBase-0.94-security/trunk/target/surefire/surefire4165221475243966951tmp
/x1/jenkins/jenkins-slave/workspace/HBase-0.94-security/trunk/target/surefire/surefire_896679479025464802789tmp
Running org.apache.hadoop.hbase.rest.client.TestRemoteTable
Tests run: 3, Failures: 0, Errors: 0, Skipped: 0, Time elapsed: 13.119 sec
Forking command line: /bin/sh -c cd /x1/jenkins/jenkins-slave/workspace/HBase-0.94-security/trunk
&& /x1/jenkins/tools/java/jdk1.6.0_32-32/jre/bin/java -enableassertions -Xmx1900m
-Djava.security.egd=file:/dev/./urandom -jar /x1/jenkins/jenkins-slave/workspace/HBase-0.94-security/trunk/target/surefire/surefirebooter7545481557211024801.jar
/x1/jenkins/jenkins-slave/workspace/HBase-0.94-security/trunk/target/surefire/surefire7627115322171682146tmp
/x1/jenkins/jenkins-slave/workspace/HBase-0.94-security/trunk/target/surefire/surefire_903966577212901460620tmp
Running org.apache.hadoop.hbase.rest.TestMultiRowResource
Tests run: 3, Failures: 0, Errors: 0, Skipped: 0, Time elapsed: 13.556 sec
Forking command line: /bin/sh -c cd /x1/jenkins/jenkins-slave/workspace/HBase-0.94-security/trunk
&& /x1/jenkins/tools/java/jdk1.6.0_32-32/jre/bin/java -enableassertions -Xmx1900m
-Djava.security.egd=file:/dev/./urandom -jar /x1/jenkins/jenkins-slave/workspace/HBase-0.94-security/trunk/target/surefire/surefirebooter5494946663901918606.jar
/x1/jenkins/jenkins-slave/workspace/HBase-0.94-security/trunk/target/surefire/surefire7365929451228422119tmp
/x1/jenkins/jenkins-slave/workspace/HBase-0.94-security/trunk/target/surefire/surefire_915811742541733894414tmp
Running org.apache.hadoop.hbase.rest.TestTableResource
Tests run: 8, Failures: 0, Errors: 0, Skipped: 0, Time elapsed: 23.804 sec
Forking command line: /bin/sh -c cd /x1/jenkins/jenkins-slave/workspace/HBase-0.94-security/trunk
&& /x1/jenkins/tools/java/jdk1.6.0_32-32/jre/bin/java -enableassertions -Xmx1900m
-Djava.security.egd=file:/dev/./urandom -jar /x1/jenkins/jenkins-slave/workspace/HBase-0.94-security/trunk/target/surefire/surefirebooter2807022524060429408.jar
/x1/jenkins/jenkins-slave/workspace/HBase-0.94-security/trunk/target/surefire/surefire4853229876430152141tmp
/x1/jenkins/jenkins-slave/workspace/HBase-0.94-security/trunk/target/surefire/surefire_926635529887232827498tmp
Running org.apache.hadoop.hbase.rest.TestGzipFilter
Tests run: 3, Failures: 0, Errors: 0, Skipped: 0, Time elapsed: 13.454 sec
Forking command line: /bin/sh -c cd /x1/jenkins/jenkins-slave/workspace/HBase-0.94-security/trunk
&& /x1/jenkins/tools/java/jdk1.6.0_32-32/jre/bin/java -enableassertions -Xmx1900m
-Djava.security.egd=file:/dev/./urandom -jar /x1/jenkins/jenkins-slave/workspace/HBase-0.94-security/trunk/target/surefire/surefirebooter3987886849886266307.jar
/x1/jenkins/jenkins-slave/workspace/HBase-0.94-security/trunk/target/surefire/surefire6230864823914091110tmp
/x1/jenkins/jenkins-slave/workspace/HBase-0.94-security/trunk/target/surefire/surefire_933576911360316980062tmp
Running org.apache.hadoop.hbase.rest.TestRowResource
Tests run: 11, Failures: 0, Errors: 0, Skipped: 0, Time elapsed: 14.692 sec
Forking command line: /bin/sh -c cd /x1/jenkins/jenkins-slave/workspace/HBase-0.94-security/trunk
&& /x1/jenkins/tools/java/jdk1.6.0_32-32/jre/bin/java -enableassertions -Xmx1900m
-Djava.security.egd=file:/dev/./urandom -jar /x1/jenkins/jenkins-slave/workspace/HBase-0.94-security/trunk/target/surefire/surefirebooter3368509523483699516.jar
/x1/jenkins/jenkins-slave/workspace/HBase-0.94-security/trunk/target/surefire/surefire3191393541747137491tmp
/x1/jenkins/jenkins-slave/workspace/HBase-0.94-security/trunk/target/surefire/surefire_942464864461842077285tmp
Running org.apache.hadoop.hbase.rest.TestVersionResource
Tests run: 7, Failures: 0, Errors: 0, Skipped: 0, Time elapsed: 11.274 sec
Forking command line: /bin/sh -c cd /x1/jenkins/jenkins-slave/workspace/HBase-0.94-security/trunk
&& /x1/jenkins/tools/java/jdk1.6.0_32-32/jre/bin/java -enableassertions -Xmx1900m
-Djava.security.egd=file:/dev/./urandom -jar /x1/jenkins/jenkins-slave/workspace/HBase-0.94-security/trunk/target/surefire/surefirebooter41219553884607975.jar
/x1/jenkins/jenkins-slave/workspace/HBase-0.94-security/trunk/target/surefire/surefire8375169925059223683tmp
/x1/jenkins/jenkins-slave/workspace/HBase-0.94-security/trunk/target/surefire/surefire_953843966785802272545tmp
Running org.apache.hadoop.hbase.rest.TestStatusResource
Tests run: 2, Failures: 0, Errors: 0, Skipped: 0, Time elapsed: 12.323 sec
Forking command line: /bin/sh -c cd /x1/jenkins/jenkins-slave/workspace/HBase-0.94-security/trunk
&& /x1/jenkins/tools/java/jdk1.6.0_32-32/jre/bin/java -enableassertions -Xmx1900m
-Djava.security.egd=file:/dev/./urandom -jar /x1/jenkins/jenkins-slave/workspace/HBase-0.94-security/trunk/target/surefire/surefirebooter8148957956832966136.jar
/x1/jenkins/jenkins-slave/workspace/HBase-0.94-security/trunk/target/surefire/surefire2095552378965887509tmp
/x1/jenkins/jenkins-slave/workspace/HBase-0.94-security/trunk/target/surefire/surefire_967533344364687606249tmp
Running org.apache.hadoop.hbase.rest.TestScannerResource
Tests run: 5, Failures: 0, Errors: 0, Skipped: 0, Time elapsed: 33.844 sec
Forking command line: /bin/sh -c cd /x1/jenkins/jenkins-slave/workspace/HBase-0.94-security/trunk
&& /x1/jenkins/tools/java/jdk1.6.0_32-32/jre/bin/java -enableassertions -Xmx1900m
-Djava.security.egd=file:/dev/./urandom -jar /x1/jenkins/jenkins-slave/workspace/HBase-0.94-security/trunk/target/surefire/surefirebooter9001847461162294660.jar
/x1/jenkins/jenkins-slave/workspace/HBase-0.94-security/trunk/target/surefire/surefire7156920372913675688tmp
/x1/jenkins/jenkins-slave/workspace/HBase-0.94-security/trunk/target/surefire/surefire_971713632828641655569tmp
Running org.apache.hadoop.hbase.metrics.TestMetricsMBeanBase
Tests run: 3, Failures: 0, Errors: 0, Skipped: 0, Time elapsed: 1.35 sec
Forking command line: /bin/sh -c cd /x1/jenkins/jenkins-slave/workspace/HBase-0.94-security/trunk
&& /x1/jenkins/tools/java/jdk1.6.0_32-32/jre/bin/java -enableassertions -Xmx1900m
-Djava.security.egd=file:/dev/./urandom -jar /x1/jenkins/jenkins-slave/workspace/HBase-0.94-security/trunk/target/surefire/surefirebooter2635033483543374394.jar
/x1/jenkins/jenkins-slave/workspace/HBase-0.94-security/trunk/target/surefire/surefire2418808556806391428tmp
/x1/jenkins/jenkins-slave/workspace/HBase-0.94-security/trunk/target/surefire/surefire_988584485733903678253tmp
Running org.apache.hadoop.hbase.io.hfile.TestHFileBlockIndex
Tests run: 10, Failures: 0, Errors: 0, Skipped: 0, Time elapsed: 7.999 sec
Forking command line: /bin/sh -c cd /x1/jenkins/jenkins-slave/workspace/HBase-0.94-security/trunk
&& /x1/jenkins/tools/java/jdk1.6.0_32-32/jre/bin/java -enableassertions -Xmx1900m
-Djava.security.egd=file:/dev/./urandom -jar /x1/jenkins/jenkins-slave/workspace/HBase-0.94-security/trunk/target/surefire/surefirebooter3703621070064725306.jar
/x1/jenkins/jenkins-slave/workspace/HBase-0.94-security/trunk/target/surefire/surefire7255997269129613281tmp
/x1/jenkins/jenkins-slave/workspace/HBase-0.94-security/trunk/target/surefire/surefire_995456900947829951576tmp
Running org.apache.hadoop.hbase.rest.TestScannersWithFilters
Tests run: 10, Failures: 0, Errors: 0, Skipped: 0, Time elapsed: 16.89 sec
Forking command line: /bin/sh -c cd /x1/jenkins/jenkins-slave/workspace/HBase-0.94-security/trunk
&& /x1/jenkins/tools/java/jdk1.6.0_32-32/jre/bin/java -enableassertions -Xmx1900m
-Djava.security.egd=file:/dev/./urandom -jar /x1/jenkins/jenkins-slave/workspace/HBase-0.94-security/trunk/target/surefire/surefirebooter4066069735413143048.jar
/x1/jenkins/jenkins-slave/workspace/HBase-0.94-security/trunk/target/surefire/surefire7110044142333826532tmp
/x1/jenkins/jenkins-slave/workspace/HBase-0.94-security/trunk/target/surefire/surefire_1002537966811943380406tmp
Running org.apache.hadoop.hbase.io.hfile.TestHFileSeek
Tests run: 1, Failures: 0, Errors: 0, Skipped: 0, Time elapsed: 7.04 sec
Forking command line: /bin/sh -c cd /x1/jenkins/jenkins-slave/workspace/HBase-0.94-security/trunk
&& /x1/jenkins/tools/java/jdk1.6.0_32-32/jre/bin/java -enableassertions -Xmx1900m
-Djava.security.egd=file:/dev/./urandom -jar /x1/jenkins/jenkins-slave/workspace/HBase-0.94-security/trunk/target/surefire/surefirebooter9124661968625813573.jar
/x1/jenkins/jenkins-slave/workspace/HBase-0.94-security/trunk/target/surefire/surefire8557866524495902155tmp
/x1/jenkins/jenkins-slave/workspace/HBase-0.94-security/trunk/target/surefire/surefire_1018666666162332158837tmp
Running org.apache.hadoop.hbase.io.hfile.TestLruBlockCache
Tests run: 16, Failures: 0, Errors: 0, Skipped: 0, Time elapsed: 0.705 sec
Forking command line: /bin/sh -c cd /x1/jenkins/jenkins-slave/workspace/HBase-0.94-security/trunk
&& /x1/jenkins/tools/java/jdk1.6.0_32-32/jre/bin/java -enableassertions -Xmx1900m
-Djava.security.egd=file:/dev/./urandom -jar /x1/jenkins/jenkins-slave/workspace/HBase-0.94-security/trunk/target/surefire/surefirebooter8476140622431007316.jar
/x1/jenkins/jenkins-slave/workspace/HBase-0.94-security/trunk/target/surefire/surefire9033579285871642047tmp
/x1/jenkins/jenkins-slave/workspace/HBase-0.94-security/trunk/target/surefire/surefire_1027827998623332008374tmp
Running org.apache.hadoop.hbase.io.hfile.TestFixedFileTrailer
Tests run: 2, Failures: 0, Errors: 0, Skipped: 0, Time elapsed: 0.512 sec
Forking command line: /bin/sh -c cd /x1/jenkins/jenkins-slave/workspace/HBase-0.94-security/trunk
&& /x1/jenkins/tools/java/jdk1.6.0_32-32/jre/bin/java -enableassertions -Xmx1900m
-Djava.security.egd=file:/dev/./urandom -jar /x1/jenkins/jenkins-slave/workspace/HBase-0.94-security/trunk/target/surefire/surefirebooter3834651181654614288.jar
/x1/jenkins/jenkins-slave/workspace/HBase-0.94-security/trunk/target/surefire/surefire265250131455957627tmp
/x1/jenkins/jenkins-slave/workspace/HBase-0.94-security/trunk/target/surefire/surefire_1036875329456158510701tmp
Running org.apache.hadoop.hbase.io.hfile.TestHFilePerformance
Tests run: 1, Failures: 0, Errors: 0, Skipped: 0, Time elapsed: 4.82 sec
Forking command line: /bin/sh -c cd /x1/jenkins/jenkins-slave/workspace/HBase-0.94-security/trunk
&& /x1/jenkins/tools/java/jdk1.6.0_32-32/jre/bin/java -enableassertions -Xmx1900m
-Djava.security.egd=file:/dev/./urandom -jar /x1/jenkins/jenkins-slave/workspace/HBase-0.94-security/trunk/target/surefire/surefirebooter6536583442578446416.jar
/x1/jenkins/jenkins-slave/workspace/HBase-0.94-security/trunk/target/surefire/surefire7476180768089343517tmp
/x1/jenkins/jenkins-slave/workspace/HBase-0.94-security/trunk/target/surefire/surefire_1042149319595490339956tmp
Running org.apache.hadoop.hbase.io.hfile.TestHFileBlockCompatibility
Tests run: 10, Failures: 0, Errors: 0, Skipped: 0, Time elapsed: 0.897 sec
Forking command line: /bin/sh -c cd /x1/jenkins/jenkins-slave/workspace/HBase-0.94-security/trunk
&& /x1/jenkins/tools/java/jdk1.6.0_32-32/jre/bin/java -enableassertions -Xmx1900m
-Djava.security.egd=file:/dev/./urandom -jar /x1/jenkins/jenkins-slave/workspace/HBase-0.94-security/trunk/target/surefire/surefirebooter6974208507439209074.jar
/x1/jenkins/jenkins-slave/workspace/HBase-0.94-security/trunk/target/surefire/surefire6564052817935284571tmp
/x1/jenkins/jenkins-slave/workspace/HBase-0.94-security/trunk/target/surefire/surefire_1057628137126867982478tmp
Running org.apache.hadoop.hbase.io.hfile.TestCacheOnWrite
Tests run: 36, Failures: 0, Errors: 0, Skipped: 0, Time elapsed: 27.07 sec
Forking command line: /bin/sh -c cd /x1/jenkins/jenkins-slave/workspace/HBase-0.94-security/trunk
&& /x1/jenkins/tools/java/jdk1.6.0_32-32/jre/bin/java -enableassertions -Xmx1900m
-Djava.security.egd=file:/dev/./urandom -jar /x1/jenkins/jenkins-slave/workspace/HBase-0.94-security/trunk/target/surefire/surefirebooter8906425728964838133.jar
/x1/jenkins/jenkins-slave/workspace/HBase-0.94-security/trunk/target/surefire/surefire5711489620715423905tmp
/x1/jenkins/jenkins-slave/workspace/HBase-0.94-security/trunk/target/surefire/surefire_1065838574753570159817tmp
Running org.apache.hadoop.hbase.io.hfile.TestChecksum
Tests run: 3, Failures: 0, Errors: 0, Skipped: 0, Time elapsed: 0.735 sec
Forking command line: /bin/sh -c cd /x1/jenkins/jenkins-slave/workspace/HBase-0.94-security/trunk
&& /x1/jenkins/tools/java/jdk1.6.0_32-32/jre/bin/java -enableassertions -Xmx1900m
-Djava.security.egd=file:/dev/./urandom -jar /x1/jenkins/jenkins-slave/workspace/HBase-0.94-security/trunk/target/surefire/surefirebooter5080993624657731730.jar
/x1/jenkins/jenkins-slave/workspace/HBase-0.94-security/trunk/target/surefire/surefire8571599702977134485tmp
/x1/jenkins/jenkins-slave/workspace/HBase-0.94-security/trunk/target/surefire/surefire_1075817795560593112398tmp
Running org.apache.hadoop.hbase.io.hfile.TestForceCacheImportantBlocks
Tests run: 4, Failures: 0, Errors: 0, Skipped: 0, Time elapsed: 41.249 sec
Forking command line: /bin/sh -c cd /x1/jenkins/jenkins-slave/workspace/HBase-0.94-security/trunk
&& /x1/jenkins/tools/java/jdk1.6.0_32-32/jre/bin/java -enableassertions -Xmx1900m
-Djava.security.egd=file:/dev/./urandom -jar /x1/jenkins/jenkins-slave/workspace/HBase-0.94-security/trunk/target/surefire/surefirebooter1304015008415561147.jar
/x1/jenkins/jenkins-slave/workspace/HBase-0.94-security/trunk/target/surefire/surefire7642003475149939566tmp
/x1/jenkins/jenkins-slave/workspace/HBase-0.94-security/trunk/target/surefire/surefire_1086701546979256493660tmp
Running org.apache.hadoop.hbase.io.hfile.slab.TestSlabCache
Tests run: 7, Failures: 0, Errors: 0, Skipped: 0, Time elapsed: 19.217 sec
Forking command line: /bin/sh -c cd /x1/jenkins/jenkins-slave/workspace/HBase-0.94-security/trunk
&& /x1/jenkins/tools/java/jdk1.6.0_32-32/jre/bin/java -enableassertions -Xmx1900m
-Djava.security.egd=file:/dev/./urandom -jar /x1/jenkins/jenkins-slave/workspace/HBase-0.94-security/trunk/target/surefire/surefirebooter3085126896987798704.jar
/x1/jenkins/jenkins-slave/workspace/HBase-0.94-security/trunk/target/surefire/surefire7680119035074466292tmp
/x1/jenkins/jenkins-slave/workspace/HBase-0.94-security/trunk/target/surefire/surefire_1095960490890795565213tmp
Running org.apache.hadoop.hbase.io.hfile.TestHFileBlock
Running org.apache.hadoop.hbase.io.hfile.slab.TestSingleSizeCache
Tests run: 5, Failures: 0, Errors: 0, Skipped: 0, Time elapsed: 21.069 sec
Tests run: 16, Failures: 0, Errors: 0, Skipped: 0, Time elapsed: 45.785 sec
Forking command line: /bin/sh -c cd /x1/jenkins/jenkins-slave/workspace/HBase-0.94-security/trunk
&& /x1/jenkins/tools/java/jdk1.6.0_32-32/jre/bin/java -enableassertions -Xmx1900m
-Djava.security.egd=file:/dev/./urandom -jar /x1/jenkins/jenkins-slave/workspace/HBase-0.94-security/trunk/target/surefire/surefirebooter8945592101324501828.jar
/x1/jenkins/jenkins-slave/workspace/HBase-0.94-security/trunk/target/surefire/surefire3263646822674097477tmp
/x1/jenkins/jenkins-slave/workspace/HBase-0.94-security/trunk/target/surefire/surefire_1107795622828297818026tmp
Forking command line: /bin/sh -c cd /x1/jenkins/jenkins-slave/workspace/HBase-0.94-security/trunk
&& /x1/jenkins/tools/java/jdk1.6.0_32-32/jre/bin/java -enableassertions -Xmx1900m
-Djava.security.egd=file:/dev/./urandom -jar /x1/jenkins/jenkins-slave/workspace/HBase-0.94-security/trunk/target/surefire/surefirebooter9059606144946393842.jar
/x1/jenkins/jenkins-slave/workspace/HBase-0.94-security/trunk/target/surefire/surefire571926003073186861tmp
/x1/jenkins/jenkins-slave/workspace/HBase-0.94-security/trunk/target/surefire/surefire_1112886822970290759517tmp
Running org.apache.hadoop.hbase.replication.TestReplicationZookeeper
Tests run: 1, Failures: 0, Errors: 0, Skipped: 0, Time elapsed: 0.603 sec
Forking command line: /bin/sh -c cd /x1/jenkins/jenkins-slave/workspace/HBase-0.94-security/trunk
&& /x1/jenkins/tools/java/jdk1.6.0_32-32/jre/bin/java -enableassertions -Xmx1900m
-Djava.security.egd=file:/dev/./urandom -jar /x1/jenkins/jenkins-slave/workspace/HBase-0.94-security/trunk/target/surefire/surefirebooter1133457116192276132.jar
/x1/jenkins/jenkins-slave/workspace/HBase-0.94-security/trunk/target/surefire/surefire4139644755090825852tmp
/x1/jenkins/jenkins-slave/workspace/HBase-0.94-security/trunk/target/surefire/surefire_1123254432606671637964tmp
Running org.apache.hadoop.hbase.replication.regionserver.TestReplicationSink
Tests run: 5, Failures: 0, Errors: 0, Skipped: 0, Time elapsed: 14.695 sec
Forking command line: /bin/sh -c cd /x1/jenkins/jenkins-slave/workspace/HBase-0.94-security/trunk
&& /x1/jenkins/tools/java/jdk1.6.0_32-32/jre/bin/java -enableassertions -Xmx1900m
-Djava.security.egd=file:/dev/./urandom -jar /x1/jenkins/jenkins-slave/workspace/HBase-0.94-security/trunk/target/surefire/surefirebooter5928253728329757098.jar
/x1/jenkins/jenkins-slave/workspace/HBase-0.94-security/trunk/target/surefire/surefire3172045880070419496tmp
/x1/jenkins/jenkins-slave/workspace/HBase-0.94-security/trunk/target/surefire/surefire_11336078456275095439tmp
Running org.apache.hadoop.hbase.replication.regionserver.TestReplicationSourceManager
Tests run: 1, Failures: 0, Errors: 0, Skipped: 0, Time elapsed: 0.985 sec
Forking command line: /bin/sh -c cd /x1/jenkins/jenkins-slave/workspace/HBase-0.94-security/trunk
&& /x1/jenkins/tools/java/jdk1.6.0_32-32/jre/bin/java -enableassertions -Xmx1900m
-Djava.security.egd=file:/dev/./urandom -jar /x1/jenkins/jenkins-slave/workspace/HBase-0.94-security/trunk/target/surefire/surefirebooter9204723783486045711.jar
/x1/jenkins/jenkins-slave/workspace/HBase-0.94-security/trunk/target/surefire/surefire4543980785863472336tmp
/x1/jenkins/jenkins-slave/workspace/HBase-0.94-security/trunk/target/surefire/surefire_1141581998370436268897tmp
Running org.apache.hadoop.hbase.replication.TestReplicationSource
Tests run: 1, Failures: 0, Errors: 0, Skipped: 0, Time elapsed: 2.447 sec
Forking command line: /bin/sh -c cd /x1/jenkins/jenkins-slave/workspace/HBase-0.94-security/trunk
&& /x1/jenkins/tools/java/jdk1.6.0_32-32/jre/bin/java -enableassertions -Xmx1900m
-Djava.security.egd=file:/dev/./urandom -jar /x1/jenkins/jenkins-slave/workspace/HBase-0.94-security/trunk/target/surefire/surefirebooter6012850182607258357.jar
/x1/jenkins/jenkins-slave/workspace/HBase-0.94-security/trunk/target/surefire/surefire4551360657983859130tmp
/x1/jenkins/jenkins-slave/workspace/HBase-0.94-security/trunk/target/surefire/surefire_1156154646559517560015tmp
Running org.apache.hadoop.hbase.util.TestFSTableDescriptors
Tests run: 10, Failures: 0, Errors: 0, Skipped: 0, Time elapsed: 0.816 sec
Forking command line: /bin/sh -c cd /x1/jenkins/jenkins-slave/workspace/HBase-0.94-security/trunk
&& /x1/jenkins/tools/java/jdk1.6.0_32-32/jre/bin/java -enableassertions -Xmx1900m
-Djava.security.egd=file:/dev/./urandom -jar /x1/jenkins/jenkins-slave/workspace/HBase-0.94-security/trunk/target/surefire/surefirebooter6988843815689337222.jar
/x1/jenkins/jenkins-slave/workspace/HBase-0.94-security/trunk/target/surefire/surefire5061580433158731032tmp
/x1/jenkins/jenkins-slave/workspace/HBase-0.94-security/trunk/target/surefire/surefire_1165192174897599571330tmp
Running org.apache.hadoop.hbase.io.encoding.TestLoadAndSwitchEncodeOnDisk
Tests run: 1, Failures: 0, Errors: 0, Skipped: 0, Time elapsed: 24.426 sec
Forking command line: /bin/sh -c cd /x1/jenkins/jenkins-slave/workspace/HBase-0.94-security/trunk
&& /x1/jenkins/tools/java/jdk1.6.0_32-32/jre/bin/java -enableassertions -Xmx1900m
-Djava.security.egd=file:/dev/./urandom -jar /x1/jenkins/jenkins-slave/workspace/HBase-0.94-security/trunk/target/surefire/surefirebooter1512553135511146886.jar
/x1/jenkins/jenkins-slave/workspace/HBase-0.94-security/trunk/target/surefire/surefire1598706108739670127tmp
/x1/jenkins/jenkins-slave/workspace/HBase-0.94-security/trunk/target/surefire/surefire_1176615800402008085173tmp
Running org.apache.hadoop.hbase.util.TestEnvironmentEdgeManager
Tests run: 2, Failures: 0, Errors: 0, Skipped: 0, Time elapsed: 0.343 sec
Forking command line: /bin/sh -c cd /x1/jenkins/jenkins-slave/workspace/HBase-0.94-security/trunk
&& /x1/jenkins/tools/java/jdk1.6.0_32-32/jre/bin/java -enableassertions -Xmx1900m
-Djava.security.egd=file:/dev/./urandom -jar /x1/jenkins/jenkins-slave/workspace/HBase-0.94-security/trunk/target/surefire/surefirebooter2045337002813303302.jar
/x1/jenkins/jenkins-slave/workspace/HBase-0.94-security/trunk/target/surefire/surefire2050960786295554157tmp
/x1/jenkins/jenkins-slave/workspace/HBase-0.94-security/trunk/target/surefire/surefire_1187124900073485662779tmp
Running org.apache.hadoop.hbase.util.TestIdLock
Tests run: 1, Failures: 0, Errors: 0, Skipped: 0, Time elapsed: 15.269 sec
Forking command line: /bin/sh -c cd /x1/jenkins/jenkins-slave/workspace/HBase-0.94-security/trunk
&& /x1/jenkins/tools/java/jdk1.6.0_32-32/jre/bin/java -enableassertions -Xmx1900m
-Djava.security.egd=file:/dev/./urandom -jar /x1/jenkins/jenkins-slave/workspace/HBase-0.94-security/trunk/target/surefire/surefirebooter7309936909045848058.jar
/x1/jenkins/jenkins-slave/workspace/HBase-0.94-security/trunk/target/surefire/surefire7647138095172994507tmp
/x1/jenkins/jenkins-slave/workspace/HBase-0.94-security/trunk/target/surefire/surefire_1191128015601533979229tmp
Running org.apache.hadoop.hbase.util.TestMergeTable
Tests run: 1, Failures: 0, Errors: 0, Skipped: 0, Time elapsed: 26.48 sec
Forking command line: /bin/sh -c cd /x1/jenkins/jenkins-slave/workspace/HBase-0.94-security/trunk
&& /x1/jenkins/tools/java/jdk1.6.0_32-32/jre/bin/java -enableassertions -Xmx1900m
-Djava.security.egd=file:/dev/./urandom -jar /x1/jenkins/jenkins-slave/workspace/HBase-0.94-security/trunk/target/surefire/surefirebooter8044449260388900082.jar
/x1/jenkins/jenkins-slave/workspace/HBase-0.94-security/trunk/target/surefire/surefire619961663616681030tmp
/x1/jenkins/jenkins-slave/workspace/HBase-0.94-security/trunk/target/surefire/surefire_1202836064331699097053tmp
Running org.apache.hadoop.hbase.util.TestPoolMap$TestRoundRobinPoolType
Tests run: 3, Failures: 0, Errors: 0, Skipped: 0, Time elapsed: 0.009 sec
Running org.apache.hadoop.hbase.util.TestPoolMap$TestThreadLocalPoolType
Tests run: 3, Failures: 0, Errors: 0, Skipped: 0, Time elapsed: 0.006 sec
Running org.apache.hadoop.hbase.util.TestPoolMap$TestReusablePoolType
Tests run: 3, Failures: 0, Errors: 0, Skipped: 0, Time elapsed: 0.035 sec
Forking command line: /bin/sh -c cd /x1/jenkins/jenkins-slave/workspace/HBase-0.94-security/trunk
&& /x1/jenkins/tools/java/jdk1.6.0_32-32/jre/bin/java -enableassertions -Xmx1900m
-Djava.security.egd=file:/dev/./urandom -jar /x1/jenkins/jenkins-slave/workspace/HBase-0.94-security/trunk/target/surefire/surefirebooter3726019037535345365.jar
/x1/jenkins/jenkins-slave/workspace/HBase-0.94-security/trunk/target/surefire/surefire8842649578698150241tmp
/x1/jenkins/jenkins-slave/workspace/HBase-0.94-security/trunk/target/surefire/surefire_1213952825124830988879tmp
Running org.apache.hadoop.hbase.util.TestFSUtils
Tests run: 4, Failures: 0, Errors: 0, Skipped: 0, Time elapsed: 19.637 sec
Forking command line: /bin/sh -c cd /x1/jenkins/jenkins-slave/workspace/HBase-0.94-security/trunk
&& /x1/jenkins/tools/java/jdk1.6.0_32-32/jre/bin/java -enableassertions -Xmx1900m
-Djava.security.egd=file:/dev/./urandom -jar /x1/jenkins/jenkins-slave/workspace/HBase-0.94-security/trunk/target/surefire/surefirebooter4402396087884287688.jar
/x1/jenkins/jenkins-slave/workspace/HBase-0.94-security/trunk/target/surefire/surefire1279294226419946897tmp
/x1/jenkins/jenkins-slave/workspace/HBase-0.94-security/trunk/target/surefire/surefire_1224402270957034854652tmp
Running org.apache.hadoop.hbase.util.TestCoprocessorScanPolicy
Tests run: 2, Failures: 0, Errors: 0, Skipped: 0, Time elapsed: 13.754 sec
Forking command line: /bin/sh -c cd /x1/jenkins/jenkins-slave/workspace/HBase-0.94-security/trunk
&& /x1/jenkins/tools/java/jdk1.6.0_32-32/jre/bin/java -enableassertions -Xmx1900m
-Djava.security.egd=file:/dev/./urandom -jar /x1/jenkins/jenkins-slave/workspace/HBase-0.94-security/trunk/target/surefire/surefirebooter1572671930428693576.jar
/x1/jenkins/jenkins-slave/workspace/HBase-0.94-security/trunk/target/surefire/surefire5678598658591312546tmp
/x1/jenkins/jenkins-slave/workspace/HBase-0.94-security/trunk/target/surefire/surefire_1233864036518207137608tmp
Running org.apache.hadoop.hbase.util.TestRegionSplitter
Tests run: 5, Failures: 0, Errors: 0, Skipped: 0, Time elapsed: 25.248 sec
Forking command line: /bin/sh -c cd /x1/jenkins/jenkins-slave/workspace/HBase-0.94-security/trunk
&& /x1/jenkins/tools/java/jdk1.6.0_32-32/jre/bin/java -enableassertions -Xmx1900m
-Djava.security.egd=file:/dev/./urandom -jar /x1/jenkins/jenkins-slave/workspace/HBase-0.94-security/trunk/target/surefire/surefirebooter3698232934157654918.jar
/x1/jenkins/jenkins-slave/workspace/HBase-0.94-security/trunk/target/surefire/surefire2832549317538544176tmp
/x1/jenkins/jenkins-slave/workspace/HBase-0.94-security/trunk/target/surefire/surefire_1244540517409078346181tmp
Running org.apache.hadoop.hbase.util.hbck.TestOfflineMetaRebuildBase
Tests run: 1, Failures: 0, Errors: 0, Skipped: 0, Time elapsed: 19.865 sec
Forking command line: /bin/sh -c cd /x1/jenkins/jenkins-slave/workspace/HBase-0.94-security/trunk
&& /x1/jenkins/tools/java/jdk1.6.0_32-32/jre/bin/java -enableassertions -Xmx1900m
-Djava.security.egd=file:/dev/./urandom -jar /x1/jenkins/jenkins-slave/workspace/HBase-0.94-security/trunk/target/surefire/surefirebooter6046758311086634769.jar
/x1/jenkins/jenkins-slave/workspace/HBase-0.94-security/trunk/target/surefire/surefire2211799595149348667tmp
/x1/jenkins/jenkins-slave/workspace/HBase-0.94-security/trunk/target/surefire/surefire_1256600759175453360790tmp
Running org.apache.hadoop.hbase.util.hbck.TestOfflineMetaRebuildOverlap
Tests run: 1, Failures: 0, Errors: 0, Skipped: 0, Time elapsed: 17.658 sec
Forking command line: /bin/sh -c cd /x1/jenkins/jenkins-slave/workspace/HBase-0.94-security/trunk
&& /x1/jenkins/tools/java/jdk1.6.0_32-32/jre/bin/java -enableassertions -Xmx1900m
-Djava.security.egd=file:/dev/./urandom -jar /x1/jenkins/jenkins-slave/workspace/HBase-0.94-security/trunk/target/surefire/surefirebooter4033525867903280641.jar
/x1/jenkins/jenkins-slave/workspace/HBase-0.94-security/trunk/target/surefire/surefire4340381545457622507tmp
/x1/jenkins/jenkins-slave/workspace/HBase-0.94-security/trunk/target/surefire/surefire_1266859962526405705672tmp
Running org.apache.hadoop.hbase.util.TestDefaultEnvironmentEdge
Tests run: 1, Failures: 0, Errors: 0, Skipped: 0, Time elapsed: 0.24 sec
Forking command line: /bin/sh -c cd /x1/jenkins/jenkins-slave/workspace/HBase-0.94-security/trunk
&& /x1/jenkins/tools/java/jdk1.6.0_32-32/jre/bin/java -enableassertions -Xmx1900m
-Djava.security.egd=file:/dev/./urandom -jar /x1/jenkins/jenkins-slave/workspace/HBase-0.94-security/trunk/target/surefire/surefirebooter3737783429930682008.jar
/x1/jenkins/jenkins-slave/workspace/HBase-0.94-security/trunk/target/surefire/surefire676872957396010482tmp
/x1/jenkins/jenkins-slave/workspace/HBase-0.94-security/trunk/target/surefire/surefire_1273952717591806936424tmp
Running org.apache.hadoop.hbase.TestInfoServers
Tests run: 2, Failures: 0, Errors: 0, Skipped: 0, Time elapsed: 11.98 sec
Running org.apache.hadoop.hbase.util.hbck.TestOfflineMetaRebuildHole
Tests run: 1, Failures: 0, Errors: 0, Skipped: 0, Time elapsed: 18.74 sec

Results :

Tests in error: 
  org.apache.hadoop.hbase.client.TestClientTimeouts: Retried 10 times

Tests run: 657, Failures: 0, Errors: 1, Skipped: 2

[INFO] ------------------------------------------------------------------------
[INFO] BUILD FAILURE
[INFO] ------------------------------------------------------------------------
[INFO] Total time: 28:54.559s
[INFO] Finished at: Sat Oct 06 03:34:44 UTC 2012
[INFO] Final Memory: 44M/898M
[INFO] ------------------------------------------------------------------------
[ERROR] Failed to execute goal org.apache.maven.plugins:maven-surefire-plugin:2.12-TRUNK-HBASE-2:test
(secondPartTestsExecution) on project hbase: There are test failures.
[ERROR] 
[ERROR] Please refer to /x1/jenkins/jenkins-slave/workspace/HBase-0.94-security/trunk/target/surefire-reports
for the individual test results.
[ERROR] -> [Help 1]
org.apache.maven.lifecycle.LifecycleExecutionException: Failed to execute goal org.apache.maven.plugins:maven-surefire-plugin:2.12-TRUNK-HBASE-2:test
(secondPartTestsExecution) on project hbase: There are test failures.

Please refer to /x1/jenkins/jenkins-slave/workspace/HBase-0.94-security/trunk/target/surefire-reports
for the individual test results.
	at org.apache.maven.lifecycle.internal.MojoExecutor.execute(MojoExecutor.java:213)
	at org.apache.maven.lifecycle.internal.MojoExecutor.execute(MojoExecutor.java:153)
	at org.apache.maven.lifecycle.internal.MojoExecutor.execute(MojoExecutor.java:145)
	at org.apache.maven.lifecycle.internal.MojoExecutor.executeForkedExecutions(MojoExecutor.java:365)
	at org.apache.maven.lifecycle.internal.MojoExecutor.execute(MojoExecutor.java:199)
	at org.apache.maven.lifecycle.internal.MojoExecutor.execute(MojoExecutor.java:153)
	at org.apache.maven.lifecycle.internal.MojoExecutor.execute(MojoExecutor.java:145)
	at org.apache.maven.lifecycle.internal.LifecycleModuleBuilder.buildProject(LifecycleModuleBuilder.java:84)
	at org.apache.maven.lifecycle.internal.LifecycleModuleBuilder.buildProject(LifecycleModuleBuilder.java:59)
	at org.apache.maven.lifecycle.internal.LifecycleStarter.singleThreadedBuild(LifecycleStarter.java:183)
	at org.apache.maven.lifecycle.internal.LifecycleStarter.execute(LifecycleStarter.java:161)
	at org.apache.maven.DefaultMaven.doExecute(DefaultMaven.java:319)
	at org.apache.maven.DefaultMaven.execute(DefaultMaven.java:156)
	at org.apache.maven.cli.MavenCli.execute(MavenCli.java:537)
	at org.apache.maven.cli.MavenCli.doMain(MavenCli.java:196)
	at org.apache.maven.cli.MavenCli.main(MavenCli.java:141)
	at sun.reflect.NativeMethodAccessorImpl.invoke0(Native Method)
	at sun.reflect.NativeMethodAccessorImpl.invoke(NativeMethodAccessorImpl.java:39)
	at sun.reflect.DelegatingMethodAccessorImpl.invoke(DelegatingMethodAccessorImpl.java:25)
	at java.lang.reflect.Method.invoke(Method.java:597)
	at org.codehaus.plexus.classworlds.launcher.Launcher.launchEnhanced(Launcher.java:290)
	at org.codehaus.plexus.classworlds.launcher.Launcher.launch(Launcher.java:230)
	at org.codehaus.plexus.classworlds.launcher.Launcher.mainWithExitCode(Launcher.java:409)
	at org.codehaus.plexus.classworlds.launcher.Launcher.main(Launcher.java:352)
Caused by: org.apache.maven.plugin.MojoFailureException: There are test failures.

Please refer to /x1/jenkins/jenkins-slave/workspace/HBase-0.94-security/trunk/target/surefire-reports
for the individual test results.
	at org.apache.maven.plugin.surefire.SurefireHelper.reportExecution(SurefireHelper.java:87)
	at org.apache.maven.plugin.surefire.SurefirePlugin.writeSummary(SurefirePlugin.java:651)
	at org.apache.maven.plugin.surefire.SurefirePlugin.handleSummary(SurefirePlugin.java:625)
	at org.apache.maven.plugin.surefire.AbstractSurefireMojo.executeAfterPreconditionsChecked(AbstractSurefireMojo.java:137)
	at org.apache.maven.plugin.surefire.AbstractSurefireMojo.execute(AbstractSurefireMojo.java:98)
	at org.apache.maven.plugin.DefaultBuildPluginManager.executeMojo(DefaultBuildPluginManager.java:101)
	at org.apache.maven.lifecycle.internal.MojoExecutor.execute(MojoExecutor.java:209)
	... 23 more
[ERROR] 
[ERROR] 
[ERROR] For more information about the errors and possible solutions, please read the following
articles:
[ERROR] [Help 1] http://cwiki.apache.org/confluence/display/MAVEN/MojoFailureException
Build step 'Invoke top-level Maven targets' marked build as failure
Archiving artifacts
Updating HBASE-6920
Recording test results

Mime
View raw message