hbase-dev mailing list archives

Site index · List index
Message view « Date » · « Thread »
Top « Date » · « Thread »
From Apache Jenkins Server <jenk...@builds.apache.org>
Subject Build failed in Jenkins: HBase-TRUNK-on-Hadoop-2.0.0 #211
Date Sat, 06 Oct 2012 00:11:59 GMT
See <https://builds.apache.org/job/HBase-TRUNK-on-Hadoop-2.0.0/211/changes>

Changes:

[jdcryans] HBASE-5582  "No HServerInfo found for" should be a WARNING message (Kevin Odell via JD)

[larsh] HBASE-6889 Ignore source control files with apache-rat (Jesse Yates)

------------------------------------------
[...truncated 13389 lines...]
Forking command line: /bin/sh -c cd /x1/jenkins/jenkins-slave/workspace/HBase-TRUNK-on-Hadoop-2.0.0/trunk/hbase-server && /x1/jenkins/tools/java/jdk1.6.0_32-32/jre/bin/java -enableassertions -Xmx1900m -Djava.security.egd=file:/dev/./urandom -jar /x1/jenkins/jenkins-slave/workspace/HBase-TRUNK-on-Hadoop-2.0.0/trunk/hbase-server/target/surefire/surefirebooter7806760832009226260.jar /x1/jenkins/jenkins-slave/workspace/HBase-TRUNK-on-Hadoop-2.0.0/trunk/hbase-server/target/surefire/surefire3231233484662432070tmp /x1/jenkins/jenkins-slave/workspace/HBase-TRUNK-on-Hadoop-2.0.0/trunk/hbase-server/target/surefire/surefire_90587406160522820154tmp
Running org.apache.hadoop.hbase.regionserver.TestCompoundBloomFilter
Tests run: 3, Failures: 0, Errors: 0, Skipped: 0, Time elapsed: 20.134 sec
Forking command line: /bin/sh -c cd /x1/jenkins/jenkins-slave/workspace/HBase-TRUNK-on-Hadoop-2.0.0/trunk/hbase-server && /x1/jenkins/tools/java/jdk1.6.0_32-32/jre/bin/java -enableassertions -Xmx1900m -Djava.security.egd=file:/dev/./urandom -jar /x1/jenkins/jenkins-slave/workspace/HBase-TRUNK-on-Hadoop-2.0.0/trunk/hbase-server/target/surefire/surefirebooter8812622369337456738.jar /x1/jenkins/jenkins-slave/workspace/HBase-TRUNK-on-Hadoop-2.0.0/trunk/hbase-server/target/surefire/surefire382924366082046010tmp /x1/jenkins/jenkins-slave/workspace/HBase-TRUNK-on-Hadoop-2.0.0/trunk/hbase-server/target/surefire/surefire_911711594724868723851tmp
Running org.apache.hadoop.hbase.regionserver.metrics.TestSchemaMetrics
Tests run: 6, Failures: 0, Errors: 0, Skipped: 0, Time elapsed: 11.782 sec
Forking command line: /bin/sh -c cd /x1/jenkins/jenkins-slave/workspace/HBase-TRUNK-on-Hadoop-2.0.0/trunk/hbase-server && /x1/jenkins/tools/java/jdk1.6.0_32-32/jre/bin/java -enableassertions -Xmx1900m -Djava.security.egd=file:/dev/./urandom -jar /x1/jenkins/jenkins-slave/workspace/HBase-TRUNK-on-Hadoop-2.0.0/trunk/hbase-server/target/surefire/surefirebooter7395773305155554313.jar /x1/jenkins/jenkins-slave/workspace/HBase-TRUNK-on-Hadoop-2.0.0/trunk/hbase-server/target/surefire/surefire1852827799883895101tmp /x1/jenkins/jenkins-slave/workspace/HBase-TRUNK-on-Hadoop-2.0.0/trunk/hbase-server/target/surefire/surefire_924718477559382514212tmp
Running org.apache.hadoop.hbase.regionserver.TestStoreFileBlockCacheSummary
Tests run: 1, Failures: 0, Errors: 0, Skipped: 0, Time elapsed: 9.675 sec
Forking command line: /bin/sh -c cd /x1/jenkins/jenkins-slave/workspace/HBase-TRUNK-on-Hadoop-2.0.0/trunk/hbase-server && /x1/jenkins/tools/java/jdk1.6.0_32-32/jre/bin/java -enableassertions -Xmx1900m -Djava.security.egd=file:/dev/./urandom -jar /x1/jenkins/jenkins-slave/workspace/HBase-TRUNK-on-Hadoop-2.0.0/trunk/hbase-server/target/surefire/surefirebooter6019187561100221828.jar /x1/jenkins/jenkins-slave/workspace/HBase-TRUNK-on-Hadoop-2.0.0/trunk/hbase-server/target/surefire/surefire5215666320447372572tmp /x1/jenkins/jenkins-slave/workspace/HBase-TRUNK-on-Hadoop-2.0.0/trunk/hbase-server/target/surefire/surefire_932792735227502814905tmp
Running org.apache.hadoop.hbase.regionserver.TestCompaction
Tests run: 15, Failures: 0, Errors: 0, Skipped: 0, Time elapsed: 34.499 sec
Forking command line: /bin/sh -c cd /x1/jenkins/jenkins-slave/workspace/HBase-TRUNK-on-Hadoop-2.0.0/trunk/hbase-server && /x1/jenkins/tools/java/jdk1.6.0_32-32/jre/bin/java -enableassertions -Xmx1900m -Djava.security.egd=file:/dev/./urandom -jar /x1/jenkins/jenkins-slave/workspace/HBase-TRUNK-on-Hadoop-2.0.0/trunk/hbase-server/target/surefire/surefirebooter4257841886394411946.jar /x1/jenkins/jenkins-slave/workspace/HBase-TRUNK-on-Hadoop-2.0.0/trunk/hbase-server/target/surefire/surefire563273496652373653tmp /x1/jenkins/jenkins-slave/workspace/HBase-TRUNK-on-Hadoop-2.0.0/trunk/hbase-server/target/surefire/surefire_946388960497471518236tmp
Running org.apache.hadoop.hbase.regionserver.TestClusterId
Tests run: 1, Failures: 0, Errors: 0, Skipped: 0, Time elapsed: 19.541 sec
Forking command line: /bin/sh -c cd /x1/jenkins/jenkins-slave/workspace/HBase-TRUNK-on-Hadoop-2.0.0/trunk/hbase-server && /x1/jenkins/tools/java/jdk1.6.0_32-32/jre/bin/java -enableassertions -Xmx1900m -Djava.security.egd=file:/dev/./urandom -jar /x1/jenkins/jenkins-slave/workspace/HBase-TRUNK-on-Hadoop-2.0.0/trunk/hbase-server/target/surefire/surefirebooter1688732632523238753.jar /x1/jenkins/jenkins-slave/workspace/HBase-TRUNK-on-Hadoop-2.0.0/trunk/hbase-server/target/surefire/surefire6477319539481961555tmp /x1/jenkins/jenkins-slave/workspace/HBase-TRUNK-on-Hadoop-2.0.0/trunk/hbase-server/target/surefire/surefire_952813888561104072625tmp
Running org.apache.hadoop.hbase.regionserver.TestMasterAddressManager
Tests run: 1, Failures: 0, Errors: 0, Skipped: 0, Time elapsed: 0.604 sec
Forking command line: /bin/sh -c cd /x1/jenkins/jenkins-slave/workspace/HBase-TRUNK-on-Hadoop-2.0.0/trunk/hbase-server && /x1/jenkins/tools/java/jdk1.6.0_32-32/jre/bin/java -enableassertions -Xmx1900m -Djava.security.egd=file:/dev/./urandom -jar /x1/jenkins/jenkins-slave/workspace/HBase-TRUNK-on-Hadoop-2.0.0/trunk/hbase-server/target/surefire/surefirebooter2362978867953663120.jar /x1/jenkins/jenkins-slave/workspace/HBase-TRUNK-on-Hadoop-2.0.0/trunk/hbase-server/target/surefire/surefire8779271968115345421tmp /x1/jenkins/jenkins-slave/workspace/HBase-TRUNK-on-Hadoop-2.0.0/trunk/hbase-server/target/surefire/surefire_966245194458620705724tmp
Running org.apache.hadoop.hbase.regionserver.TestMultiColumnScanner
Tests run: 12, Failures: 0, Errors: 0, Skipped: 0, Time elapsed: 33.532 sec
Forking command line: /bin/sh -c cd /x1/jenkins/jenkins-slave/workspace/HBase-TRUNK-on-Hadoop-2.0.0/trunk/hbase-server && /x1/jenkins/tools/java/jdk1.6.0_32-32/jre/bin/java -enableassertions -Xmx1900m -Djava.security.egd=file:/dev/./urandom -jar /x1/jenkins/jenkins-slave/workspace/HBase-TRUNK-on-Hadoop-2.0.0/trunk/hbase-server/target/surefire/surefirebooter4284727419715593884.jar /x1/jenkins/jenkins-slave/workspace/HBase-TRUNK-on-Hadoop-2.0.0/trunk/hbase-server/target/surefire/surefire8474865045001492698tmp /x1/jenkins/jenkins-slave/workspace/HBase-TRUNK-on-Hadoop-2.0.0/trunk/hbase-server/target/surefire/surefire_975992660905340447995tmp
Running org.apache.hadoop.hbase.regionserver.TestHRegion
Tests run: 69, Failures: 0, Errors: 0, Skipped: 0, Time elapsed: 30.565 sec
Forking command line: /bin/sh -c cd /x1/jenkins/jenkins-slave/workspace/HBase-TRUNK-on-Hadoop-2.0.0/trunk/hbase-server && /x1/jenkins/tools/java/jdk1.6.0_32-32/jre/bin/java -enableassertions -Xmx1900m -Djava.security.egd=file:/dev/./urandom -jar /x1/jenkins/jenkins-slave/workspace/HBase-TRUNK-on-Hadoop-2.0.0/trunk/hbase-server/target/surefire/surefirebooter8431484223245793203.jar /x1/jenkins/jenkins-slave/workspace/HBase-TRUNK-on-Hadoop-2.0.0/trunk/hbase-server/target/surefire/surefire2869901407600511180tmp /x1/jenkins/jenkins-slave/workspace/HBase-TRUNK-on-Hadoop-2.0.0/trunk/hbase-server/target/surefire/surefire_987503191475243843537tmp
Running org.apache.hadoop.hbase.backup.example.TestZooKeeperTableArchiveClient
Tests run: 3, Failures: 0, Errors: 0, Skipped: 0, Time elapsed: 4.639 sec
Forking command line: /bin/sh -c cd /x1/jenkins/jenkins-slave/workspace/HBase-TRUNK-on-Hadoop-2.0.0/trunk/hbase-server && /x1/jenkins/tools/java/jdk1.6.0_32-32/jre/bin/java -enableassertions -Xmx1900m -Djava.security.egd=file:/dev/./urandom -jar /x1/jenkins/jenkins-slave/workspace/HBase-TRUNK-on-Hadoop-2.0.0/trunk/hbase-server/target/surefire/surefirebooter2532650889719394561.jar /x1/jenkins/jenkins-slave/workspace/HBase-TRUNK-on-Hadoop-2.0.0/trunk/hbase-server/target/surefire/surefire5545143817214130305tmp /x1/jenkins/jenkins-slave/workspace/HBase-TRUNK-on-Hadoop-2.0.0/trunk/hbase-server/target/surefire/surefire_992434636603590563673tmp
Running org.apache.hadoop.hbase.TestLocalHBaseCluster
Tests run: 1, Failures: 0, Errors: 0, Skipped: 0, Time elapsed: 6.903 sec
Forking command line: /bin/sh -c cd /x1/jenkins/jenkins-slave/workspace/HBase-TRUNK-on-Hadoop-2.0.0/trunk/hbase-server && /x1/jenkins/tools/java/jdk1.6.0_32-32/jre/bin/java -enableassertions -Xmx1900m -Djava.security.egd=file:/dev/./urandom -jar /x1/jenkins/jenkins-slave/workspace/HBase-TRUNK-on-Hadoop-2.0.0/trunk/hbase-server/target/surefire/surefirebooter5392339248981346357.jar /x1/jenkins/jenkins-slave/workspace/HBase-TRUNK-on-Hadoop-2.0.0/trunk/hbase-server/target/surefire/surefire7551514292396807509tmp /x1/jenkins/jenkins-slave/workspace/HBase-TRUNK-on-Hadoop-2.0.0/trunk/hbase-server/target/surefire/surefire_1008222039567789926106tmp
Running org.apache.hadoop.hbase.ipc.TestDelayedRpc
Tests run: 4, Failures: 0, Errors: 0, Skipped: 0, Time elapsed: 2.401 sec
Forking command line: /bin/sh -c cd /x1/jenkins/jenkins-slave/workspace/HBase-TRUNK-on-Hadoop-2.0.0/trunk/hbase-server && /x1/jenkins/tools/java/jdk1.6.0_32-32/jre/bin/java -enableassertions -Xmx1900m -Djava.security.egd=file:/dev/./urandom -jar /x1/jenkins/jenkins-slave/workspace/HBase-TRUNK-on-Hadoop-2.0.0/trunk/hbase-server/target/surefire/surefirebooter8829807237805766419.jar /x1/jenkins/jenkins-slave/workspace/HBase-TRUNK-on-Hadoop-2.0.0/trunk/hbase-server/target/surefire/surefire903179271905609184tmp /x1/jenkins/jenkins-slave/workspace/HBase-TRUNK-on-Hadoop-2.0.0/trunk/hbase-server/target/surefire/surefire_1012078451069484010312tmp
Running org.apache.hadoop.hbase.ipc.TestHBaseClient
Tests run: 1, Failures: 0, Errors: 0, Skipped: 0, Time elapsed: 0.252 sec
Forking command line: /bin/sh -c cd /x1/jenkins/jenkins-slave/workspace/HBase-TRUNK-on-Hadoop-2.0.0/trunk/hbase-server && /x1/jenkins/tools/java/jdk1.6.0_32-32/jre/bin/java -enableassertions -Xmx1900m -Djava.security.egd=file:/dev/./urandom -jar /x1/jenkins/jenkins-slave/workspace/HBase-TRUNK-on-Hadoop-2.0.0/trunk/hbase-server/target/surefire/surefirebooter1843532821484394657.jar /x1/jenkins/jenkins-slave/workspace/HBase-TRUNK-on-Hadoop-2.0.0/trunk/hbase-server/target/surefire/surefire1517542573217326240tmp /x1/jenkins/jenkins-slave/workspace/HBase-TRUNK-on-Hadoop-2.0.0/trunk/hbase-server/target/surefire/surefire_1027117969680234969940tmp
Running org.apache.hadoop.hbase.ipc.TestProtoBufRpc
Tests run: 1, Failures: 0, Errors: 0, Skipped: 0, Time elapsed: 0.702 sec
Forking command line: /bin/sh -c cd /x1/jenkins/jenkins-slave/workspace/HBase-TRUNK-on-Hadoop-2.0.0/trunk/hbase-server && /x1/jenkins/tools/java/jdk1.6.0_32-32/jre/bin/java -enableassertions -Xmx1900m -Djava.security.egd=file:/dev/./urandom -jar /x1/jenkins/jenkins-slave/workspace/HBase-TRUNK-on-Hadoop-2.0.0/trunk/hbase-server/target/surefire/surefirebooter92353591676497516.jar /x1/jenkins/jenkins-slave/workspace/HBase-TRUNK-on-Hadoop-2.0.0/trunk/hbase-server/target/surefire/surefire5456449031853141091tmp /x1/jenkins/jenkins-slave/workspace/HBase-TRUNK-on-Hadoop-2.0.0/trunk/hbase-server/target/surefire/surefire_1031760956018268649368tmp
Running org.apache.hadoop.hbase.TestGlobalMemStoreSize
Tests run: 1, Failures: 0, Errors: 0, Skipped: 0, Time elapsed: 28.814 sec
Forking command line: /bin/sh -c cd /x1/jenkins/jenkins-slave/workspace/HBase-TRUNK-on-Hadoop-2.0.0/trunk/hbase-server && /x1/jenkins/tools/java/jdk1.6.0_32-32/jre/bin/java -enableassertions -Xmx1900m -Djava.security.egd=file:/dev/./urandom -jar /x1/jenkins/jenkins-slave/workspace/HBase-TRUNK-on-Hadoop-2.0.0/trunk/hbase-server/target/surefire/surefirebooter5921640442488031929.jar /x1/jenkins/jenkins-slave/workspace/HBase-TRUNK-on-Hadoop-2.0.0/trunk/hbase-server/target/surefire/surefire8366290433639562257tmp /x1/jenkins/jenkins-slave/workspace/HBase-TRUNK-on-Hadoop-2.0.0/trunk/hbase-server/target/surefire/surefire_1041166461348021862612tmp
Running org.apache.hadoop.hbase.backup.TestHFileArchiving
Tests run: 3, Failures: 0, Errors: 0, Skipped: 0, Time elapsed: 61.883 sec
Forking command line: /bin/sh -c cd /x1/jenkins/jenkins-slave/workspace/HBase-TRUNK-on-Hadoop-2.0.0/trunk/hbase-server && /x1/jenkins/tools/java/jdk1.6.0_32-32/jre/bin/java -enableassertions -Xmx1900m -Djava.security.egd=file:/dev/./urandom -jar /x1/jenkins/jenkins-slave/workspace/HBase-TRUNK-on-Hadoop-2.0.0/trunk/hbase-server/target/surefire/surefirebooter3660501202773961877.jar /x1/jenkins/jenkins-slave/workspace/HBase-TRUNK-on-Hadoop-2.0.0/trunk/hbase-server/target/surefire/surefire7948667101639920036tmp /x1/jenkins/jenkins-slave/workspace/HBase-TRUNK-on-Hadoop-2.0.0/trunk/hbase-server/target/surefire/surefire_1055163583893477289598tmp
Running org.apache.hadoop.hbase.constraint.TestConstraint
Tests run: 5, Failures: 0, Errors: 0, Skipped: 0, Time elapsed: 22.633 sec
Forking command line: /bin/sh -c cd /x1/jenkins/jenkins-slave/workspace/HBase-TRUNK-on-Hadoop-2.0.0/trunk/hbase-server && /x1/jenkins/tools/java/jdk1.6.0_32-32/jre/bin/java -enableassertions -Xmx1900m -Djava.security.egd=file:/dev/./urandom -jar /x1/jenkins/jenkins-slave/workspace/HBase-TRUNK-on-Hadoop-2.0.0/trunk/hbase-server/target/surefire/surefirebooter4494733557457985508.jar /x1/jenkins/jenkins-slave/workspace/HBase-TRUNK-on-Hadoop-2.0.0/trunk/hbase-server/target/surefire/surefire1401759207801934740tmp /x1/jenkins/jenkins-slave/workspace/HBase-TRUNK-on-Hadoop-2.0.0/trunk/hbase-server/target/surefire/surefire_1062302205746597624586tmp
Running org.apache.hadoop.hbase.rest.TestSchemaResource
Tests run: 2, Failures: 0, Errors: 0, Skipped: 0, Time elapsed: 14.298 sec
Forking command line: /bin/sh -c cd /x1/jenkins/jenkins-slave/workspace/HBase-TRUNK-on-Hadoop-2.0.0/trunk/hbase-server && /x1/jenkins/tools/java/jdk1.6.0_32-32/jre/bin/java -enableassertions -Xmx1900m -Djava.security.egd=file:/dev/./urandom -jar /x1/jenkins/jenkins-slave/workspace/HBase-TRUNK-on-Hadoop-2.0.0/trunk/hbase-server/target/surefire/surefirebooter8969141986566339483.jar /x1/jenkins/jenkins-slave/workspace/HBase-TRUNK-on-Hadoop-2.0.0/trunk/hbase-server/target/surefire/surefire7966946141058441510tmp /x1/jenkins/jenkins-slave/workspace/HBase-TRUNK-on-Hadoop-2.0.0/trunk/hbase-server/target/surefire/surefire_1078424229932397577729tmp
Running org.apache.hadoop.hbase.rest.client.TestRemoteAdmin
Tests run: 1, Failures: 0, Errors: 0, Skipped: 0, Time elapsed: 11.769 sec
Forking command line: /bin/sh -c cd /x1/jenkins/jenkins-slave/workspace/HBase-TRUNK-on-Hadoop-2.0.0/trunk/hbase-server && /x1/jenkins/tools/java/jdk1.6.0_32-32/jre/bin/java -enableassertions -Xmx1900m -Djava.security.egd=file:/dev/./urandom -jar /x1/jenkins/jenkins-slave/workspace/HBase-TRUNK-on-Hadoop-2.0.0/trunk/hbase-server/target/surefire/surefirebooter2502322250449921709.jar /x1/jenkins/jenkins-slave/workspace/HBase-TRUNK-on-Hadoop-2.0.0/trunk/hbase-server/target/surefire/surefire5504571844236434294tmp /x1/jenkins/jenkins-slave/workspace/HBase-TRUNK-on-Hadoop-2.0.0/trunk/hbase-server/target/surefire/surefire_1082454393065602706323tmp
Running org.apache.hadoop.hbase.rest.client.TestRemoteTable
Tests run: 3, Failures: 0, Errors: 0, Skipped: 0, Time elapsed: 10.281 sec
Forking command line: /bin/sh -c cd /x1/jenkins/jenkins-slave/workspace/HBase-TRUNK-on-Hadoop-2.0.0/trunk/hbase-server && /x1/jenkins/tools/java/jdk1.6.0_32-32/jre/bin/java -enableassertions -Xmx1900m -Djava.security.egd=file:/dev/./urandom -jar /x1/jenkins/jenkins-slave/workspace/HBase-TRUNK-on-Hadoop-2.0.0/trunk/hbase-server/target/surefire/surefirebooter7056182615961586061.jar /x1/jenkins/jenkins-slave/workspace/HBase-TRUNK-on-Hadoop-2.0.0/trunk/hbase-server/target/surefire/surefire6306580514504083117tmp /x1/jenkins/jenkins-slave/workspace/HBase-TRUNK-on-Hadoop-2.0.0/trunk/hbase-server/target/surefire/surefire_1095732285026009221689tmp
Running org.apache.hadoop.hbase.rest.TestMultiRowResource
Tests run: 3, Failures: 0, Errors: 0, Skipped: 0, Time elapsed: 9.558 sec
Forking command line: /bin/sh -c cd /x1/jenkins/jenkins-slave/workspace/HBase-TRUNK-on-Hadoop-2.0.0/trunk/hbase-server && /x1/jenkins/tools/java/jdk1.6.0_32-32/jre/bin/java -enableassertions -Xmx1900m -Djava.security.egd=file:/dev/./urandom -jar /x1/jenkins/jenkins-slave/workspace/HBase-TRUNK-on-Hadoop-2.0.0/trunk/hbase-server/target/surefire/surefirebooter3738892949539516907.jar /x1/jenkins/jenkins-slave/workspace/HBase-TRUNK-on-Hadoop-2.0.0/trunk/hbase-server/target/surefire/surefire2206615109659116405tmp /x1/jenkins/jenkins-slave/workspace/HBase-TRUNK-on-Hadoop-2.0.0/trunk/hbase-server/target/surefire/surefire_1104121433382886850419tmp
Running org.apache.hadoop.hbase.rest.TestTableResource
Tests run: 8, Failures: 0, Errors: 0, Skipped: 0, Time elapsed: 18.427 sec
Forking command line: /bin/sh -c cd /x1/jenkins/jenkins-slave/workspace/HBase-TRUNK-on-Hadoop-2.0.0/trunk/hbase-server && /x1/jenkins/tools/java/jdk1.6.0_32-32/jre/bin/java -enableassertions -Xmx1900m -Djava.security.egd=file:/dev/./urandom -jar /x1/jenkins/jenkins-slave/workspace/HBase-TRUNK-on-Hadoop-2.0.0/trunk/hbase-server/target/surefire/surefirebooter6178905920731052780.jar /x1/jenkins/jenkins-slave/workspace/HBase-TRUNK-on-Hadoop-2.0.0/trunk/hbase-server/target/surefire/surefire3237738152351817089tmp /x1/jenkins/jenkins-slave/workspace/HBase-TRUNK-on-Hadoop-2.0.0/trunk/hbase-server/target/surefire/surefire_1111632310515478511179tmp
Running org.apache.hadoop.hbase.rest.TestGzipFilter
Tests run: 3, Failures: 0, Errors: 0, Skipped: 0, Time elapsed: 11.119 sec
Forking command line: /bin/sh -c cd /x1/jenkins/jenkins-slave/workspace/HBase-TRUNK-on-Hadoop-2.0.0/trunk/hbase-server && /x1/jenkins/tools/java/jdk1.6.0_32-32/jre/bin/java -enableassertions -Xmx1900m -Djava.security.egd=file:/dev/./urandom -jar /x1/jenkins/jenkins-slave/workspace/HBase-TRUNK-on-Hadoop-2.0.0/trunk/hbase-server/target/surefire/surefirebooter8550026841050817054.jar /x1/jenkins/jenkins-slave/workspace/HBase-TRUNK-on-Hadoop-2.0.0/trunk/hbase-server/target/surefire/surefire4317478891184680418tmp /x1/jenkins/jenkins-slave/workspace/HBase-TRUNK-on-Hadoop-2.0.0/trunk/hbase-server/target/surefire/surefire_1128022883619770667850tmp
Running org.apache.hadoop.hbase.rest.TestRowResource
Tests run: 12, Failures: 0, Errors: 0, Skipped: 0, Time elapsed: 10.58 sec
Forking command line: /bin/sh -c cd /x1/jenkins/jenkins-slave/workspace/HBase-TRUNK-on-Hadoop-2.0.0/trunk/hbase-server && /x1/jenkins/tools/java/jdk1.6.0_32-32/jre/bin/java -enableassertions -Xmx1900m -Djava.security.egd=file:/dev/./urandom -jar /x1/jenkins/jenkins-slave/workspace/HBase-TRUNK-on-Hadoop-2.0.0/trunk/hbase-server/target/surefire/surefirebooter3462152019904772943.jar /x1/jenkins/jenkins-slave/workspace/HBase-TRUNK-on-Hadoop-2.0.0/trunk/hbase-server/target/surefire/surefire4940238997572253654tmp /x1/jenkins/jenkins-slave/workspace/HBase-TRUNK-on-Hadoop-2.0.0/trunk/hbase-server/target/surefire/surefire_1131183850778660894191tmp
Running org.apache.hadoop.hbase.rest.TestVersionResource
Tests run: 7, Failures: 0, Errors: 0, Skipped: 0, Time elapsed: 8.313 sec
Forking command line: /bin/sh -c cd /x1/jenkins/jenkins-slave/workspace/HBase-TRUNK-on-Hadoop-2.0.0/trunk/hbase-server && /x1/jenkins/tools/java/jdk1.6.0_32-32/jre/bin/java -enableassertions -Xmx1900m -Djava.security.egd=file:/dev/./urandom -jar /x1/jenkins/jenkins-slave/workspace/HBase-TRUNK-on-Hadoop-2.0.0/trunk/hbase-server/target/surefire/surefirebooter3070009028502148701.jar /x1/jenkins/jenkins-slave/workspace/HBase-TRUNK-on-Hadoop-2.0.0/trunk/hbase-server/target/surefire/surefire4535399662156166850tmp /x1/jenkins/jenkins-slave/workspace/HBase-TRUNK-on-Hadoop-2.0.0/trunk/hbase-server/target/surefire/surefire_1147522396425553068622tmp
Running org.apache.hadoop.hbase.rest.TestStatusResource
Tests run: 2, Failures: 0, Errors: 0, Skipped: 0, Time elapsed: 10.098 sec
Forking command line: /bin/sh -c cd /x1/jenkins/jenkins-slave/workspace/HBase-TRUNK-on-Hadoop-2.0.0/trunk/hbase-server && /x1/jenkins/tools/java/jdk1.6.0_32-32/jre/bin/java -enableassertions -Xmx1900m -Djava.security.egd=file:/dev/./urandom -jar /x1/jenkins/jenkins-slave/workspace/HBase-TRUNK-on-Hadoop-2.0.0/trunk/hbase-server/target/surefire/surefirebooter5681061595255854613.jar /x1/jenkins/jenkins-slave/workspace/HBase-TRUNK-on-Hadoop-2.0.0/trunk/hbase-server/target/surefire/surefire5481399188831999873tmp /x1/jenkins/jenkins-slave/workspace/HBase-TRUNK-on-Hadoop-2.0.0/trunk/hbase-server/target/surefire/surefire_1153945082698861741851tmp
Running org.apache.hadoop.hbase.rest.TestScannerResource
Tests run: 5, Failures: 0, Errors: 0, Skipped: 0, Time elapsed: 25.604 sec
Forking command line: /bin/sh -c cd /x1/jenkins/jenkins-slave/workspace/HBase-TRUNK-on-Hadoop-2.0.0/trunk/hbase-server && /x1/jenkins/tools/java/jdk1.6.0_32-32/jre/bin/java -enableassertions -Xmx1900m -Djava.security.egd=file:/dev/./urandom -jar /x1/jenkins/jenkins-slave/workspace/HBase-TRUNK-on-Hadoop-2.0.0/trunk/hbase-server/target/surefire/surefirebooter6369710726708783706.jar /x1/jenkins/jenkins-slave/workspace/HBase-TRUNK-on-Hadoop-2.0.0/trunk/hbase-server/target/surefire/surefire3360399771877318273tmp /x1/jenkins/jenkins-slave/workspace/HBase-TRUNK-on-Hadoop-2.0.0/trunk/hbase-server/target/surefire/surefire_1165528353843354795059tmp
Running org.apache.hadoop.hbase.trace.TestHTraceHooks
Tests run: 1, Failures: 0, Errors: 0, Skipped: 0, Time elapsed: 8.419 sec
Forking command line: /bin/sh -c cd /x1/jenkins/jenkins-slave/workspace/HBase-TRUNK-on-Hadoop-2.0.0/trunk/hbase-server && /x1/jenkins/tools/java/jdk1.6.0_32-32/jre/bin/java -enableassertions -Xmx1900m -Djava.security.egd=file:/dev/./urandom -jar /x1/jenkins/jenkins-slave/workspace/HBase-TRUNK-on-Hadoop-2.0.0/trunk/hbase-server/target/surefire/surefirebooter7466319290042081145.jar /x1/jenkins/jenkins-slave/workspace/HBase-TRUNK-on-Hadoop-2.0.0/trunk/hbase-server/target/surefire/surefire400198001347779018tmp /x1/jenkins/jenkins-slave/workspace/HBase-TRUNK-on-Hadoop-2.0.0/trunk/hbase-server/target/surefire/surefire_1173031173611065319523tmp
Running org.apache.hadoop.hbase.rest.TestScannersWithFilters
Tests run: 10, Failures: 0, Errors: 0, Skipped: 0, Time elapsed: 12.532 sec
Forking command line: /bin/sh -c cd /x1/jenkins/jenkins-slave/workspace/HBase-TRUNK-on-Hadoop-2.0.0/trunk/hbase-server && /x1/jenkins/tools/java/jdk1.6.0_32-32/jre/bin/java -enableassertions -Xmx1900m -Djava.security.egd=file:/dev/./urandom -jar /x1/jenkins/jenkins-slave/workspace/HBase-TRUNK-on-Hadoop-2.0.0/trunk/hbase-server/target/surefire/surefirebooter5770146049428201194.jar /x1/jenkins/jenkins-slave/workspace/HBase-TRUNK-on-Hadoop-2.0.0/trunk/hbase-server/target/surefire/surefire1121060999094199211tmp /x1/jenkins/jenkins-slave/workspace/HBase-TRUNK-on-Hadoop-2.0.0/trunk/hbase-server/target/surefire/surefire_1182859148514728913434tmp
Running org.apache.hadoop.hbase.io.hfile.TestHFileSeek
Tests run: 1, Failures: 0, Errors: 0, Skipped: 0, Time elapsed: 5.275 sec
Forking command line: /bin/sh -c cd /x1/jenkins/jenkins-slave/workspace/HBase-TRUNK-on-Hadoop-2.0.0/trunk/hbase-server && /x1/jenkins/tools/java/jdk1.6.0_32-32/jre/bin/java -enableassertions -Xmx1900m -Djava.security.egd=file:/dev/./urandom -jar /x1/jenkins/jenkins-slave/workspace/HBase-TRUNK-on-Hadoop-2.0.0/trunk/hbase-server/target/surefire/surefirebooter1551696670073156555.jar /x1/jenkins/jenkins-slave/workspace/HBase-TRUNK-on-Hadoop-2.0.0/trunk/hbase-server/target/surefire/surefire965083450471270604tmp /x1/jenkins/jenkins-slave/workspace/HBase-TRUNK-on-Hadoop-2.0.0/trunk/hbase-server/target/surefire/surefire_1197563319680729765463tmp
Running org.apache.hadoop.hbase.io.hfile.TestHFileBlockIndex
Tests run: 10, Failures: 0, Errors: 0, Skipped: 0, Time elapsed: 8.251 sec
Forking command line: /bin/sh -c cd /x1/jenkins/jenkins-slave/workspace/HBase-TRUNK-on-Hadoop-2.0.0/trunk/hbase-server && /x1/jenkins/tools/java/jdk1.6.0_32-32/jre/bin/java -enableassertions -Xmx1900m -Djava.security.egd=file:/dev/./urandom -jar /x1/jenkins/jenkins-slave/workspace/HBase-TRUNK-on-Hadoop-2.0.0/trunk/hbase-server/target/surefire/surefirebooter995399313608521929.jar /x1/jenkins/jenkins-slave/workspace/HBase-TRUNK-on-Hadoop-2.0.0/trunk/hbase-server/target/surefire/surefire2472866759715272924tmp /x1/jenkins/jenkins-slave/workspace/HBase-TRUNK-on-Hadoop-2.0.0/trunk/hbase-server/target/surefire/surefire_1208925357459859180629tmp
Running org.apache.hadoop.hbase.io.hfile.TestHFilePerformance
Tests run: 1, Failures: 0, Errors: 0, Skipped: 0, Time elapsed: 4.575 sec
Forking command line: /bin/sh -c cd /x1/jenkins/jenkins-slave/workspace/HBase-TRUNK-on-Hadoop-2.0.0/trunk/hbase-server && /x1/jenkins/tools/java/jdk1.6.0_32-32/jre/bin/java -enableassertions -Xmx1900m -Djava.security.egd=file:/dev/./urandom -jar /x1/jenkins/jenkins-slave/workspace/HBase-TRUNK-on-Hadoop-2.0.0/trunk/hbase-server/target/surefire/surefirebooter908911232417675516.jar /x1/jenkins/jenkins-slave/workspace/HBase-TRUNK-on-Hadoop-2.0.0/trunk/hbase-server/target/surefire/surefire3188232664544126028tmp /x1/jenkins/jenkins-slave/workspace/HBase-TRUNK-on-Hadoop-2.0.0/trunk/hbase-server/target/surefire/surefire_1211889532027898082339tmp
Running org.apache.hadoop.hbase.io.hfile.TestCacheOnWrite
Tests run: 36, Failures: 0, Errors: 0, Skipped: 0, Time elapsed: 27.53 sec
Forking command line: /bin/sh -c cd /x1/jenkins/jenkins-slave/workspace/HBase-TRUNK-on-Hadoop-2.0.0/trunk/hbase-server && /x1/jenkins/tools/java/jdk1.6.0_32-32/jre/bin/java -enableassertions -Xmx1900m -Djava.security.egd=file:/dev/./urandom -jar /x1/jenkins/jenkins-slave/workspace/HBase-TRUNK-on-Hadoop-2.0.0/trunk/hbase-server/target/surefire/surefirebooter5269148726018228662.jar /x1/jenkins/jenkins-slave/workspace/HBase-TRUNK-on-Hadoop-2.0.0/trunk/hbase-server/target/surefire/surefire380411109757895143tmp /x1/jenkins/jenkins-slave/workspace/HBase-TRUNK-on-Hadoop-2.0.0/trunk/hbase-server/target/surefire/surefire_122919813778391513041tmp
Running org.apache.hadoop.hbase.io.hfile.TestForceCacheImportantBlocks
Tests run: 4, Failures: 0, Errors: 0, Skipped: 0, Time elapsed: 38.792 sec
Forking command line: /bin/sh -c cd /x1/jenkins/jenkins-slave/workspace/HBase-TRUNK-on-Hadoop-2.0.0/trunk/hbase-server && /x1/jenkins/tools/java/jdk1.6.0_32-32/jre/bin/java -enableassertions -Xmx1900m -Djava.security.egd=file:/dev/./urandom -jar /x1/jenkins/jenkins-slave/workspace/HBase-TRUNK-on-Hadoop-2.0.0/trunk/hbase-server/target/surefire/surefirebooter236917614519678394.jar /x1/jenkins/jenkins-slave/workspace/HBase-TRUNK-on-Hadoop-2.0.0/trunk/hbase-server/target/surefire/surefire8234475368156133078tmp /x1/jenkins/jenkins-slave/workspace/HBase-TRUNK-on-Hadoop-2.0.0/trunk/hbase-server/target/surefire/surefire_123981057787876268753tmp
Running org.apache.hadoop.hbase.io.hfile.TestHFileBlock
Tests run: 16, Failures: 0, Errors: 0, Skipped: 0, Time elapsed: 45.774 sec
Forking command line: /bin/sh -c cd /x1/jenkins/jenkins-slave/workspace/HBase-TRUNK-on-Hadoop-2.0.0/trunk/hbase-server && /x1/jenkins/tools/java/jdk1.6.0_32-32/jre/bin/java -enableassertions -Xmx1900m -Djava.security.egd=file:/dev/./urandom -jar /x1/jenkins/jenkins-slave/workspace/HBase-TRUNK-on-Hadoop-2.0.0/trunk/hbase-server/target/surefire/surefirebooter3302277977702143795.jar /x1/jenkins/jenkins-slave/workspace/HBase-TRUNK-on-Hadoop-2.0.0/trunk/hbase-server/target/surefire/surefire4037578792895995402tmp /x1/jenkins/jenkins-slave/workspace/HBase-TRUNK-on-Hadoop-2.0.0/trunk/hbase-server/target/surefire/surefire_1242801524047787995521tmp
Running org.apache.hadoop.hbase.io.hfile.TestScannerSelectionUsingTTL
Tests run: 6, Failures: 0, Errors: 0, Skipped: 0, Time elapsed: 61.435 sec
Forking command line: /bin/sh -c cd /x1/jenkins/jenkins-slave/workspace/HBase-TRUNK-on-Hadoop-2.0.0/trunk/hbase-server && /x1/jenkins/tools/java/jdk1.6.0_32-32/jre/bin/java -enableassertions -Xmx1900m -Djava.security.egd=file:/dev/./urandom -jar /x1/jenkins/jenkins-slave/workspace/HBase-TRUNK-on-Hadoop-2.0.0/trunk/hbase-server/target/surefire/surefirebooter6095159308080805482.jar /x1/jenkins/jenkins-slave/workspace/HBase-TRUNK-on-Hadoop-2.0.0/trunk/hbase-server/target/surefire/surefire1388075789766407672tmp /x1/jenkins/jenkins-slave/workspace/HBase-TRUNK-on-Hadoop-2.0.0/trunk/hbase-server/target/surefire/surefire_1256795950752596734322tmp
Running org.apache.hadoop.hbase.io.hfile.slab.TestSlabCache
Tests run: 7, Failures: 0, Errors: 0, Skipped: 0, Time elapsed: 14.202 sec
Forking command line: /bin/sh -c cd /x1/jenkins/jenkins-slave/workspace/HBase-TRUNK-on-Hadoop-2.0.0/trunk/hbase-server && /x1/jenkins/tools/java/jdk1.6.0_32-32/jre/bin/java -enableassertions -Xmx1900m -Djava.security.egd=file:/dev/./urandom -jar /x1/jenkins/jenkins-slave/workspace/HBase-TRUNK-on-Hadoop-2.0.0/trunk/hbase-server/target/surefire/surefirebooter78860254895385316.jar /x1/jenkins/jenkins-slave/workspace/HBase-TRUNK-on-Hadoop-2.0.0/trunk/hbase-server/target/surefire/surefire4670981757443575006tmp /x1/jenkins/jenkins-slave/workspace/HBase-TRUNK-on-Hadoop-2.0.0/trunk/hbase-server/target/surefire/surefire_1262161832741140748028tmp
Running org.apache.hadoop.hbase.io.TestFileLink
Tests run: 3, Failures: 0, Errors: 0, Skipped: 0, Time elapsed: 10.835 sec
Forking command line: /bin/sh -c cd /x1/jenkins/jenkins-slave/workspace/HBase-TRUNK-on-Hadoop-2.0.0/trunk/hbase-server && /x1/jenkins/tools/java/jdk1.6.0_32-32/jre/bin/java -enableassertions -Xmx1900m -Djava.security.egd=file:/dev/./urandom -jar /x1/jenkins/jenkins-slave/workspace/HBase-TRUNK-on-Hadoop-2.0.0/trunk/hbase-server/target/surefire/surefirebooter4759857727564446193.jar /x1/jenkins/jenkins-slave/workspace/HBase-TRUNK-on-Hadoop-2.0.0/trunk/hbase-server/target/surefire/surefire8186827911449767257tmp /x1/jenkins/jenkins-slave/workspace/HBase-TRUNK-on-Hadoop-2.0.0/trunk/hbase-server/target/surefire/surefire_1274639997597121170389tmp
Running org.apache.hadoop.hbase.io.hfile.slab.TestSingleSizeCache
Tests run: 5, Failures: 0, Errors: 0, Skipped: 0, Time elapsed: 16.319 sec
Forking command line: /bin/sh -c cd /x1/jenkins/jenkins-slave/workspace/HBase-TRUNK-on-Hadoop-2.0.0/trunk/hbase-server && /x1/jenkins/tools/java/jdk1.6.0_32-32/jre/bin/java -enableassertions -Xmx1900m -Djava.security.egd=file:/dev/./urandom -jar /x1/jenkins/jenkins-slave/workspace/HBase-TRUNK-on-Hadoop-2.0.0/trunk/hbase-server/target/surefire/surefirebooter1203496760571745066.jar /x1/jenkins/jenkins-slave/workspace/HBase-TRUNK-on-Hadoop-2.0.0/trunk/hbase-server/target/surefire/surefire9163647581762040241tmp /x1/jenkins/jenkins-slave/workspace/HBase-TRUNK-on-Hadoop-2.0.0/trunk/hbase-server/target/surefire/surefire_1289121635700306936041tmp
Running org.apache.hadoop.hbase.io.encoding.TestBufferedDataBlockEncoder
Tests run: 1, Failures: 0, Errors: 0, Skipped: 0, Time elapsed: 19.277 sec
Forking command line: /bin/sh -c cd /x1/jenkins/jenkins-slave/workspace/HBase-TRUNK-on-Hadoop-2.0.0/trunk/hbase-server && /x1/jenkins/tools/java/jdk1.6.0_32-32/jre/bin/java -enableassertions -Xmx1900m -Djava.security.egd=file:/dev/./urandom -jar /x1/jenkins/jenkins-slave/workspace/HBase-TRUNK-on-Hadoop-2.0.0/trunk/hbase-server/target/surefire/surefirebooter294644603680688520.jar /x1/jenkins/jenkins-slave/workspace/HBase-TRUNK-on-Hadoop-2.0.0/trunk/hbase-server/target/surefire/surefire1682374030949013961tmp /x1/jenkins/jenkins-slave/workspace/HBase-TRUNK-on-Hadoop-2.0.0/trunk/hbase-server/target/surefire/surefire_1297436598434398037132tmp
Running org.apache.hadoop.hbase.io.encoding.TestEncodedSeekers
Tests run: 8, Failures: 0, Errors: 0, Skipped: 0, Time elapsed: 24.177 sec
Forking command line: /bin/sh -c cd /x1/jenkins/jenkins-slave/workspace/HBase-TRUNK-on-Hadoop-2.0.0/trunk/hbase-server && /x1/jenkins/tools/java/jdk1.6.0_32-32/jre/bin/java -enableassertions -Xmx1900m -Djava.security.egd=file:/dev/./urandom -jar /x1/jenkins/jenkins-slave/workspace/HBase-TRUNK-on-Hadoop-2.0.0/trunk/hbase-server/target/surefire/surefirebooter3947556440353628125.jar /x1/jenkins/jenkins-slave/workspace/HBase-TRUNK-on-Hadoop-2.0.0/trunk/hbase-server/target/surefire/surefire3600535386653503201tmp /x1/jenkins/jenkins-slave/workspace/HBase-TRUNK-on-Hadoop-2.0.0/trunk/hbase-server/target/surefire/surefire_1305791423759432273028tmp
Running org.apache.hadoop.hbase.replication.TestReplicationZookeeper
Tests run: 1, Failures: 0, Errors: 0, Skipped: 0, Time elapsed: 0.579 sec
Forking command line: /bin/sh -c cd /x1/jenkins/jenkins-slave/workspace/HBase-TRUNK-on-Hadoop-2.0.0/trunk/hbase-server && /x1/jenkins/tools/java/jdk1.6.0_32-32/jre/bin/java -enableassertions -Xmx1900m -Djava.security.egd=file:/dev/./urandom -jar /x1/jenkins/jenkins-slave/workspace/HBase-TRUNK-on-Hadoop-2.0.0/trunk/hbase-server/target/surefire/surefirebooter4421526793612519320.jar /x1/jenkins/jenkins-slave/workspace/HBase-TRUNK-on-Hadoop-2.0.0/trunk/hbase-server/target/surefire/surefire1491688115147581469tmp /x1/jenkins/jenkins-slave/workspace/HBase-TRUNK-on-Hadoop-2.0.0/trunk/hbase-server/target/surefire/surefire_1316916488654747149635tmp
Running org.apache.hadoop.hbase.replication.regionserver.TestReplicationSink
Tests run: 5, Failures: 0, Errors: 0, Skipped: 0, Time elapsed: 9.648 sec
Forking command line: /bin/sh -c cd /x1/jenkins/jenkins-slave/workspace/HBase-TRUNK-on-Hadoop-2.0.0/trunk/hbase-server && /x1/jenkins/tools/java/jdk1.6.0_32-32/jre/bin/java -enableassertions -Xmx1900m -Djava.security.egd=file:/dev/./urandom -jar /x1/jenkins/jenkins-slave/workspace/HBase-TRUNK-on-Hadoop-2.0.0/trunk/hbase-server/target/surefire/surefirebooter6101053190650180872.jar /x1/jenkins/jenkins-slave/workspace/HBase-TRUNK-on-Hadoop-2.0.0/trunk/hbase-server/target/surefire/surefire3795718879809252554tmp /x1/jenkins/jenkins-slave/workspace/HBase-TRUNK-on-Hadoop-2.0.0/trunk/hbase-server/target/surefire/surefire_1322176297181966083492tmp
Running org.apache.hadoop.hbase.replication.regionserver.TestReplicationSourceManager
Tests run: 1, Failures: 0, Errors: 0, Skipped: 0, Time elapsed: 1.126 sec
Forking command line: /bin/sh -c cd /x1/jenkins/jenkins-slave/workspace/HBase-TRUNK-on-Hadoop-2.0.0/trunk/hbase-server && /x1/jenkins/tools/java/jdk1.6.0_32-32/jre/bin/java -enableassertions -Xmx1900m -Djava.security.egd=file:/dev/./urandom -jar /x1/jenkins/jenkins-slave/workspace/HBase-TRUNK-on-Hadoop-2.0.0/trunk/hbase-server/target/surefire/surefirebooter5636116137157767978.jar /x1/jenkins/jenkins-slave/workspace/HBase-TRUNK-on-Hadoop-2.0.0/trunk/hbase-server/target/surefire/surefire7580408285336803669tmp /x1/jenkins/jenkins-slave/workspace/HBase-TRUNK-on-Hadoop-2.0.0/trunk/hbase-server/target/surefire/surefire_1335593629515104241741tmp
Running org.apache.hadoop.hbase.replication.TestReplicationSource
Tests run: 1, Failures: 0, Errors: 0, Skipped: 0, Time elapsed: 2.713 sec
Running org.apache.hadoop.hbase.io.encoding.TestLoadAndSwitchEncodeOnDisk
Tests run: 1, Failures: 0, Errors: 0, Skipped: 0, Time elapsed: 19.205 sec
Forking command line: /bin/sh -c cd /x1/jenkins/jenkins-slave/workspace/HBase-TRUNK-on-Hadoop-2.0.0/trunk/hbase-server && /x1/jenkins/tools/java/jdk1.6.0_32-32/jre/bin/java -enableassertions -Xmx1900m -Djava.security.egd=file:/dev/./urandom -jar /x1/jenkins/jenkins-slave/workspace/HBase-TRUNK-on-Hadoop-2.0.0/trunk/hbase-server/target/surefire/surefirebooter1556092296570732476.jar /x1/jenkins/jenkins-slave/workspace/HBase-TRUNK-on-Hadoop-2.0.0/trunk/hbase-server/target/surefire/surefire5868940227330009591tmp /x1/jenkins/jenkins-slave/workspace/HBase-TRUNK-on-Hadoop-2.0.0/trunk/hbase-server/target/surefire/surefire_1341046405748667068046tmp
Forking command line: /bin/sh -c cd /x1/jenkins/jenkins-slave/workspace/HBase-TRUNK-on-Hadoop-2.0.0/trunk/hbase-server && /x1/jenkins/tools/java/jdk1.6.0_32-32/jre/bin/java -enableassertions -Xmx1900m -Djava.security.egd=file:/dev/./urandom -jar /x1/jenkins/jenkins-slave/workspace/HBase-TRUNK-on-Hadoop-2.0.0/trunk/hbase-server/target/surefire/surefirebooter1722879526007698080.jar /x1/jenkins/jenkins-slave/workspace/HBase-TRUNK-on-Hadoop-2.0.0/trunk/hbase-server/target/surefire/surefire7984855726312715057tmp /x1/jenkins/jenkins-slave/workspace/HBase-TRUNK-on-Hadoop-2.0.0/trunk/hbase-server/target/surefire/surefire_1356890544891437606277tmp
Running org.apache.hadoop.hbase.util.TestFSTableDescriptors
Tests run: 11, Failures: 0, Errors: 0, Skipped: 0, Time elapsed: 1.105 sec
Forking command line: /bin/sh -c cd /x1/jenkins/jenkins-slave/workspace/HBase-TRUNK-on-Hadoop-2.0.0/trunk/hbase-server && /x1/jenkins/tools/java/jdk1.6.0_32-32/jre/bin/java -enableassertions -Xmx1900m -Djava.security.egd=file:/dev/./urandom -jar /x1/jenkins/jenkins-slave/workspace/HBase-TRUNK-on-Hadoop-2.0.0/trunk/hbase-server/target/surefire/surefirebooter2474699518526921593.jar /x1/jenkins/jenkins-slave/workspace/HBase-TRUNK-on-Hadoop-2.0.0/trunk/hbase-server/target/surefire/surefire2129729457846713526tmp /x1/jenkins/jenkins-slave/workspace/HBase-TRUNK-on-Hadoop-2.0.0/trunk/hbase-server/target/surefire/surefire_1369157381880605146884tmp
Running org.apache.hadoop.hbase.util.TestIdLock
Tests run: 1, Failures: 0, Errors: 0, Skipped: 0, Time elapsed: 15.243 sec
Forking command line: /bin/sh -c cd /x1/jenkins/jenkins-slave/workspace/HBase-TRUNK-on-Hadoop-2.0.0/trunk/hbase-server && /x1/jenkins/tools/java/jdk1.6.0_32-32/jre/bin/java -enableassertions -Xmx1900m -Djava.security.egd=file:/dev/./urandom -jar /x1/jenkins/jenkins-slave/workspace/HBase-TRUNK-on-Hadoop-2.0.0/trunk/hbase-server/target/surefire/surefirebooter2541685585148320662.jar /x1/jenkins/jenkins-slave/workspace/HBase-TRUNK-on-Hadoop-2.0.0/trunk/hbase-server/target/surefire/surefire7083456721753312275tmp /x1/jenkins/jenkins-slave/workspace/HBase-TRUNK-on-Hadoop-2.0.0/trunk/hbase-server/target/surefire/surefire_1375037851249336053027tmp
Running org.apache.hadoop.hbase.util.TestMergeTable
Tests run: 1, Failures: 0, Errors: 0, Skipped: 0, Time elapsed: 16.446 sec
Forking command line: /bin/sh -c cd /x1/jenkins/jenkins-slave/workspace/HBase-TRUNK-on-Hadoop-2.0.0/trunk/hbase-server && /x1/jenkins/tools/java/jdk1.6.0_32-32/jre/bin/java -enableassertions -Xmx1900m -Djava.security.egd=file:/dev/./urandom -jar /x1/jenkins/jenkins-slave/workspace/HBase-TRUNK-on-Hadoop-2.0.0/trunk/hbase-server/target/surefire/surefirebooter6464102685378569157.jar /x1/jenkins/jenkins-slave/workspace/HBase-TRUNK-on-Hadoop-2.0.0/trunk/hbase-server/target/surefire/surefire6738904637693822961tmp /x1/jenkins/jenkins-slave/workspace/HBase-TRUNK-on-Hadoop-2.0.0/trunk/hbase-server/target/surefire/surefire_1388434127471604575762tmp
Running org.apache.hadoop.hbase.util.TestFSUtils
Tests run: 5, Failures: 0, Errors: 0, Skipped: 0, Time elapsed: 6.63 sec
Forking command line: /bin/sh -c cd /x1/jenkins/jenkins-slave/workspace/HBase-TRUNK-on-Hadoop-2.0.0/trunk/hbase-server && /x1/jenkins/tools/java/jdk1.6.0_32-32/jre/bin/java -enableassertions -Xmx1900m -Djava.security.egd=file:/dev/./urandom -jar /x1/jenkins/jenkins-slave/workspace/HBase-TRUNK-on-Hadoop-2.0.0/trunk/hbase-server/target/surefire/surefirebooter8835708153420279384.jar /x1/jenkins/jenkins-slave/workspace/HBase-TRUNK-on-Hadoop-2.0.0/trunk/hbase-server/target/surefire/surefire3835215401560716804tmp /x1/jenkins/jenkins-slave/workspace/HBase-TRUNK-on-Hadoop-2.0.0/trunk/hbase-server/target/surefire/surefire_1398451930166611133942tmp
Running org.apache.hadoop.hbase.util.TestProcessBasedCluster
Tests run: 1, Failures: 0, Errors: 0, Skipped: 0, Time elapsed: 0.317 sec
Forking command line: /bin/sh -c cd /x1/jenkins/jenkins-slave/workspace/HBase-TRUNK-on-Hadoop-2.0.0/trunk/hbase-server && /x1/jenkins/tools/java/jdk1.6.0_32-32/jre/bin/java -enableassertions -Xmx1900m -Djava.security.egd=file:/dev/./urandom -jar /x1/jenkins/jenkins-slave/workspace/HBase-TRUNK-on-Hadoop-2.0.0/trunk/hbase-server/target/surefire/surefirebooter5045904414950939570.jar /x1/jenkins/jenkins-slave/workspace/HBase-TRUNK-on-Hadoop-2.0.0/trunk/hbase-server/target/surefire/surefire3438876767760104383tmp /x1/jenkins/jenkins-slave/workspace/HBase-TRUNK-on-Hadoop-2.0.0/trunk/hbase-server/target/surefire/surefire_1403948812060572379574tmp
Running org.apache.hadoop.hbase.util.TestRegionSplitter
Tests run: 5, Failures: 0, Errors: 0, Skipped: 0, Time elapsed: 11.393 sec
Forking command line: /bin/sh -c cd /x1/jenkins/jenkins-slave/workspace/HBase-TRUNK-on-Hadoop-2.0.0/trunk/hbase-server && /x1/jenkins/tools/java/jdk1.6.0_32-32/jre/bin/java -enableassertions -Xmx1900m -Djava.security.egd=file:/dev/./urandom -jar /x1/jenkins/jenkins-slave/workspace/HBase-TRUNK-on-Hadoop-2.0.0/trunk/hbase-server/target/surefire/surefirebooter5753977417778518725.jar /x1/jenkins/jenkins-slave/workspace/HBase-TRUNK-on-Hadoop-2.0.0/trunk/hbase-server/target/surefire/surefire6197249176342006818tmp /x1/jenkins/jenkins-slave/workspace/HBase-TRUNK-on-Hadoop-2.0.0/trunk/hbase-server/target/surefire/surefire_1411971031743850729008tmp
Running org.apache.hadoop.hbase.util.TestCoprocessorScanPolicy
Tests run: 2, Failures: 0, Errors: 0, Skipped: 0, Time elapsed: 9.434 sec
Forking command line: /bin/sh -c cd /x1/jenkins/jenkins-slave/workspace/HBase-TRUNK-on-Hadoop-2.0.0/trunk/hbase-server && /x1/jenkins/tools/java/jdk1.6.0_32-32/jre/bin/java -enableassertions -Xmx1900m -Djava.security.egd=file:/dev/./urandom -jar /x1/jenkins/jenkins-slave/workspace/HBase-TRUNK-on-Hadoop-2.0.0/trunk/hbase-server/target/surefire/surefirebooter251059528595500289.jar /x1/jenkins/jenkins-slave/workspace/HBase-TRUNK-on-Hadoop-2.0.0/trunk/hbase-server/target/surefire/surefire1109388892549245594tmp /x1/jenkins/jenkins-slave/workspace/HBase-TRUNK-on-Hadoop-2.0.0/trunk/hbase-server/target/surefire/surefire_1421724709169805367195tmp
Running org.apache.hadoop.hbase.util.hbck.TestOfflineMetaRebuildBase
Tests run: 1, Failures: 0, Errors: 0, Skipped: 0, Time elapsed: 13.062 sec
Forking command line: /bin/sh -c cd /x1/jenkins/jenkins-slave/workspace/HBase-TRUNK-on-Hadoop-2.0.0/trunk/hbase-server && /x1/jenkins/tools/java/jdk1.6.0_32-32/jre/bin/java -enableassertions -Xmx1900m -Djava.security.egd=file:/dev/./urandom -jar /x1/jenkins/jenkins-slave/workspace/HBase-TRUNK-on-Hadoop-2.0.0/trunk/hbase-server/target/surefire/surefirebooter7420517899389703093.jar /x1/jenkins/jenkins-slave/workspace/HBase-TRUNK-on-Hadoop-2.0.0/trunk/hbase-server/target/surefire/surefire5034171952938412845tmp /x1/jenkins/jenkins-slave/workspace/HBase-TRUNK-on-Hadoop-2.0.0/trunk/hbase-server/target/surefire/surefire_1437295825683092222062tmp
Running org.apache.hadoop.hbase.util.hbck.TestOfflineMetaRebuildOverlap
Tests run: 1, Failures: 0, Errors: 0, Skipped: 0, Time elapsed: 12.65 sec
Forking command line: /bin/sh -c cd /x1/jenkins/jenkins-slave/workspace/HBase-TRUNK-on-Hadoop-2.0.0/trunk/hbase-server && /x1/jenkins/tools/java/jdk1.6.0_32-32/jre/bin/java -enableassertions -Xmx1900m -Djava.security.egd=file:/dev/./urandom -jar /x1/jenkins/jenkins-slave/workspace/HBase-TRUNK-on-Hadoop-2.0.0/trunk/hbase-server/target/surefire/surefirebooter4350223891466330703.jar /x1/jenkins/jenkins-slave/workspace/HBase-TRUNK-on-Hadoop-2.0.0/trunk/hbase-server/target/surefire/surefire7736291631703979598tmp /x1/jenkins/jenkins-slave/workspace/HBase-TRUNK-on-Hadoop-2.0.0/trunk/hbase-server/target/surefire/surefire_1442381498199439682429tmp
Running org.apache.hadoop.hbase.util.TestDefaultEnvironmentEdge
Tests run: 1, Failures: 0, Errors: 0, Skipped: 0, Time elapsed: 0.179 sec
Forking command line: /bin/sh -c cd /x1/jenkins/jenkins-slave/workspace/HBase-TRUNK-on-Hadoop-2.0.0/trunk/hbase-server && /x1/jenkins/tools/java/jdk1.6.0_32-32/jre/bin/java -enableassertions -Xmx1900m -Djava.security.egd=file:/dev/./urandom -jar /x1/jenkins/jenkins-slave/workspace/HBase-TRUNK-on-Hadoop-2.0.0/trunk/hbase-server/target/surefire/surefirebooter5136454938001957251.jar /x1/jenkins/jenkins-slave/workspace/HBase-TRUNK-on-Hadoop-2.0.0/trunk/hbase-server/target/surefire/surefire5769824547619558254tmp /x1/jenkins/jenkins-slave/workspace/HBase-TRUNK-on-Hadoop-2.0.0/trunk/hbase-server/target/surefire/surefire_1452921047980450723403tmp
Running org.apache.hadoop.hbase.TestInfoServers
Tests run: 2, Failures: 0, Errors: 0, Skipped: 0, Time elapsed: 7.123 sec
Running org.apache.hadoop.hbase.util.hbck.TestOfflineMetaRebuildHole
Tests run: 1, Failures: 0, Errors: 0, Skipped: 0, Time elapsed: 12.881 sec

Results :

Failed tests:   testSimpleCase(org.apache.hadoop.hbase.mapreduce.TestImportExport)

Tests run: 723, Failures: 1, Errors: 0, Skipped: 2

[INFO]                                                                         
[INFO] ------------------------------------------------------------------------
[INFO] Skipping HBase
[INFO] This project has been banned from the build due to previous failures.
[INFO] ------------------------------------------------------------------------
[INFO] ------------------------------------------------------------------------
[INFO] Reactor Summary:
[INFO] 
[INFO] HBase ............................................. SUCCESS [8.149s]
[INFO] HBase - Common .................................... SUCCESS [18.273s]
[INFO] HBase - Hadoop Compatibility ...................... SUCCESS [0.802s]
[INFO] HBase - Hadoop Two Compatibility .................. SUCCESS [2.752s]
[INFO] HBase - Server .................................... FAILURE [22:50.031s]
[INFO] HBase - Hadoop One Compatibility .................. SKIPPED
[INFO] HBase - Integration Tests ......................... SKIPPED
[INFO] ------------------------------------------------------------------------
[INFO] BUILD FAILURE
[INFO] ------------------------------------------------------------------------
[INFO] Total time: 23:25.379s
[INFO] Finished at: Sat Oct 06 00:11:54 UTC 2012
[INFO] Final Memory: 48M/537M
[INFO] ------------------------------------------------------------------------
[ERROR] Failed to execute goal org.apache.maven.plugins:maven-surefire-plugin:2.12-TRUNK-HBASE-2:test (secondPartTestsExecution) on project hbase-server: There are test failures.
[ERROR] 
[ERROR] Please refer to /x1/jenkins/jenkins-slave/workspace/HBase-TRUNK-on-Hadoop-2.0.0/trunk/hbase-server/target/surefire-reports for the individual test results.
[ERROR] -> [Help 1]
org.apache.maven.lifecycle.LifecycleExecutionException: Failed to execute goal org.apache.maven.plugins:maven-surefire-plugin:2.12-TRUNK-HBASE-2:test (secondPartTestsExecution) on project hbase-server: There are test failures.

Please refer to /x1/jenkins/jenkins-slave/workspace/HBase-TRUNK-on-Hadoop-2.0.0/trunk/hbase-server/target/surefire-reports for the individual test results.
	at org.apache.maven.lifecycle.internal.MojoExecutor.execute(MojoExecutor.java:213)
	at org.apache.maven.lifecycle.internal.MojoExecutor.execute(MojoExecutor.java:153)
	at org.apache.maven.lifecycle.internal.MojoExecutor.execute(MojoExecutor.java:145)
	at org.apache.maven.lifecycle.internal.LifecycleModuleBuilder.buildProject(LifecycleModuleBuilder.java:84)
	at org.apache.maven.lifecycle.internal.LifecycleModuleBuilder.buildProject(LifecycleModuleBuilder.java:59)
	at org.apache.maven.lifecycle.internal.LifecycleStarter.singleThreadedBuild(LifecycleStarter.java:183)
	at org.apache.maven.lifecycle.internal.LifecycleStarter.execute(LifecycleStarter.java:161)
	at org.apache.maven.DefaultMaven.doExecute(DefaultMaven.java:319)
	at org.apache.maven.DefaultMaven.execute(DefaultMaven.java:156)
	at org.apache.maven.cli.MavenCli.execute(MavenCli.java:537)
	at org.apache.maven.cli.MavenCli.doMain(MavenCli.java:196)
	at org.apache.maven.cli.MavenCli.main(MavenCli.java:141)
	at sun.reflect.NativeMethodAccessorImpl.invoke0(Native Method)
	at sun.reflect.NativeMethodAccessorImpl.invoke(NativeMethodAccessorImpl.java:39)
	at sun.reflect.DelegatingMethodAccessorImpl.invoke(DelegatingMethodAccessorImpl.java:25)
	at java.lang.reflect.Method.invoke(Method.java:597)
	at org.codehaus.plexus.classworlds.launcher.Launcher.launchEnhanced(Launcher.java:290)
	at org.codehaus.plexus.classworlds.launcher.Launcher.launch(Launcher.java:230)
	at org.codehaus.plexus.classworlds.launcher.Launcher.mainWithExitCode(Launcher.java:409)
	at org.codehaus.plexus.classworlds.launcher.Launcher.main(Launcher.java:352)
Caused by: org.apache.maven.plugin.MojoFailureException: There are test failures.

Please refer to /x1/jenkins/jenkins-slave/workspace/HBase-TRUNK-on-Hadoop-2.0.0/trunk/hbase-server/target/surefire-reports for the individual test results.
	at org.apache.maven.plugin.surefire.SurefireHelper.reportExecution(SurefireHelper.java:87)
	at org.apache.maven.plugin.surefire.SurefirePlugin.writeSummary(SurefirePlugin.java:651)
	at org.apache.maven.plugin.surefire.SurefirePlugin.handleSummary(SurefirePlugin.java:625)
	at org.apache.maven.plugin.surefire.AbstractSurefireMojo.executeAfterPreconditionsChecked(AbstractSurefireMojo.java:137)
	at org.apache.maven.plugin.surefire.AbstractSurefireMojo.execute(AbstractSurefireMojo.java:98)
	at org.apache.maven.plugin.DefaultBuildPluginManager.executeMojo(DefaultBuildPluginManager.java:101)
	at org.apache.maven.lifecycle.internal.MojoExecutor.execute(MojoExecutor.java:209)
	... 19 more
[ERROR] 
[ERROR] 
[ERROR] For more information about the errors and possible solutions, please read the following articles:
[ERROR] [Help 1] http://cwiki.apache.org/confluence/display/MAVEN/MojoFailureException
[ERROR] 
[ERROR] After correcting the problems, you can resume the build with the command
[ERROR]   mvn <goals> -rf :hbase-server
Build step 'Invoke top-level Maven targets' marked build as failure
Archiving artifacts
Recording test results
Updating HBASE-5582
Updating HBASE-6889

Mime
View raw message