hbase-dev mailing list archives

Site index · List index
Message view « Date » · « Thread »
Top « Date » · « Thread »
From Apache Jenkins Server <jenk...@builds.apache.org>
Subject Build failed in Jenkins: HBase-TRUNK-on-Hadoop-2.0.0 #166
Date Sat, 08 Sep 2012 23:40:09 GMT
See <https://builds.apache.org/job/HBase-TRUNK-on-Hadoop-2.0.0/166/changes>

Changes:

[tedyu] HBASE-6734 Code duplication in LoadIncrementalHFiles (Richard Ding)

[tedyu] HBASE-6630 Port HBASE-6590 to trunk 0.94 : Assign sequence number to bulk loaded files
(Amitanand)

------------------------------------------
[...truncated 12829 lines...]
Tests run: 3, Failures: 0, Errors: 0, Skipped: 0, Time elapsed: 31.211 sec
Forking command line: /bin/sh -c cd <https://builds.apache.org/job/HBase-TRUNK-on-Hadoop-2.0.0/ws/trunk/hbase-server>
&& /home/jenkins/tools/java/jdk1.6.0_27-32/jre/bin/java -enableassertions -Xmx1900m
-Djava.security.egd=file:/dev/./urandom -jar <https://builds.apache.org/job/HBase-TRUNK-on-Hadoop-2.0.0/ws/trunk/hbase-server/target/surefire/surefirebooter3331015334781974495.jar>
<https://builds.apache.org/job/HBase-TRUNK-on-Hadoop-2.0.0/ws/trunk/hbase-server/target/surefire/surefire2273523213197217902tmp>
<https://builds.apache.org/job/HBase-TRUNK-on-Hadoop-2.0.0/ws/trunk/hbase-server/target/surefire/surefire_90695061859081886312tmp>
Running org.apache.hadoop.hbase.coprocessor.TestRowProcessorEndpoint
Tests run: 4, Failures: 0, Errors: 0, Skipped: 0, Time elapsed: 30.35 sec
Forking command line: /bin/sh -c cd <https://builds.apache.org/job/HBase-TRUNK-on-Hadoop-2.0.0/ws/trunk/hbase-server>
&& /home/jenkins/tools/java/jdk1.6.0_27-32/jre/bin/java -enableassertions -Xmx1900m
-Djava.security.egd=file:/dev/./urandom -jar <https://builds.apache.org/job/HBase-TRUNK-on-Hadoop-2.0.0/ws/trunk/hbase-server/target/surefire/surefirebooter9063471695779527183.jar>
<https://builds.apache.org/job/HBase-TRUNK-on-Hadoop-2.0.0/ws/trunk/hbase-server/target/surefire/surefire8848394827676724402tmp>
<https://builds.apache.org/job/HBase-TRUNK-on-Hadoop-2.0.0/ws/trunk/hbase-server/target/surefire/surefire_911713111254989256435tmp>
Running org.apache.hadoop.hbase.coprocessor.TestMasterObserver
Tests run: 3, Failures: 0, Errors: 0, Skipped: 0, Time elapsed: 23.137 sec
Forking command line: /bin/sh -c cd <https://builds.apache.org/job/HBase-TRUNK-on-Hadoop-2.0.0/ws/trunk/hbase-server>
&& /home/jenkins/tools/java/jdk1.6.0_27-32/jre/bin/java -enableassertions -Xmx1900m
-Djava.security.egd=file:/dev/./urandom -jar <https://builds.apache.org/job/HBase-TRUNK-on-Hadoop-2.0.0/ws/trunk/hbase-server/target/surefire/surefirebooter2274582821099468059.jar>
<https://builds.apache.org/job/HBase-TRUNK-on-Hadoop-2.0.0/ws/trunk/hbase-server/target/surefire/surefire4240007666000672873tmp>
<https://builds.apache.org/job/HBase-TRUNK-on-Hadoop-2.0.0/ws/trunk/hbase-server/target/surefire/surefire_928477144883620739552tmp>
Running org.apache.hadoop.hbase.coprocessor.TestCoprocessorEndpoint
Tests run: 2, Failures: 0, Errors: 0, Skipped: 1, Time elapsed: 25.53 sec
Forking command line: /bin/sh -c cd <https://builds.apache.org/job/HBase-TRUNK-on-Hadoop-2.0.0/ws/trunk/hbase-server>
&& /home/jenkins/tools/java/jdk1.6.0_27-32/jre/bin/java -enableassertions -Xmx1900m
-Djava.security.egd=file:/dev/./urandom -jar <https://builds.apache.org/job/HBase-TRUNK-on-Hadoop-2.0.0/ws/trunk/hbase-server/target/surefire/surefirebooter1898318455353121372.jar>
<https://builds.apache.org/job/HBase-TRUNK-on-Hadoop-2.0.0/ws/trunk/hbase-server/target/surefire/surefire4301523501840608743tmp>
<https://builds.apache.org/job/HBase-TRUNK-on-Hadoop-2.0.0/ws/trunk/hbase-server/target/surefire/surefire_934301531781929528701tmp>
Running org.apache.hadoop.hbase.coprocessor.TestClassLoading
Tests run: 7, Failures: 0, Errors: 0, Skipped: 0, Time elapsed: 33.081 sec
Forking command line: /bin/sh -c cd <https://builds.apache.org/job/HBase-TRUNK-on-Hadoop-2.0.0/ws/trunk/hbase-server>
&& /home/jenkins/tools/java/jdk1.6.0_27-32/jre/bin/java -enableassertions -Xmx1900m
-Djava.security.egd=file:/dev/./urandom -jar <https://builds.apache.org/job/HBase-TRUNK-on-Hadoop-2.0.0/ws/trunk/hbase-server/target/surefire/surefirebooter6715471975240833057.jar>
<https://builds.apache.org/job/HBase-TRUNK-on-Hadoop-2.0.0/ws/trunk/hbase-server/target/surefire/surefire8901470132461498804tmp>
<https://builds.apache.org/job/HBase-TRUNK-on-Hadoop-2.0.0/ws/trunk/hbase-server/target/surefire/surefire_947404212419748013975tmp>
Running org.apache.hadoop.hbase.coprocessor.TestMasterCoprocessorExceptionWithRemove
Tests run: 1, Failures: 0, Errors: 0, Skipped: 0, Time elapsed: 11.7 sec
Forking command line: /bin/sh -c cd <https://builds.apache.org/job/HBase-TRUNK-on-Hadoop-2.0.0/ws/trunk/hbase-server>
&& /home/jenkins/tools/java/jdk1.6.0_27-32/jre/bin/java -enableassertions -Xmx1900m
-Djava.security.egd=file:/dev/./urandom -jar <https://builds.apache.org/job/HBase-TRUNK-on-Hadoop-2.0.0/ws/trunk/hbase-server/target/surefire/surefirebooter8628469169787454820.jar>
<https://builds.apache.org/job/HBase-TRUNK-on-Hadoop-2.0.0/ws/trunk/hbase-server/target/surefire/surefire3122511398831365182tmp>
<https://builds.apache.org/job/HBase-TRUNK-on-Hadoop-2.0.0/ws/trunk/hbase-server/target/surefire/surefire_951780537014171519312tmp>
Running org.apache.hadoop.hbase.coprocessor.TestRegionObserverInterface
Tests run: 7, Failures: 0, Errors: 0, Skipped: 0, Time elapsed: 28.549 sec
Forking command line: /bin/sh -c cd <https://builds.apache.org/job/HBase-TRUNK-on-Hadoop-2.0.0/ws/trunk/hbase-server>
&& /home/jenkins/tools/java/jdk1.6.0_27-32/jre/bin/java -enableassertions -Xmx1900m
-Djava.security.egd=file:/dev/./urandom -jar <https://builds.apache.org/job/HBase-TRUNK-on-Hadoop-2.0.0/ws/trunk/hbase-server/target/surefire/surefirebooter435422002839052107.jar>
<https://builds.apache.org/job/HBase-TRUNK-on-Hadoop-2.0.0/ws/trunk/hbase-server/target/surefire/surefire7621250505190009830tmp>
<https://builds.apache.org/job/HBase-TRUNK-on-Hadoop-2.0.0/ws/trunk/hbase-server/target/surefire/surefire_962091432002276622991tmp>
Running org.apache.hadoop.hbase.coprocessor.TestRegionServerCoprocessorExceptionWithRemove
Tests run: 1, Failures: 0, Errors: 0, Skipped: 0, Time elapsed: 12.878 sec
Forking command line: /bin/sh -c cd <https://builds.apache.org/job/HBase-TRUNK-on-Hadoop-2.0.0/ws/trunk/hbase-server>
&& /home/jenkins/tools/java/jdk1.6.0_27-32/jre/bin/java -enableassertions -Xmx1900m
-Djava.security.egd=file:/dev/./urandom -jar <https://builds.apache.org/job/HBase-TRUNK-on-Hadoop-2.0.0/ws/trunk/hbase-server/target/surefire/surefirebooter1118872478322383858.jar>
<https://builds.apache.org/job/HBase-TRUNK-on-Hadoop-2.0.0/ws/trunk/hbase-server/target/surefire/surefire4149209732472645497tmp>
<https://builds.apache.org/job/HBase-TRUNK-on-Hadoop-2.0.0/ws/trunk/hbase-server/target/surefire/surefire_976403245979472257079tmp>
Running org.apache.hadoop.hbase.coprocessor.TestWALObserver
Tests run: 3, Failures: 0, Errors: 0, Skipped: 0, Time elapsed: 11.283 sec
Forking command line: /bin/sh -c cd <https://builds.apache.org/job/HBase-TRUNK-on-Hadoop-2.0.0/ws/trunk/hbase-server>
&& /home/jenkins/tools/java/jdk1.6.0_27-32/jre/bin/java -enableassertions -Xmx1900m
-Djava.security.egd=file:/dev/./urandom -jar <https://builds.apache.org/job/HBase-TRUNK-on-Hadoop-2.0.0/ws/trunk/hbase-server/target/surefire/surefirebooter5928561643467401274.jar>
<https://builds.apache.org/job/HBase-TRUNK-on-Hadoop-2.0.0/ws/trunk/hbase-server/target/surefire/surefire4363173609475477791tmp>
<https://builds.apache.org/job/HBase-TRUNK-on-Hadoop-2.0.0/ws/trunk/hbase-server/target/surefire/surefire_983767552329364406544tmp>
Running org.apache.hadoop.hbase.coprocessor.TestMasterCoprocessorExceptionWithAbort
Tests run: 1, Failures: 0, Errors: 0, Skipped: 0, Time elapsed: 22.721 sec
Forking command line: /bin/sh -c cd <https://builds.apache.org/job/HBase-TRUNK-on-Hadoop-2.0.0/ws/trunk/hbase-server>
&& /home/jenkins/tools/java/jdk1.6.0_27-32/jre/bin/java -enableassertions -Xmx1900m
-Djava.security.egd=file:/dev/./urandom -jar <https://builds.apache.org/job/HBase-TRUNK-on-Hadoop-2.0.0/ws/trunk/hbase-server/target/surefire/surefirebooter1046841579756799210.jar>
<https://builds.apache.org/job/HBase-TRUNK-on-Hadoop-2.0.0/ws/trunk/hbase-server/target/surefire/surefire7431325270927597857tmp>
<https://builds.apache.org/job/HBase-TRUNK-on-Hadoop-2.0.0/ws/trunk/hbase-server/target/surefire/surefire_997035490089308659940tmp>
Running org.apache.hadoop.hbase.coprocessor.example.TestZooKeeperScanPolicyObserver
Tests run: 1, Failures: 0, Errors: 0, Skipped: 0, Time elapsed: 8.939 sec
Forking command line: /bin/sh -c cd <https://builds.apache.org/job/HBase-TRUNK-on-Hadoop-2.0.0/ws/trunk/hbase-server>
&& /home/jenkins/tools/java/jdk1.6.0_27-32/jre/bin/java -enableassertions -Xmx1900m
-Djava.security.egd=file:/dev/./urandom -jar <https://builds.apache.org/job/HBase-TRUNK-on-Hadoop-2.0.0/ws/trunk/hbase-server/target/surefire/surefirebooter5285277900424577116.jar>
<https://builds.apache.org/job/HBase-TRUNK-on-Hadoop-2.0.0/ws/trunk/hbase-server/target/surefire/surefire1413062818811031414tmp>
<https://builds.apache.org/job/HBase-TRUNK-on-Hadoop-2.0.0/ws/trunk/hbase-server/target/surefire/surefire_1006955865600816696422tmp>
Running org.apache.hadoop.hbase.coprocessor.TestRegionServerCoprocessorExceptionWithAbort
Tests run: 1, Failures: 0, Errors: 0, Skipped: 0, Time elapsed: 10.998 sec
Forking command line: /bin/sh -c cd <https://builds.apache.org/job/HBase-TRUNK-on-Hadoop-2.0.0/ws/trunk/hbase-server>
&& /home/jenkins/tools/java/jdk1.6.0_27-32/jre/bin/java -enableassertions -Xmx1900m
-Djava.security.egd=file:/dev/./urandom -jar <https://builds.apache.org/job/HBase-TRUNK-on-Hadoop-2.0.0/ws/trunk/hbase-server/target/surefire/surefirebooter6371729352020917024.jar>
<https://builds.apache.org/job/HBase-TRUNK-on-Hadoop-2.0.0/ws/trunk/hbase-server/target/surefire/surefire286391913283261031tmp>
<https://builds.apache.org/job/HBase-TRUNK-on-Hadoop-2.0.0/ws/trunk/hbase-server/target/surefire/surefire_1011925342445516610735tmp>
Running org.apache.hadoop.hbase.coprocessor.TestRegionObserverBypass
Tests run: 2, Failures: 0, Errors: 0, Skipped: 0, Time elapsed: 9.295 sec
Forking command line: /bin/sh -c cd <https://builds.apache.org/job/HBase-TRUNK-on-Hadoop-2.0.0/ws/trunk/hbase-server>
&& /home/jenkins/tools/java/jdk1.6.0_27-32/jre/bin/java -enableassertions -Xmx1900m
-Djava.security.egd=file:/dev/./urandom -jar <https://builds.apache.org/job/HBase-TRUNK-on-Hadoop-2.0.0/ws/trunk/hbase-server/target/surefire/surefirebooter8221921709673041332.jar>
<https://builds.apache.org/job/HBase-TRUNK-on-Hadoop-2.0.0/ws/trunk/hbase-server/target/surefire/surefire1412900553521502677tmp>
<https://builds.apache.org/job/HBase-TRUNK-on-Hadoop-2.0.0/ws/trunk/hbase-server/target/surefire/surefire_1025156476608013459022tmp>
Running org.apache.hadoop.hbase.thrift2.TestThriftHBaseServiceHandler
Tests run: 12, Failures: 0, Errors: 0, Skipped: 0, Time elapsed: 9.008 sec
Forking command line: /bin/sh -c cd <https://builds.apache.org/job/HBase-TRUNK-on-Hadoop-2.0.0/ws/trunk/hbase-server>
&& /home/jenkins/tools/java/jdk1.6.0_27-32/jre/bin/java -enableassertions -Xmx1900m
-Djava.security.egd=file:/dev/./urandom -jar <https://builds.apache.org/job/HBase-TRUNK-on-Hadoop-2.0.0/ws/trunk/hbase-server/target/surefire/surefirebooter2390911639148351855.jar>
<https://builds.apache.org/job/HBase-TRUNK-on-Hadoop-2.0.0/ws/trunk/hbase-server/target/surefire/surefire1047576459240262611tmp>
<https://builds.apache.org/job/HBase-TRUNK-on-Hadoop-2.0.0/ws/trunk/hbase-server/target/surefire/surefire_1033462211736592759871tmp>
Running org.apache.hadoop.hbase.trace.TestHTraceHooks
Tests run: 1, Failures: 0, Errors: 0, Skipped: 0, Time elapsed: 9.11 sec
Forking command line: /bin/sh -c cd <https://builds.apache.org/job/HBase-TRUNK-on-Hadoop-2.0.0/ws/trunk/hbase-server>
&& /home/jenkins/tools/java/jdk1.6.0_27-32/jre/bin/java -enableassertions -Xmx1900m
-Djava.security.egd=file:/dev/./urandom -jar <https://builds.apache.org/job/HBase-TRUNK-on-Hadoop-2.0.0/ws/trunk/hbase-server/target/surefire/surefirebooter4206246178868647035.jar>
<https://builds.apache.org/job/HBase-TRUNK-on-Hadoop-2.0.0/ws/trunk/hbase-server/target/surefire/surefire3126504930036734475tmp>
<https://builds.apache.org/job/HBase-TRUNK-on-Hadoop-2.0.0/ws/trunk/hbase-server/target/surefire/surefire_104186645034924787980tmp>
Running org.apache.hadoop.hbase.regionserver.TestHRegionOnCluster
Tests run: 1, Failures: 0, Errors: 0, Skipped: 0, Time elapsed: 17.502 sec
Forking command line: /bin/sh -c cd <https://builds.apache.org/job/HBase-TRUNK-on-Hadoop-2.0.0/ws/trunk/hbase-server>
&& /home/jenkins/tools/java/jdk1.6.0_27-32/jre/bin/java -enableassertions -Xmx1900m
-Djava.security.egd=file:/dev/./urandom -jar <https://builds.apache.org/job/HBase-TRUNK-on-Hadoop-2.0.0/ws/trunk/hbase-server/target/surefire/surefirebooter7786035354624355506.jar>
<https://builds.apache.org/job/HBase-TRUNK-on-Hadoop-2.0.0/ws/trunk/hbase-server/target/surefire/surefire2209392266534502539tmp>
<https://builds.apache.org/job/HBase-TRUNK-on-Hadoop-2.0.0/ws/trunk/hbase-server/target/surefire/surefire_1054590941655395435032tmp>
Running org.apache.hadoop.hbase.regionserver.TestMemStore
Tests run: 21, Failures: 0, Errors: 0, Skipped: 0, Time elapsed: 29.816 sec
Forking command line: /bin/sh -c cd <https://builds.apache.org/job/HBase-TRUNK-on-Hadoop-2.0.0/ws/trunk/hbase-server>
&& /home/jenkins/tools/java/jdk1.6.0_27-32/jre/bin/java -enableassertions -Xmx1900m
-Djava.security.egd=file:/dev/./urandom -jar <https://builds.apache.org/job/HBase-TRUNK-on-Hadoop-2.0.0/ws/trunk/hbase-server/target/surefire/surefirebooter4744453369337351738.jar>
<https://builds.apache.org/job/HBase-TRUNK-on-Hadoop-2.0.0/ws/trunk/hbase-server/target/surefire/surefire2197662099646529323tmp>
<https://builds.apache.org/job/HBase-TRUNK-on-Hadoop-2.0.0/ws/trunk/hbase-server/target/surefire/surefire_1061478095693619172686tmp>
Running org.apache.hadoop.hbase.thrift.TestThriftServer
Tests run: 1, Failures: 0, Errors: 0, Skipped: 0, Time elapsed: 73.107 sec
Forking command line: /bin/sh -c cd <https://builds.apache.org/job/HBase-TRUNK-on-Hadoop-2.0.0/ws/trunk/hbase-server>
&& /home/jenkins/tools/java/jdk1.6.0_27-32/jre/bin/java -enableassertions -Xmx1900m
-Djava.security.egd=file:/dev/./urandom -jar <https://builds.apache.org/job/HBase-TRUNK-on-Hadoop-2.0.0/ws/trunk/hbase-server/target/surefire/surefirebooter8154100320097335646.jar>
<https://builds.apache.org/job/HBase-TRUNK-on-Hadoop-2.0.0/ws/trunk/hbase-server/target/surefire/surefire947040280799198566tmp>
<https://builds.apache.org/job/HBase-TRUNK-on-Hadoop-2.0.0/ws/trunk/hbase-server/target/surefire/surefire_1071392619538737060603tmp>
Running org.apache.hadoop.hbase.regionserver.TestMasterAddressManager
Tests run: 1, Failures: 0, Errors: 0, Skipped: 0, Time elapsed: 0.827 sec
Forking command line: /bin/sh -c cd <https://builds.apache.org/job/HBase-TRUNK-on-Hadoop-2.0.0/ws/trunk/hbase-server>
&& /home/jenkins/tools/java/jdk1.6.0_27-32/jre/bin/java -enableassertions -Xmx1900m
-Djava.security.egd=file:/dev/./urandom -jar <https://builds.apache.org/job/HBase-TRUNK-on-Hadoop-2.0.0/ws/trunk/hbase-server/target/surefire/surefirebooter6544015921389583152.jar>
<https://builds.apache.org/job/HBase-TRUNK-on-Hadoop-2.0.0/ws/trunk/hbase-server/target/surefire/surefire1402551245554102490tmp>
<https://builds.apache.org/job/HBase-TRUNK-on-Hadoop-2.0.0/ws/trunk/hbase-server/target/surefire/surefire_1088748630696137772851tmp>
Running org.apache.hadoop.hbase.regionserver.TestHRegion
Tests run: 67, Failures: 0, Errors: 0, Skipped: 0, Time elapsed: 37.052 sec
Forking command line: /bin/sh -c cd <https://builds.apache.org/job/HBase-TRUNK-on-Hadoop-2.0.0/ws/trunk/hbase-server>
&& /home/jenkins/tools/java/jdk1.6.0_27-32/jre/bin/java -enableassertions -Xmx1900m
-Djava.security.egd=file:/dev/./urandom -jar <https://builds.apache.org/job/HBase-TRUNK-on-Hadoop-2.0.0/ws/trunk/hbase-server/target/surefire/surefirebooter751054347640578881.jar>
<https://builds.apache.org/job/HBase-TRUNK-on-Hadoop-2.0.0/ws/trunk/hbase-server/target/surefire/surefire2438432182280843350tmp>
<https://builds.apache.org/job/HBase-TRUNK-on-Hadoop-2.0.0/ws/trunk/hbase-server/target/surefire/surefire_1091193100946371591666tmp>
Running org.apache.hadoop.hbase.regionserver.TestRegionServerMetrics
Tests run: 4, Failures: 0, Errors: 0, Skipped: 0, Time elapsed: 38.047 sec
Forking command line: /bin/sh -c cd <https://builds.apache.org/job/HBase-TRUNK-on-Hadoop-2.0.0/ws/trunk/hbase-server>
&& /home/jenkins/tools/java/jdk1.6.0_27-32/jre/bin/java -enableassertions -Xmx1900m
-Djava.security.egd=file:/dev/./urandom -jar <https://builds.apache.org/job/HBase-TRUNK-on-Hadoop-2.0.0/ws/trunk/hbase-server/target/surefire/surefirebooter8983488517668703458.jar>
<https://builds.apache.org/job/HBase-TRUNK-on-Hadoop-2.0.0/ws/trunk/hbase-server/target/surefire/surefire1644748308999690385tmp>
<https://builds.apache.org/job/HBase-TRUNK-on-Hadoop-2.0.0/ws/trunk/hbase-server/target/surefire/surefire_1103967333988691301014tmp>
Running org.apache.hadoop.hbase.regionserver.TestCompoundBloomFilter
Tests run: 3, Failures: 0, Errors: 0, Skipped: 0, Time elapsed: 25.152 sec
Forking command line: /bin/sh -c cd <https://builds.apache.org/job/HBase-TRUNK-on-Hadoop-2.0.0/ws/trunk/hbase-server>
&& /home/jenkins/tools/java/jdk1.6.0_27-32/jre/bin/java -enableassertions -Xmx1900m
-Djava.security.egd=file:/dev/./urandom -jar <https://builds.apache.org/job/HBase-TRUNK-on-Hadoop-2.0.0/ws/trunk/hbase-server/target/surefire/surefirebooter6613538779378536308.jar>
<https://builds.apache.org/job/HBase-TRUNK-on-Hadoop-2.0.0/ws/trunk/hbase-server/target/surefire/surefire2124381703440776400tmp>
<https://builds.apache.org/job/HBase-TRUNK-on-Hadoop-2.0.0/ws/trunk/hbase-server/target/surefire/surefire_1112777651152064486766tmp>
Running org.apache.hadoop.hbase.regionserver.TestSplitLogWorker
Tests run: 5, Failures: 0, Errors: 0, Skipped: 0, Time elapsed: 2.635 sec
Forking command line: /bin/sh -c cd <https://builds.apache.org/job/HBase-TRUNK-on-Hadoop-2.0.0/ws/trunk/hbase-server>
&& /home/jenkins/tools/java/jdk1.6.0_27-32/jre/bin/java -enableassertions -Xmx1900m
-Djava.security.egd=file:/dev/./urandom -jar <https://builds.apache.org/job/HBase-TRUNK-on-Hadoop-2.0.0/ws/trunk/hbase-server/target/surefire/surefirebooter4536154771879862964.jar>
<https://builds.apache.org/job/HBase-TRUNK-on-Hadoop-2.0.0/ws/trunk/hbase-server/target/surefire/surefire1755579208100083595tmp>
<https://builds.apache.org/job/HBase-TRUNK-on-Hadoop-2.0.0/ws/trunk/hbase-server/target/surefire/surefire_1124350910748055312826tmp>
Running org.apache.hadoop.hbase.regionserver.TestCompactionWithCoprocessor
Tests run: 15, Failures: 0, Errors: 0, Skipped: 0, Time elapsed: 40.972 sec
Forking command line: /bin/sh -c cd <https://builds.apache.org/job/HBase-TRUNK-on-Hadoop-2.0.0/ws/trunk/hbase-server>
&& /home/jenkins/tools/java/jdk1.6.0_27-32/jre/bin/java -enableassertions -Xmx1900m
-Djava.security.egd=file:/dev/./urandom -jar <https://builds.apache.org/job/HBase-TRUNK-on-Hadoop-2.0.0/ws/trunk/hbase-server/target/surefire/surefirebooter8551054725147749374.jar>
<https://builds.apache.org/job/HBase-TRUNK-on-Hadoop-2.0.0/ws/trunk/hbase-server/target/surefire/surefire6303998427066221106tmp>
<https://builds.apache.org/job/HBase-TRUNK-on-Hadoop-2.0.0/ws/trunk/hbase-server/target/surefire/surefire_1134000688129054838278tmp>
Running org.apache.hadoop.hbase.regionserver.TestStoreFileBlockCacheSummary
Tests run: 1, Failures: 0, Errors: 0, Skipped: 0, Time elapsed: 9.995 sec
Forking command line: /bin/sh -c cd <https://builds.apache.org/job/HBase-TRUNK-on-Hadoop-2.0.0/ws/trunk/hbase-server>
&& /home/jenkins/tools/java/jdk1.6.0_27-32/jre/bin/java -enableassertions -Xmx1900m
-Djava.security.egd=file:/dev/./urandom -jar <https://builds.apache.org/job/HBase-TRUNK-on-Hadoop-2.0.0/ws/trunk/hbase-server/target/surefire/surefirebooter5771893300660110740.jar>
<https://builds.apache.org/job/HBase-TRUNK-on-Hadoop-2.0.0/ws/trunk/hbase-server/target/surefire/surefire6343102183720752623tmp>
<https://builds.apache.org/job/HBase-TRUNK-on-Hadoop-2.0.0/ws/trunk/hbase-server/target/surefire/surefire_1142065212238035094191tmp>
Running org.apache.hadoop.hbase.regionserver.TestServerCustomProtocol
Tests run: 7, Failures: 0, Errors: 0, Skipped: 0, Time elapsed: 11.693 sec
Forking command line: /bin/sh -c cd <https://builds.apache.org/job/HBase-TRUNK-on-Hadoop-2.0.0/ws/trunk/hbase-server>
&& /home/jenkins/tools/java/jdk1.6.0_27-32/jre/bin/java -enableassertions -Xmx1900m
-Djava.security.egd=file:/dev/./urandom -jar <https://builds.apache.org/job/HBase-TRUNK-on-Hadoop-2.0.0/ws/trunk/hbase-server/target/surefire/surefirebooter567424748649584003.jar>
<https://builds.apache.org/job/HBase-TRUNK-on-Hadoop-2.0.0/ws/trunk/hbase-server/target/surefire/surefire8212471731083500701tmp>
<https://builds.apache.org/job/HBase-TRUNK-on-Hadoop-2.0.0/ws/trunk/hbase-server/target/surefire/surefire_1158903486897098662015tmp>
Running org.apache.hadoop.hbase.regionserver.TestStore
Tests run: 12, Failures: 0, Errors: 0, Skipped: 0, Time elapsed: 9.914 sec
Forking command line: /bin/sh -c cd <https://builds.apache.org/job/HBase-TRUNK-on-Hadoop-2.0.0/ws/trunk/hbase-server>
&& /home/jenkins/tools/java/jdk1.6.0_27-32/jre/bin/java -enableassertions -Xmx1900m
-Djava.security.egd=file:/dev/./urandom -jar <https://builds.apache.org/job/HBase-TRUNK-on-Hadoop-2.0.0/ws/trunk/hbase-server/target/surefire/surefirebooter4068925399470564839.jar>
<https://builds.apache.org/job/HBase-TRUNK-on-Hadoop-2.0.0/ws/trunk/hbase-server/target/surefire/surefire6974229688953318765tmp>
<https://builds.apache.org/job/HBase-TRUNK-on-Hadoop-2.0.0/ws/trunk/hbase-server/target/surefire/surefire_1165797663851074238493tmp>
Running org.apache.hadoop.hbase.regionserver.TestAtomicOperation
Tests run: 5, Failures: 0, Errors: 0, Skipped: 0, Time elapsed: 20.591 sec
Forking command line: /bin/sh -c cd <https://builds.apache.org/job/HBase-TRUNK-on-Hadoop-2.0.0/ws/trunk/hbase-server>
&& /home/jenkins/tools/java/jdk1.6.0_27-32/jre/bin/java -enableassertions -Xmx1900m
-Djava.security.egd=file:/dev/./urandom -jar <https://builds.apache.org/job/HBase-TRUNK-on-Hadoop-2.0.0/ws/trunk/hbase-server/target/surefire/surefirebooter4375944921851998932.jar>
<https://builds.apache.org/job/HBase-TRUNK-on-Hadoop-2.0.0/ws/trunk/hbase-server/target/surefire/surefire4315373440965184145tmp>
<https://builds.apache.org/job/HBase-TRUNK-on-Hadoop-2.0.0/ws/trunk/hbase-server/target/surefire/surefire_1171262788879207422413tmp>
Running org.apache.hadoop.hbase.regionserver.TestBlocksRead
Tests run: 4, Failures: 0, Errors: 0, Skipped: 0, Time elapsed: 1.466 sec
Forking command line: /bin/sh -c cd <https://builds.apache.org/job/HBase-TRUNK-on-Hadoop-2.0.0/ws/trunk/hbase-server>
&& /home/jenkins/tools/java/jdk1.6.0_27-32/jre/bin/java -enableassertions -Xmx1900m
-Djava.security.egd=file:/dev/./urandom -jar <https://builds.apache.org/job/HBase-TRUNK-on-Hadoop-2.0.0/ws/trunk/hbase-server/target/surefire/surefirebooter5494677345748370560.jar>
<https://builds.apache.org/job/HBase-TRUNK-on-Hadoop-2.0.0/ws/trunk/hbase-server/target/surefire/surefire2913881609500189660tmp>
<https://builds.apache.org/job/HBase-TRUNK-on-Hadoop-2.0.0/ws/trunk/hbase-server/target/surefire/surefire_1182093493019422431897tmp>
Running org.apache.hadoop.hbase.regionserver.TestClusterId
Tests run: 1, Failures: 0, Errors: 0, Skipped: 0, Time elapsed: 20.451 sec
Forking command line: /bin/sh -c cd <https://builds.apache.org/job/HBase-TRUNK-on-Hadoop-2.0.0/ws/trunk/hbase-server>
&& /home/jenkins/tools/java/jdk1.6.0_27-32/jre/bin/java -enableassertions -Xmx1900m
-Djava.security.egd=file:/dev/./urandom -jar <https://builds.apache.org/job/HBase-TRUNK-on-Hadoop-2.0.0/ws/trunk/hbase-server/target/surefire/surefirebooter7831116992484636926.jar>
<https://builds.apache.org/job/HBase-TRUNK-on-Hadoop-2.0.0/ws/trunk/hbase-server/target/surefire/surefire99127884450008222tmp>
<https://builds.apache.org/job/HBase-TRUNK-on-Hadoop-2.0.0/ws/trunk/hbase-server/target/surefire/surefire_1194519876497885753144tmp>
Running org.apache.hadoop.hbase.regionserver.TestSeekOptimizations
Tests run: 6, Failures: 0, Errors: 0, Skipped: 0, Time elapsed: 3.211 sec
Forking command line: /bin/sh -c cd <https://builds.apache.org/job/HBase-TRUNK-on-Hadoop-2.0.0/ws/trunk/hbase-server>
&& /home/jenkins/tools/java/jdk1.6.0_27-32/jre/bin/java -enableassertions -Xmx1900m
-Djava.security.egd=file:/dev/./urandom -jar <https://builds.apache.org/job/HBase-TRUNK-on-Hadoop-2.0.0/ws/trunk/hbase-server/target/surefire/surefirebooter7935363960940660742.jar>
<https://builds.apache.org/job/HBase-TRUNK-on-Hadoop-2.0.0/ws/trunk/hbase-server/target/surefire/surefire2921833611143894892tmp>
<https://builds.apache.org/job/HBase-TRUNK-on-Hadoop-2.0.0/ws/trunk/hbase-server/target/surefire/surefire_1203028506913958542137tmp>
Running org.apache.hadoop.hbase.regionserver.metrics.TestSchemaMetrics
Tests run: 6, Failures: 0, Errors: 0, Skipped: 0, Time elapsed: 15.025 sec
Forking command line: /bin/sh -c cd <https://builds.apache.org/job/HBase-TRUNK-on-Hadoop-2.0.0/ws/trunk/hbase-server>
&& /home/jenkins/tools/java/jdk1.6.0_27-32/jre/bin/java -enableassertions -Xmx1900m
-Djava.security.egd=file:/dev/./urandom -jar <https://builds.apache.org/job/HBase-TRUNK-on-Hadoop-2.0.0/ws/trunk/hbase-server/target/surefire/surefirebooter7030843604138879691.jar>
<https://builds.apache.org/job/HBase-TRUNK-on-Hadoop-2.0.0/ws/trunk/hbase-server/target/surefire/surefire2344591679715630180tmp>
<https://builds.apache.org/job/HBase-TRUNK-on-Hadoop-2.0.0/ws/trunk/hbase-server/target/surefire/surefire_1215900364726106368725tmp>
Running org.apache.hadoop.hbase.regionserver.handler.TestCloseRegionHandler
Tests run: 3, Failures: 0, Errors: 0, Skipped: 0, Time elapsed: 1.587 sec
Forking command line: /bin/sh -c cd <https://builds.apache.org/job/HBase-TRUNK-on-Hadoop-2.0.0/ws/trunk/hbase-server>
&& /home/jenkins/tools/java/jdk1.6.0_27-32/jre/bin/java -enableassertions -Xmx1900m
-Djava.security.egd=file:/dev/./urandom -jar <https://builds.apache.org/job/HBase-TRUNK-on-Hadoop-2.0.0/ws/trunk/hbase-server/target/surefire/surefirebooter6785726743709744198.jar>
<https://builds.apache.org/job/HBase-TRUNK-on-Hadoop-2.0.0/ws/trunk/hbase-server/target/surefire/surefire5164634999993209042tmp>
<https://builds.apache.org/job/HBase-TRUNK-on-Hadoop-2.0.0/ws/trunk/hbase-server/target/surefire/surefire_1222504645871154316775tmp>
Running org.apache.hadoop.hbase.regionserver.TestFSErrorsExposed
Tests run: 3, Failures: 0, Errors: 0, Skipped: 0, Time elapsed: 29.88 sec
Forking command line: /bin/sh -c cd <https://builds.apache.org/job/HBase-TRUNK-on-Hadoop-2.0.0/ws/trunk/hbase-server>
&& /home/jenkins/tools/java/jdk1.6.0_27-32/jre/bin/java -enableassertions -Xmx1900m
-Djava.security.egd=file:/dev/./urandom -jar <https://builds.apache.org/job/HBase-TRUNK-on-Hadoop-2.0.0/ws/trunk/hbase-server/target/surefire/surefirebooter953060803235300819.jar>
<https://builds.apache.org/job/HBase-TRUNK-on-Hadoop-2.0.0/ws/trunk/hbase-server/target/surefire/surefire8223206787638611954tmp>
<https://builds.apache.org/job/HBase-TRUNK-on-Hadoop-2.0.0/ws/trunk/hbase-server/target/surefire/surefire_1234871840980558428819tmp>
Running org.apache.hadoop.hbase.regionserver.handler.TestOpenRegionHandler
Tests run: 3, Failures: 0, Errors: 0, Skipped: 0, Time elapsed: 1.261 sec
Forking command line: /bin/sh -c cd <https://builds.apache.org/job/HBase-TRUNK-on-Hadoop-2.0.0/ws/trunk/hbase-server>
&& /home/jenkins/tools/java/jdk1.6.0_27-32/jre/bin/java -enableassertions -Xmx1900m
-Djava.security.egd=file:/dev/./urandom -jar <https://builds.apache.org/job/HBase-TRUNK-on-Hadoop-2.0.0/ws/trunk/hbase-server/target/surefire/surefirebooter2443635607870193020.jar>
<https://builds.apache.org/job/HBase-TRUNK-on-Hadoop-2.0.0/ws/trunk/hbase-server/target/surefire/surefire1551769569876380333tmp>
<https://builds.apache.org/job/HBase-TRUNK-on-Hadoop-2.0.0/ws/trunk/hbase-server/target/surefire/surefire_124588287344791131456tmp>
Running org.apache.hadoop.hbase.regionserver.TestGetClosestAtOrBefore
Tests run: 3, Failures: 0, Errors: 0, Skipped: 0, Time elapsed: 1.239 sec
Forking command line: /bin/sh -c cd <https://builds.apache.org/job/HBase-TRUNK-on-Hadoop-2.0.0/ws/trunk/hbase-server>
&& /home/jenkins/tools/java/jdk1.6.0_27-32/jre/bin/java -enableassertions -Xmx1900m
-Djava.security.egd=file:/dev/./urandom -jar <https://builds.apache.org/job/HBase-TRUNK-on-Hadoop-2.0.0/ws/trunk/hbase-server/target/surefire/surefirebooter5786828797659588109.jar>
<https://builds.apache.org/job/HBase-TRUNK-on-Hadoop-2.0.0/ws/trunk/hbase-server/target/surefire/surefire6793525191860394931tmp>
<https://builds.apache.org/job/HBase-TRUNK-on-Hadoop-2.0.0/ws/trunk/hbase-server/target/surefire/surefire_1257331192822328914416tmp>
Running org.apache.hadoop.hbase.regionserver.TestCacheOnWriteInSchema
Tests run: 3, Failures: 0, Errors: 0, Skipped: 0, Time elapsed: 2.412 sec
Forking command line: /bin/sh -c cd <https://builds.apache.org/job/HBase-TRUNK-on-Hadoop-2.0.0/ws/trunk/hbase-server>
&& /home/jenkins/tools/java/jdk1.6.0_27-32/jre/bin/java -enableassertions -Xmx1900m
-Djava.security.egd=file:/dev/./urandom -jar <https://builds.apache.org/job/HBase-TRUNK-on-Hadoop-2.0.0/ws/trunk/hbase-server/target/surefire/surefirebooter1508407126604032678.jar>
<https://builds.apache.org/job/HBase-TRUNK-on-Hadoop-2.0.0/ws/trunk/hbase-server/target/surefire/surefire1390723612662433273tmp>
<https://builds.apache.org/job/HBase-TRUNK-on-Hadoop-2.0.0/ws/trunk/hbase-server/target/surefire/surefire_126326919134882493464tmp>
Running org.apache.hadoop.hbase.regionserver.TestPriorityRpc
Tests run: 3, Failures: 0, Errors: 0, Skipped: 0, Time elapsed: 1.366 sec
Running org.apache.hadoop.hbase.regionserver.TestParallelPut
Tests run: 2, Failures: 0, Errors: 0, Skipped: 0, Time elapsed: 5.361 sec
Forking command line: /bin/sh -c cd <https://builds.apache.org/job/HBase-TRUNK-on-Hadoop-2.0.0/ws/trunk/hbase-server>
&& /home/jenkins/tools/java/jdk1.6.0_27-32/jre/bin/java -enableassertions -Xmx1900m
-Djava.security.egd=file:/dev/./urandom -jar <https://builds.apache.org/job/HBase-TRUNK-on-Hadoop-2.0.0/ws/trunk/hbase-server/target/surefire/surefirebooter332776793390517929.jar>
<https://builds.apache.org/job/HBase-TRUNK-on-Hadoop-2.0.0/ws/trunk/hbase-server/target/surefire/surefire5696820891587653973tmp>
<https://builds.apache.org/job/HBase-TRUNK-on-Hadoop-2.0.0/ws/trunk/hbase-server/target/surefire/surefire_1272549402165743162959tmp>
Forking command line: /bin/sh -c cd <https://builds.apache.org/job/HBase-TRUNK-on-Hadoop-2.0.0/ws/trunk/hbase-server>
&& /home/jenkins/tools/java/jdk1.6.0_27-32/jre/bin/java -enableassertions -Xmx1900m
-Djava.security.egd=file:/dev/./urandom -jar <https://builds.apache.org/job/HBase-TRUNK-on-Hadoop-2.0.0/ws/trunk/hbase-server/target/surefire/surefirebooter2249225879160134177.jar>
<https://builds.apache.org/job/HBase-TRUNK-on-Hadoop-2.0.0/ws/trunk/hbase-server/target/surefire/surefire1465182477576866085tmp>
<https://builds.apache.org/job/HBase-TRUNK-on-Hadoop-2.0.0/ws/trunk/hbase-server/target/surefire/surefire_128228871758103780463tmp>
Running org.apache.hadoop.hbase.regionserver.wal.TestLogRollAbort
Tests run: 1, Failures: 0, Errors: 0, Skipped: 0, Time elapsed: 13.627 sec
Forking command line: /bin/sh -c cd <https://builds.apache.org/job/HBase-TRUNK-on-Hadoop-2.0.0/ws/trunk/hbase-server>
&& /home/jenkins/tools/java/jdk1.6.0_27-32/jre/bin/java -enableassertions -Xmx1900m
-Djava.security.egd=file:/dev/./urandom -jar <https://builds.apache.org/job/HBase-TRUNK-on-Hadoop-2.0.0/ws/trunk/hbase-server/target/surefire/surefirebooter1647846584994048351.jar>
<https://builds.apache.org/job/HBase-TRUNK-on-Hadoop-2.0.0/ws/trunk/hbase-server/target/surefire/surefire507115700166426048tmp>
<https://builds.apache.org/job/HBase-TRUNK-on-Hadoop-2.0.0/ws/trunk/hbase-server/target/surefire/surefire_1293181149432754385879tmp>
Running org.apache.hadoop.hbase.regionserver.wal.TestWALReplay
Tests run: 7, Failures: 0, Errors: 0, Skipped: 0, Time elapsed: 30.837 sec
Forking command line: /bin/sh -c cd <https://builds.apache.org/job/HBase-TRUNK-on-Hadoop-2.0.0/ws/trunk/hbase-server>
&& /home/jenkins/tools/java/jdk1.6.0_27-32/jre/bin/java -enableassertions -Xmx1900m
-Djava.security.egd=file:/dev/./urandom -jar <https://builds.apache.org/job/HBase-TRUNK-on-Hadoop-2.0.0/ws/trunk/hbase-server/target/surefire/surefirebooter5466528739450897821.jar>
<https://builds.apache.org/job/HBase-TRUNK-on-Hadoop-2.0.0/ws/trunk/hbase-server/target/surefire/surefire5495570806956611071tmp>
<https://builds.apache.org/job/HBase-TRUNK-on-Hadoop-2.0.0/ws/trunk/hbase-server/target/surefire/surefire_1304015688513734516084tmp>
Running org.apache.hadoop.hbase.regionserver.wal.TestWALReplayCompressed
Tests run: 7, Failures: 0, Errors: 0, Skipped: 0, Time elapsed: 30.477 sec
Forking command line: /bin/sh -c cd <https://builds.apache.org/job/HBase-TRUNK-on-Hadoop-2.0.0/ws/trunk/hbase-server>
&& /home/jenkins/tools/java/jdk1.6.0_27-32/jre/bin/java -enableassertions -Xmx1900m
-Djava.security.egd=file:/dev/./urandom -jar <https://builds.apache.org/job/HBase-TRUNK-on-Hadoop-2.0.0/ws/trunk/hbase-server/target/surefire/surefirebooter4832386575603473381.jar>
<https://builds.apache.org/job/HBase-TRUNK-on-Hadoop-2.0.0/ws/trunk/hbase-server/target/surefire/surefire8466735129315396688tmp>
<https://builds.apache.org/job/HBase-TRUNK-on-Hadoop-2.0.0/ws/trunk/hbase-server/target/surefire/surefire_1316186763243264673287tmp>
Running org.apache.hadoop.hbase.regionserver.TestStoreScanner
Tests run: 16, Failures: 0, Errors: 0, Skipped: 0, Time elapsed: 0.05 sec
Forking command line: /bin/sh -c cd <https://builds.apache.org/job/HBase-TRUNK-on-Hadoop-2.0.0/ws/trunk/hbase-server>
&& /home/jenkins/tools/java/jdk1.6.0_27-32/jre/bin/java -enableassertions -Xmx1900m
-Djava.security.egd=file:/dev/./urandom -jar <https://builds.apache.org/job/HBase-TRUNK-on-Hadoop-2.0.0/ws/trunk/hbase-server/target/surefire/surefirebooter6712081041615876365.jar>
<https://builds.apache.org/job/HBase-TRUNK-on-Hadoop-2.0.0/ws/trunk/hbase-server/target/surefire/surefire3151392760607467700tmp>
<https://builds.apache.org/job/HBase-TRUNK-on-Hadoop-2.0.0/ws/trunk/hbase-server/target/surefire/surefire_1324376371251446477961tmp>
Running org.apache.hadoop.hbase.regionserver.wal.TestHLogFiltering
Tests run: 1, Failures: 0, Errors: 0, Skipped: 0, Time elapsed: 22.244 sec
Forking command line: /bin/sh -c cd <https://builds.apache.org/job/HBase-TRUNK-on-Hadoop-2.0.0/ws/trunk/hbase-server>
&& /home/jenkins/tools/java/jdk1.6.0_27-32/jre/bin/java -enableassertions -Xmx1900m
-Djava.security.egd=file:/dev/./urandom -jar <https://builds.apache.org/job/HBase-TRUNK-on-Hadoop-2.0.0/ws/trunk/hbase-server/target/surefire/surefirebooter2662873812418174051.jar>
<https://builds.apache.org/job/HBase-TRUNK-on-Hadoop-2.0.0/ws/trunk/hbase-server/target/surefire/surefire4879619680446125248tmp>
<https://builds.apache.org/job/HBase-TRUNK-on-Hadoop-2.0.0/ws/trunk/hbase-server/target/surefire/surefire_1337607442770503530299tmp>
Running org.apache.hadoop.hbase.regionserver.TestMXBean
Tests run: 1, Failures: 0, Errors: 0, Skipped: 0, Time elapsed: 7.819 sec
Forking command line: /bin/sh -c cd <https://builds.apache.org/job/HBase-TRUNK-on-Hadoop-2.0.0/ws/trunk/hbase-server>
&& /home/jenkins/tools/java/jdk1.6.0_27-32/jre/bin/java -enableassertions -Xmx1900m
-Djava.security.egd=file:/dev/./urandom -jar <https://builds.apache.org/job/HBase-TRUNK-on-Hadoop-2.0.0/ws/trunk/hbase-server/target/surefire/surefirebooter1039504200145411460.jar>
<https://builds.apache.org/job/HBase-TRUNK-on-Hadoop-2.0.0/ws/trunk/hbase-server/target/surefire/surefire2164015892789838065tmp>
<https://builds.apache.org/job/HBase-TRUNK-on-Hadoop-2.0.0/ws/trunk/hbase-server/target/surefire/surefire_1349120862078514710421tmp>
Running org.apache.hadoop.hbase.regionserver.TestRpcMetrics
Tests run: 1, Failures: 0, Errors: 0, Skipped: 0, Time elapsed: 1.988 sec
Forking command line: /bin/sh -c cd <https://builds.apache.org/job/HBase-TRUNK-on-Hadoop-2.0.0/ws/trunk/hbase-server>
&& /home/jenkins/tools/java/jdk1.6.0_27-32/jre/bin/java -enableassertions -Xmx1900m
-Djava.security.egd=file:/dev/./urandom -jar <https://builds.apache.org/job/HBase-TRUNK-on-Hadoop-2.0.0/ws/trunk/hbase-server/target/surefire/surefirebooter4038256300024408231.jar>
<https://builds.apache.org/job/HBase-TRUNK-on-Hadoop-2.0.0/ws/trunk/hbase-server/target/surefire/surefire2596939330437224727tmp>
<https://builds.apache.org/job/HBase-TRUNK-on-Hadoop-2.0.0/ws/trunk/hbase-server/target/surefire/surefire_1355725365649080139408tmp>
Running org.apache.hadoop.hbase.regionserver.TestCompaction
Tests run: 15, Failures: 0, Errors: 0, Skipped: 0, Time elapsed: 37.634 sec
Forking command line: /bin/sh -c cd <https://builds.apache.org/job/HBase-TRUNK-on-Hadoop-2.0.0/ws/trunk/hbase-server>
&& /home/jenkins/tools/java/jdk1.6.0_27-32/jre/bin/java -enableassertions -Xmx1900m
-Djava.security.egd=file:/dev/./urandom -jar <https://builds.apache.org/job/HBase-TRUNK-on-Hadoop-2.0.0/ws/trunk/hbase-server/target/surefire/surefirebooter928137661442258681.jar>
<https://builds.apache.org/job/HBase-TRUNK-on-Hadoop-2.0.0/ws/trunk/hbase-server/target/surefire/surefire3603765581854795517tmp>
<https://builds.apache.org/job/HBase-TRUNK-on-Hadoop-2.0.0/ws/trunk/hbase-server/target/surefire/surefire_1363558958047621940241tmp>
Running org.apache.hadoop.hbase.regionserver.TestMultiColumnScanner
Tests run: 12, Failures: 0, Errors: 0, Skipped: 0, Time elapsed: 42.749 sec
Forking command line: /bin/sh -c cd <https://builds.apache.org/job/HBase-TRUNK-on-Hadoop-2.0.0/ws/trunk/hbase-server>
&& /home/jenkins/tools/java/jdk1.6.0_27-32/jre/bin/java -enableassertions -Xmx1900m
-Djava.security.egd=file:/dev/./urandom -jar <https://builds.apache.org/job/HBase-TRUNK-on-Hadoop-2.0.0/ws/trunk/hbase-server/target/surefire/surefirebooter9075979376150551043.jar>
<https://builds.apache.org/job/HBase-TRUNK-on-Hadoop-2.0.0/ws/trunk/hbase-server/target/surefire/surefire4024281213222688931tmp>
<https://builds.apache.org/job/HBase-TRUNK-on-Hadoop-2.0.0/ws/trunk/hbase-server/target/surefire/surefire_1372000028988229630724tmp>
Running org.apache.hadoop.hbase.backup.TestHFileArchiving
Tests run: 3, Failures: 0, Errors: 0, Skipped: 0, Time elapsed: 42.326 sec
Forking command line: /bin/sh -c cd <https://builds.apache.org/job/HBase-TRUNK-on-Hadoop-2.0.0/ws/trunk/hbase-server>
&& /home/jenkins/tools/java/jdk1.6.0_27-32/jre/bin/java -enableassertions -Xmx1900m
-Djava.security.egd=file:/dev/./urandom -jar <https://builds.apache.org/job/HBase-TRUNK-on-Hadoop-2.0.0/ws/trunk/hbase-server/target/surefire/surefirebooter4860085215966831041.jar>
<https://builds.apache.org/job/HBase-TRUNK-on-Hadoop-2.0.0/ws/trunk/hbase-server/target/surefire/surefire1685579872141452622tmp>
<https://builds.apache.org/job/HBase-TRUNK-on-Hadoop-2.0.0/ws/trunk/hbase-server/target/surefire/surefire_1385038457954728508895tmp>
Running org.apache.hadoop.hbase.TestClusterBootOrder
Tests run: 2, Failures: 0, Errors: 0, Skipped: 0, Time elapsed: 22.459 sec
Forking command line: /bin/sh -c cd <https://builds.apache.org/job/HBase-TRUNK-on-Hadoop-2.0.0/ws/trunk/hbase-server>
&& /home/jenkins/tools/java/jdk1.6.0_27-32/jre/bin/java -enableassertions -Xmx1900m
-Djava.security.egd=file:/dev/./urandom -jar <https://builds.apache.org/job/HBase-TRUNK-on-Hadoop-2.0.0/ws/trunk/hbase-server/target/surefire/surefirebooter2781079982194433086.jar>
<https://builds.apache.org/job/HBase-TRUNK-on-Hadoop-2.0.0/ws/trunk/hbase-server/target/surefire/surefire8120773436231694158tmp>
<https://builds.apache.org/job/HBase-TRUNK-on-Hadoop-2.0.0/ws/trunk/hbase-server/target/surefire/surefire_1391051164627983984078tmp>
Running org.apache.hadoop.hbase.TestDrainingServer
Tests run: 2, Failures: 0, Errors: 0, Skipped: 0, Time elapsed: 20.124 sec
Forking command line: /bin/sh -c cd <https://builds.apache.org/job/HBase-TRUNK-on-Hadoop-2.0.0/ws/trunk/hbase-server>
&& /home/jenkins/tools/java/jdk1.6.0_27-32/jre/bin/java -enableassertions -Xmx1900m
-Djava.security.egd=file:/dev/./urandom -jar <https://builds.apache.org/job/HBase-TRUNK-on-Hadoop-2.0.0/ws/trunk/hbase-server/target/surefire/surefirebooter7728022742666490243.jar>
<https://builds.apache.org/job/HBase-TRUNK-on-Hadoop-2.0.0/ws/trunk/hbase-server/target/surefire/surefire9019137787170416279tmp>
<https://builds.apache.org/job/HBase-TRUNK-on-Hadoop-2.0.0/ws/trunk/hbase-server/target/surefire/surefire_1401546982390694381391tmp>
Running org.apache.hadoop.hbase.mapreduce.TestRowCounter
Tests run: 3, Failures: 1, Errors: 0, Skipped: 0, Time elapsed: 75.004 sec <<< FAILURE!
Forking command line: /bin/sh -c cd <https://builds.apache.org/job/HBase-TRUNK-on-Hadoop-2.0.0/ws/trunk/hbase-server>
&& /home/jenkins/tools/java/jdk1.6.0_27-32/jre/bin/java -enableassertions -Xmx1900m
-Djava.security.egd=file:/dev/./urandom -jar <https://builds.apache.org/job/HBase-TRUNK-on-Hadoop-2.0.0/ws/trunk/hbase-server/target/surefire/surefirebooter1187302018250362527.jar>
<https://builds.apache.org/job/HBase-TRUNK-on-Hadoop-2.0.0/ws/trunk/hbase-server/target/surefire/surefire3759258350712607244tmp>
<https://builds.apache.org/job/HBase-TRUNK-on-Hadoop-2.0.0/ws/trunk/hbase-server/target/surefire/surefire_1415309905626729174031tmp>
Running org.apache.hadoop.hbase.mapreduce.TestImportExport
Tests run: 3, Failures: 0, Errors: 3, Skipped: 0, Time elapsed: 52.811 sec <<< FAILURE!
Forking command line: /bin/sh -c cd <https://builds.apache.org/job/HBase-TRUNK-on-Hadoop-2.0.0/ws/trunk/hbase-server>
&& /home/jenkins/tools/java/jdk1.6.0_27-32/jre/bin/java -enableassertions -Xmx1900m
-Djava.security.egd=file:/dev/./urandom -jar <https://builds.apache.org/job/HBase-TRUNK-on-Hadoop-2.0.0/ws/trunk/hbase-server/target/surefire/surefirebooter9219417851498359312.jar>
<https://builds.apache.org/job/HBase-TRUNK-on-Hadoop-2.0.0/ws/trunk/hbase-server/target/surefire/surefire7827129294069595387tmp>
<https://builds.apache.org/job/HBase-TRUNK-on-Hadoop-2.0.0/ws/trunk/hbase-server/target/surefire/surefire_142803456899908982877tmp>
Running org.apache.hadoop.hbase.mapreduce.TestHLogRecordReader
Tests run: 2, Failures: 0, Errors: 0, Skipped: 0, Time elapsed: 4.141 sec
Running org.apache.hadoop.hbase.mapreduce.TestImportTsv
Tests run: 13, Failures: 0, Errors: 0, Skipped: 0, Time elapsed: 120.34 sec

Results :

Failed tests:   testRowCounterHiddenColumn(org.apache.hadoop.hbase.mapreduce.TestRowCounter)

Tests in error: 
  testFailover(org.apache.hadoop.hbase.master.TestMasterNoCluster): Metrics source HMaster
already exists!
  testCatalogDeploys(org.apache.hadoop.hbase.master.TestMasterNoCluster): Metrics source HMaster
already exists!
  testSimpleCase(org.apache.hadoop.hbase.mapreduce.TestImportExport)
  testMetaExport(org.apache.hadoop.hbase.mapreduce.TestImportExport)
  testWithDeletes(org.apache.hadoop.hbase.mapreduce.TestImportExport)

Tests run: 708, Failures: 1, Errors: 5, Skipped: 2

[INFO]                                                                         
[INFO] ------------------------------------------------------------------------
[INFO] Skipping HBase
[INFO] This project has been banned from the build due to previous failures.
[INFO] ------------------------------------------------------------------------
[INFO] ------------------------------------------------------------------------
[INFO] Reactor Summary:
[INFO] 
[INFO] HBase ............................................. SUCCESS [5.743s]
[INFO] HBase - Common .................................... SUCCESS [9.238s]
[INFO] HBase - Hadoop Compatibility ...................... SUCCESS [0.593s]
[INFO] HBase - Hadoop Two Compatibility .................. SUCCESS [1.865s]
[INFO] HBase - Server .................................... FAILURE [22:19.046s]
[INFO] HBase - Hadoop One Compatibility .................. SKIPPED
[INFO] HBase - Integration Tests ......................... SKIPPED
[INFO] ------------------------------------------------------------------------
[INFO] BUILD FAILURE
[INFO] ------------------------------------------------------------------------
[INFO] Total time: 22:40.670s
[INFO] Finished at: Sat Sep 08 23:39:51 UTC 2012
[INFO] Final Memory: 57M/864M
[INFO] ------------------------------------------------------------------------
[ERROR] Failed to execute goal org.apache.maven.plugins:maven-surefire-plugin:2.12-TRUNK-HBASE-2:test
(secondPartTestsExecution) on project hbase-server: There are test failures.
[ERROR] 
[ERROR] Please refer to <https://builds.apache.org/job/HBase-TRUNK-on-Hadoop-2.0.0/ws/trunk/hbase-server/target/surefire-reports>
for the individual test results.
[ERROR] -> [Help 1]
org.apache.maven.lifecycle.LifecycleExecutionException: Failed to execute goal org.apache.maven.plugins:maven-surefire-plugin:2.12-TRUNK-HBASE-2:test
(secondPartTestsExecution) on project hbase-server: There are test failures.

Please refer to <https://builds.apache.org/job/HBase-TRUNK-on-Hadoop-2.0.0/ws/trunk/hbase-server/target/surefire-reports>
for the individual test results.
	at org.apache.maven.lifecycle.internal.MojoExecutor.execute(MojoExecutor.java:213)
	at org.apache.maven.lifecycle.internal.MojoExecutor.execute(MojoExecutor.java:153)
	at org.apache.maven.lifecycle.internal.MojoExecutor.execute(MojoExecutor.java:145)
	at org.apache.maven.lifecycle.internal.LifecycleModuleBuilder.buildProject(LifecycleModuleBuilder.java:84)
	at org.apache.maven.lifecycle.internal.LifecycleModuleBuilder.buildProject(LifecycleModuleBuilder.java:59)
	at org.apache.maven.lifecycle.internal.LifecycleStarter.singleThreadedBuild(LifecycleStarter.java:183)
	at org.apache.maven.lifecycle.internal.LifecycleStarter.execute(LifecycleStarter.java:161)
	at org.apache.maven.DefaultMaven.doExecute(DefaultMaven.java:319)
	at org.apache.maven.DefaultMaven.execute(DefaultMaven.java:156)
	at org.apache.maven.cli.MavenCli.execute(MavenCli.java:537)
	at org.apache.maven.cli.MavenCli.doMain(MavenCli.java:196)
	at org.apache.maven.cli.MavenCli.main(MavenCli.java:141)
	at sun.reflect.NativeMethodAccessorImpl.invoke0(Native Method)
	at sun.reflect.NativeMethodAccessorImpl.invoke(NativeMethodAccessorImpl.java:39)
	at sun.reflect.DelegatingMethodAccessorImpl.invoke(DelegatingMethodAccessorImpl.java:25)
	at java.lang.reflect.Method.invoke(Method.java:597)
	at org.codehaus.plexus.classworlds.launcher.Launcher.launchEnhanced(Launcher.java:290)
	at org.codehaus.plexus.classworlds.launcher.Launcher.launch(Launcher.java:230)
	at org.codehaus.plexus.classworlds.launcher.Launcher.mainWithExitCode(Launcher.java:409)
	at org.codehaus.plexus.classworlds.launcher.Launcher.main(Launcher.java:352)
Caused by: org.apache.maven.plugin.MojoFailureException: There are test failures.

Please refer to <https://builds.apache.org/job/HBase-TRUNK-on-Hadoop-2.0.0/ws/trunk/hbase-server/target/surefire-reports>
for the individual test results.
	at org.apache.maven.plugin.surefire.SurefireHelper.reportExecution(SurefireHelper.java:87)
	at org.apache.maven.plugin.surefire.SurefirePlugin.writeSummary(SurefirePlugin.java:651)
	at org.apache.maven.plugin.surefire.SurefirePlugin.handleSummary(SurefirePlugin.java:625)
	at org.apache.maven.plugin.surefire.AbstractSurefireMojo.executeAfterPreconditionsChecked(AbstractSurefireMojo.java:137)
	at org.apache.maven.plugin.surefire.AbstractSurefireMojo.execute(AbstractSurefireMojo.java:98)
	at org.apache.maven.plugin.DefaultBuildPluginManager.executeMojo(DefaultBuildPluginManager.java:101)
	at org.apache.maven.lifecycle.internal.MojoExecutor.execute(MojoExecutor.java:209)
	... 19 more
[ERROR] 
[ERROR] 
[ERROR] For more information about the errors and possible solutions, please read the following
articles:
[ERROR] [Help 1] http://cwiki.apache.org/confluence/display/MAVEN/MojoFailureException
[ERROR] 
[ERROR] After correcting the problems, you can resume the build with the command
[ERROR]   mvn <goals> -rf :hbase-server
Build step 'Invoke top-level Maven targets' marked build as failure
Archiving artifacts
Recording test results
Updating HBASE-6734
Updating HBASE-6590
Updating HBASE-6630

Mime
View raw message