hbase-dev mailing list archives

Site index · List index
Message view « Date » · « Thread »
Top « Date » · « Thread »
From Apache Jenkins Server <jenk...@builds.apache.org>
Subject Build failed in Jenkins: HBase-TRUNK #3393
Date Sat, 29 Sep 2012 04:07:28 GMT
See <https://builds.apache.org/job/HBase-TRUNK/3393/changes>

Changes:

[stack] HBASE-6871 HFileBlockIndex Write Error in HFile V2 due to incorrect split into intermediate
index blocks

------------------------------------------
[...truncated 1830 lines...]
A         hbase-hadoop-compat
A         hbase-hadoop-compat/src
A         hbase-hadoop-compat/src/test
A         hbase-hadoop-compat/src/test/java
A         hbase-hadoop-compat/src/test/java/org
A         hbase-hadoop-compat/src/test/java/org/apache
A         hbase-hadoop-compat/src/test/java/org/apache/hadoop
A         hbase-hadoop-compat/src/test/java/org/apache/hadoop/hbase
A         hbase-hadoop-compat/src/test/java/org/apache/hadoop/hbase/test
A         hbase-hadoop-compat/src/test/java/org/apache/hadoop/hbase/test/MetricsAssertHelper.java
A         hbase-hadoop-compat/src/test/java/org/apache/hadoop/hbase/thrift
A         hbase-hadoop-compat/src/test/java/org/apache/hadoop/hbase/thrift/metrics
A         hbase-hadoop-compat/src/test/java/org/apache/hadoop/hbase/thrift/metrics/TestThriftServerMetricsSourceFactory.java
A         hbase-hadoop-compat/src/test/java/org/apache/hadoop/hbase/replication
A         hbase-hadoop-compat/src/test/java/org/apache/hadoop/hbase/replication/regionserver
A         hbase-hadoop-compat/src/test/java/org/apache/hadoop/hbase/replication/regionserver/metrics
A         hbase-hadoop-compat/src/test/java/org/apache/hadoop/hbase/replication/regionserver/metrics/TestReplicationMetricsSourceFactory.java
A         hbase-hadoop-compat/src/test/java/org/apache/hadoop/hbase/master
A         hbase-hadoop-compat/src/test/java/org/apache/hadoop/hbase/master/metrics
A         hbase-hadoop-compat/src/test/java/org/apache/hadoop/hbase/master/metrics/TestMasterMetricsSourceFactory.java
A         hbase-hadoop-compat/src/test/java/org/apache/hadoop/hbase/rest
A         hbase-hadoop-compat/src/test/java/org/apache/hadoop/hbase/rest/metrics
A         hbase-hadoop-compat/src/test/java/org/apache/hadoop/hbase/rest/metrics/TestRESTMetricsSource.java
A         hbase-hadoop-compat/src/test/java/org/apache/hadoop/hbase/HadoopShims.java
A         hbase-hadoop-compat/src/main
A         hbase-hadoop-compat/src/main/java
A         hbase-hadoop-compat/src/main/java/org
A         hbase-hadoop-compat/src/main/java/org/apache
A         hbase-hadoop-compat/src/main/java/org/apache/hadoop
A         hbase-hadoop-compat/src/main/java/org/apache/hadoop/hbase
A         hbase-hadoop-compat/src/main/java/org/apache/hadoop/hbase/thrift
A         hbase-hadoop-compat/src/main/java/org/apache/hadoop/hbase/thrift/metrics
A         hbase-hadoop-compat/src/main/java/org/apache/hadoop/hbase/thrift/metrics/ThriftServerMetricsSource.java
A         hbase-hadoop-compat/src/main/java/org/apache/hadoop/hbase/thrift/metrics/ThriftServerMetricsSourceFactory.java
A         hbase-hadoop-compat/src/main/java/org/apache/hadoop/hbase/CompatibilityFactory.java
A         hbase-hadoop-compat/src/main/java/org/apache/hadoop/hbase/CompatibilitySingletonFactory.java
A         hbase-hadoop-compat/src/main/java/org/apache/hadoop/hbase/metrics
A         hbase-hadoop-compat/src/main/java/org/apache/hadoop/hbase/metrics/BaseMetricsSource.java
A         hbase-hadoop-compat/src/main/java/org/apache/hadoop/hbase/metrics/MBeanSource.java
A         hbase-hadoop-compat/src/main/java/org/apache/hadoop/hbase/replication
A         hbase-hadoop-compat/src/main/java/org/apache/hadoop/hbase/replication/regionserver
A         hbase-hadoop-compat/src/main/java/org/apache/hadoop/hbase/replication/regionserver/metrics
A         hbase-hadoop-compat/src/main/java/org/apache/hadoop/hbase/replication/regionserver/metrics/ReplicationMetricsSource.java
A         hbase-hadoop-compat/src/main/java/org/apache/hadoop/hbase/master
A         hbase-hadoop-compat/src/main/java/org/apache/hadoop/hbase/master/metrics
A         hbase-hadoop-compat/src/main/java/org/apache/hadoop/hbase/master/metrics/MasterMetricsSource.java
A         hbase-hadoop-compat/src/main/java/org/apache/hadoop/hbase/master/metrics/MasterMetricsWrapper.java
A         hbase-hadoop-compat/src/main/java/org/apache/hadoop/hbase/master/metrics/MasterMetricsSourceFactory.java
A         hbase-hadoop-compat/src/main/java/org/apache/hadoop/hbase/rest
A         hbase-hadoop-compat/src/main/java/org/apache/hadoop/hbase/rest/metrics
A         hbase-hadoop-compat/src/main/java/org/apache/hadoop/hbase/rest/metrics/RESTMetricsSource.java
A         hbase-hadoop-compat/src/main/java/org/apache/hadoop/metrics
A         hbase-hadoop-compat/src/main/java/org/apache/hadoop/metrics/MetricHistogram.java
A         hbase-hadoop-compat/src/main/java/org/apache/hadoop/metrics/MetricsExecutor.java
A         hbase-hadoop-compat/pom.xml
A         README.txt
A         examples
A         examples/thrift
A         examples/thrift/DemoClient.java
A         examples/thrift/DemoClient.cpp
A         examples/thrift/DemoClient.rb
A         examples/thrift/DemoClient.php
A         examples/thrift/DemoClient.py
A         examples/thrift/README.txt
A         examples/thrift/DemoClient.pl
A         examples/thrift/Makefile
A         examples/thrift2
A         examples/thrift2/DemoClient.java
A         examples/thrift2/DemoClient.py
A         examples/mapreduce
A         examples/mapreduce/org
A         examples/mapreduce/org/apache
A         examples/mapreduce/org/apache/hadoop
A         examples/mapreduce/org/apache/hadoop/hbase
A         examples/mapreduce/org/apache/hadoop/hbase/mapreduce
A         examples/mapreduce/org/apache/hadoop/hbase/mapreduce/SampleUploader.java
A         examples/mapreduce/org/apache/hadoop/hbase/mapreduce/IndexBuilder.java
A         examples/mapreduce/index-builder-setup.rb
A         examples/README.txt
 U        .
At revision 1391749
[HBase-TRUNK] $ /bin/bash -xe /tmp/hudson4331209016471789915.sh
+ ulimit -a
core file size          (blocks, -c) 0
data seg size           (kbytes, -d) unlimited
scheduling priority             (-e) 0
file size               (blocks, -f) unlimited
pending signals                 (-i) 193125
max locked memory       (kbytes, -l) 64
max memory size         (kbytes, -m) unlimited
open files                      (-n) 40000
pipe size            (512 bytes, -p) 8
POSIX message queues     (bytes, -q) 819200
real-time priority              (-r) 0
stack size              (kbytes, -s) 10240
cpu time               (seconds, -t) unlimited
max user processes              (-u) 193125
virtual memory          (kbytes, -v) unlimited
file locks                      (-x) unlimited
+ java -version
java version "1.6.0_32"
Java(TM) SE Runtime Environment (build 1.6.0_32-b05)
Java HotSpot(TM) Server VM (build 20.7-b02, mixed mode)
[trunk] $ /home/hudson/tools/maven/latest3/bin/mvn -PrunAllTests -Dmaven.test.redirectTestOutputToFile=true
package assembly:assembly site -Prelease
[INFO] Scanning for projects...
[INFO] ------------------------------------------------------------------------
[INFO] Reactor Build Order:
[INFO] 
[INFO] HBase
[INFO] HBase - Common
[INFO] HBase - Hadoop Compatibility
[INFO] HBase - Hadoop One Compatibility
[INFO] HBase - Server
[INFO] HBase - Hadoop Two Compatibility
[INFO] HBase - Integration Tests
[INFO]                                                                         
[INFO] ------------------------------------------------------------------------
[INFO] Building HBase 0.95-SNAPSHOT
[INFO] ------------------------------------------------------------------------
[INFO] 
[INFO] --- maven-remote-resources-plugin:1.1:process (default) @ hbase ---
[INFO] Setting property: classpath.resource.loader.class => 'org.codehaus.plexus.velocity.ContextClassLoaderResourceLoader'.
[INFO] Setting property: velocimacro.messages.on => 'false'.
[INFO] Setting property: resource.loader => 'classpath'.
[INFO] Setting property: resource.manager.logwhenfound => 'false'.
[INFO] 
[INFO] --- findbugs-maven-plugin:2.4.0:findbugs (default) @ hbase ---
[INFO] 
[INFO] --- apache-rat-plugin:0.8:check (default) @ hbase ---
[INFO] Exclude: **/*.log
[INFO] Exclude: **/.*
[INFO] Exclude: **/*.tgz
[INFO] Exclude: **/*.orig
[INFO] Exclude: **/test/**
[INFO] Exclude: **/8e8ab58dcf39412da19833fcd8f687ac
[INFO] Exclude: **/.git/**
[INFO] Exclude: **/.idea/**
[INFO] Exclude: **/target/**
[INFO] Exclude: **/CHANGES.txt
[INFO] Exclude: **/generated/**
[INFO] Exclude: **/conf/*
[INFO] Exclude: **/*.avpr
[INFO] Exclude: **/*.svg
[INFO] Exclude: **/META-INF/services/**
[INFO] Exclude: **/html5shiv.js
[INFO] Exclude: **/jquery.min.js
[INFO] Exclude: **/*.vm
[INFO] Exclude: **/control
[INFO] Exclude: **/conffile
[INFO] Exclude: docs/*
[INFO] Exclude: **/src/site/resources/css/freebsd_docbook.css
[INFO]                                                                         
[INFO] ------------------------------------------------------------------------
[INFO] Building HBase - Common 0.95-SNAPSHOT
[INFO] ------------------------------------------------------------------------
[INFO] 
[INFO] --- maven-remote-resources-plugin:1.1:process (default) @ hbase-common ---
[INFO] 
[INFO] --- maven-resources-plugin:2.5:resources (default-resources) @ hbase-common ---
[debug] execute contextualize
[INFO] Using 'UTF-8' encoding to copy filtered resources.
[INFO] skip non existing resourceDirectory /x1/jenkins/jenkins-slave/workspace/HBase-TRUNK/trunk/hbase-common/src/main/resources
[INFO] Copying 3 resources
[INFO] 
[INFO] --- maven-compiler-plugin:2.5.1:compile (default-compile) @ hbase-common ---
[INFO] Compiling 23 source files to /x1/jenkins/jenkins-slave/workspace/HBase-TRUNK/trunk/hbase-common/target/classes
[WARNING] /x1/jenkins/jenkins-slave/workspace/HBase-TRUNK/trunk/hbase-common/src/main/java/org/apache/hadoop/hbase/util/Bytes.java:[44,15]
sun.misc.Unsafe is Sun proprietary API and may be removed in a future release
[WARNING] /x1/jenkins/jenkins-slave/workspace/HBase-TRUNK/trunk/hbase-common/src/main/java/org/apache/hadoop/hbase/util/Bytes.java:[1033,19]
sun.misc.Unsafe is Sun proprietary API and may be removed in a future release
[WARNING] /x1/jenkins/jenkins-slave/workspace/HBase-TRUNK/trunk/hbase-common/src/main/java/org/apache/hadoop/hbase/util/Bytes.java:[1039,21]
sun.misc.Unsafe is Sun proprietary API and may be removed in a future release
[WARNING] /x1/jenkins/jenkins-slave/workspace/HBase-TRUNK/trunk/hbase-common/src/main/java/org/apache/hadoop/hbase/util/Bytes.java:[1044,28]
sun.misc.Unsafe is Sun proprietary API and may be removed in a future release
[INFO] 
[INFO] --- maven-resources-plugin:2.5:testResources (default-testResources) @ hbase-common
---
[debug] execute contextualize
[INFO] Using 'UTF-8' encoding to copy filtered resources.
[INFO] skip non existing resourceDirectory /x1/jenkins/jenkins-slave/workspace/HBase-TRUNK/trunk/hbase-common/src/test/resources
[INFO] Copying 3 resources
[INFO] 
[INFO] --- maven-compiler-plugin:2.5.1:testCompile (default-testCompile) @ hbase-common ---
[INFO] Compiling 12 source files to /x1/jenkins/jenkins-slave/workspace/HBase-TRUNK/trunk/hbase-common/target/test-classes
[INFO] 
[INFO] --- maven-surefire-plugin:2.12-TRUNK-HBASE-2:test (default-test) @ hbase-common ---
[INFO] Surefire report directory: /x1/jenkins/jenkins-slave/workspace/HBase-TRUNK/trunk/hbase-common/target/surefire-reports
[INFO] Using configured provider org.apache.maven.surefire.junitcore.JUnitCoreProvider

-------------------------------------------------------
 T E S T S
-------------------------------------------------------
Running org.apache.hadoop.hbase.TestKeyValue
Tests run: 16, Failures: 0, Errors: 0, Skipped: 0, Time elapsed: 0.05 sec
Running org.apache.hadoop.hbase.util.TestBytes
Tests run: 15, Failures: 0, Errors: 0, Skipped: 0, Time elapsed: 0.014 sec
Running org.apache.hadoop.hbase.util.TestEnvironmentEdgeManager
Tests run: 2, Failures: 0, Errors: 0, Skipped: 0, Time elapsed: 0.384 sec
Running org.apache.hadoop.hbase.util.TestLoadTestKVGenerator
Tests run: 3, Failures: 0, Errors: 0, Skipped: 0, Time elapsed: 6.997 sec
Running org.apache.hadoop.hbase.util.TestThreads
Tests run: 1, Failures: 0, Errors: 1, Skipped: 0, Time elapsed: 6.997 sec <<< FAILURE!

Results :

Tests in error: 
  testSleepWithoutInterrupt(org.apache.hadoop.hbase.util.TestThreads): test timed out after
6000 milliseconds

Tests run: 37, Failures: 0, Errors: 1, Skipped: 0

[INFO]                                                                         
[INFO] ------------------------------------------------------------------------
[INFO] Skipping HBase
[INFO] This project has been banned from the build due to previous failures.
[INFO] ------------------------------------------------------------------------
[INFO]                                                                         
[INFO] ------------------------------------------------------------------------
[INFO] Skipping HBase
[INFO] This project has been banned from the build due to previous failures.
[INFO] ------------------------------------------------------------------------
[INFO] ------------------------------------------------------------------------
[INFO] Reactor Summary:
[INFO] 
[INFO] HBase ............................................. SUCCESS [4.585s]
[INFO] HBase - Common .................................... FAILURE [11.334s]
[INFO] HBase - Hadoop Compatibility ...................... SKIPPED
[INFO] HBase - Hadoop One Compatibility .................. SKIPPED
[INFO] HBase - Server .................................... SKIPPED
[INFO] HBase - Hadoop Two Compatibility .................. SKIPPED
[INFO] HBase - Integration Tests ......................... SKIPPED
[INFO] ------------------------------------------------------------------------
[INFO] BUILD FAILURE
[INFO] ------------------------------------------------------------------------
[INFO] Total time: 16.446s
[INFO] Finished at: Sat Sep 29 04:07:27 UTC 2012
[INFO] Final Memory: 23M/128M
[INFO] ------------------------------------------------------------------------
[ERROR] Failed to execute goal org.apache.maven.plugins:maven-surefire-plugin:2.12-TRUNK-HBASE-2:test
(default-test) on project hbase-common: There are test failures.
[ERROR] 
[ERROR] Please refer to /x1/jenkins/jenkins-slave/workspace/HBase-TRUNK/trunk/hbase-common/target/surefire-reports
for the individual test results.
[ERROR] -> [Help 1]
[ERROR] 
[ERROR] To see the full stack trace of the errors, re-run Maven with the -e switch.
[ERROR] Re-run Maven using the -X switch to enable full debug logging.
[ERROR] 
[ERROR] For more information about the errors and possible solutions, please read the following
articles:
[ERROR] [Help 1] http://cwiki.apache.org/confluence/display/MAVEN/MojoFailureException
[ERROR] 
[ERROR] After correcting the problems, you can resume the build with the command
[ERROR]   mvn <goals> -rf :hbase-common
Build step 'Invoke top-level Maven targets' marked build as failure
Archiving artifacts
Recording test results
Updating HBASE-6871

Mime
View raw message