hbase-dev mailing list archives

Site index · List index
Message view « Date » · « Thread »
Top « Date » · « Thread »
From Apache Jenkins Server <jenk...@builds.apache.org>
Subject Build failed in Jenkins: HBase-TRUNK #3338
Date Sun, 16 Sep 2012 04:12:44 GMT
See <https://builds.apache.org/job/HBase-TRUNK/3338/changes>

Changes:

[tedyu] HBASE-6438 RegionAlreadyInTransitionException needs to give more info to avoid assignment
inconsistencies (Rajesh)

------------------------------------------
[...truncated 2721 lines...]
Tests run: 15, Failures: 0, Errors: 0, Skipped: 0, Time elapsed: 78.734 sec
Running org.apache.hadoop.hbase.regionserver.handler.TestOpenRegionHandler
Tests run: 3, Failures: 0, Errors: 0, Skipped: 0, Time elapsed: 5.79 sec
Running org.apache.hadoop.hbase.regionserver.handler.TestCloseRegionHandler
Tests run: 3, Failures: 0, Errors: 0, Skipped: 0, Time elapsed: 2.448 sec
Running org.apache.hadoop.hbase.regionserver.TestParallelPut
Tests run: 2, Failures: 0, Errors: 0, Skipped: 0, Time elapsed: 6.357 sec
Running org.apache.hadoop.hbase.mapred.TestTableMapReduce
Tests run: 1, Failures: 0, Errors: 0, Skipped: 0, Time elapsed: 405.189 sec
Running org.apache.hadoop.hbase.regionserver.TestServerCustomProtocol
Tests run: 7, Failures: 0, Errors: 0, Skipped: 0, Time elapsed: 34.749 sec
Running org.apache.hadoop.hbase.regionserver.TestSplitTransactionOnCluster
Tests run: 7, Failures: 0, Errors: 0, Skipped: 0, Time elapsed: 157.495 sec
Running org.apache.hadoop.hbase.regionserver.TestHRegionOnCluster
Tests run: 1, Failures: 0, Errors: 0, Skipped: 0, Time elapsed: 48.141 sec
Running org.apache.hadoop.hbase.regionserver.TestBlocksRead
Tests run: 4, Failures: 0, Errors: 0, Skipped: 0, Time elapsed: 1.344 sec
Running org.apache.hadoop.hbase.regionserver.TestMasterAddressManager
Tests run: 1, Failures: 0, Errors: 0, Skipped: 0, Time elapsed: 1.727 sec
Running org.apache.hadoop.hbase.regionserver.TestAtomicOperation
Tests run: 5, Failures: 0, Errors: 0, Skipped: 0, Time elapsed: 16.743 sec
Running org.apache.hadoop.hbase.regionserver.TestRegionServerMetrics
Tests run: 4, Failures: 0, Errors: 0, Skipped: 0, Time elapsed: 413.346 sec
Running org.apache.hadoop.hbase.regionserver.TestRSKilledWhenMasterInitializing
Tests run: 1, Failures: 0, Errors: 0, Skipped: 0, Time elapsed: 81.029 sec
Running org.apache.hadoop.hbase.regionserver.wal.TestHLogFiltering
Tests run: 1, Failures: 0, Errors: 0, Skipped: 0, Time elapsed: 59.474 sec
Running org.apache.hadoop.hbase.regionserver.wal.TestWALReplayCompressed
Tests run: 7, Failures: 0, Errors: 0, Skipped: 0, Time elapsed: 91.321 sec
Running org.apache.hadoop.hbase.regionserver.wal.TestHLog
Tests run: 11, Failures: 0, Errors: 0, Skipped: 0, Time elapsed: 94.958 sec
Running org.apache.hadoop.hbase.regionserver.wal.TestWALReplay
Tests run: 7, Failures: 0, Errors: 0, Skipped: 0, Time elapsed: 99.043 sec
Running org.apache.hadoop.hbase.regionserver.wal.TestLogRolling
Tests run: 2, Failures: 0, Errors: 0, Skipped: 0, Time elapsed: 149.813 sec
Running org.apache.hadoop.hbase.regionserver.TestRpcMetrics
Tests run: 1, Failures: 0, Errors: 0, Skipped: 0, Time elapsed: 2.058 sec
Running org.apache.hadoop.hbase.regionserver.TestGetClosestAtOrBefore
Tests run: 3, Failures: 0, Errors: 0, Skipped: 0, Time elapsed: 1.182 sec
Running org.apache.hadoop.hbase.regionserver.TestStoreScanner
Tests run: 16, Failures: 0, Errors: 0, Skipped: 0, Time elapsed: 0.066 sec
Running org.apache.hadoop.hbase.regionserver.TestMXBean
Tests run: 1, Failures: 0, Errors: 0, Skipped: 0, Time elapsed: 22.316 sec
Running org.apache.hadoop.hbase.regionserver.TestCacheOnWriteInSchema
Tests run: 3, Failures: 0, Errors: 0, Skipped: 0, Time elapsed: 2.716 sec
Running org.apache.hadoop.hbase.regionserver.TestSeekOptimizations
Tests run: 6, Failures: 0, Errors: 0, Skipped: 0, Time elapsed: 3.395 sec
Running org.apache.hadoop.hbase.regionserver.metrics.TestSchemaMetrics
Tests run: 6, Failures: 0, Errors: 0, Skipped: 0, Time elapsed: 16.247 sec
Running org.apache.hadoop.hbase.regionserver.TestSplitLogWorker
Tests run: 5, Failures: 0, Errors: 0, Skipped: 0, Time elapsed: 4.335 sec
Running org.apache.hadoop.hbase.regionserver.TestFSErrorsExposed
Tests run: 3, Failures: 0, Errors: 0, Skipped: 0, Time elapsed: 43.762 sec
Running org.apache.hadoop.hbase.regionserver.wal.TestLogRollAbort
Tests run: 1, Failures: 0, Errors: 0, Skipped: 0, Time elapsed: 174.159 sec
Running org.apache.hadoop.hbase.regionserver.TestMultiColumnScanner
Tests run: 12, Failures: 0, Errors: 0, Skipped: 0, Time elapsed: 48.856 sec
Running org.apache.hadoop.hbase.regionserver.TestHRegionServerBulkLoad
Tests run: 1, Failures: 0, Errors: 0, Skipped: 0, Time elapsed: 57.295 sec
Running org.apache.hadoop.hbase.regionserver.TestCompoundBloomFilter
Tests run: 3, Failures: 0, Errors: 0, Skipped: 0, Time elapsed: 27.404 sec
Running org.apache.hadoop.hbase.regionserver.TestClusterId
Tests run: 1, Failures: 0, Errors: 0, Skipped: 0, Time elapsed: 51.524 sec
Running org.apache.hadoop.hbase.regionserver.TestHRegion
Tests run: 68, Failures: 0, Errors: 0, Skipped: 0, Time elapsed: 67.736 sec
Running org.apache.hadoop.hbase.client.replication.TestReplicationAdmin
Tests run: 1, Failures: 0, Errors: 0, Skipped: 0, Time elapsed: 1.483 sec
Running org.apache.hadoop.hbase.regionserver.TestEndToEndSplitTransaction
Running org.apache.hadoop.hbase.regionserver.TestCompactionState
Tests run: 2, Failures: 0, Errors: 0, Skipped: 0, Time elapsed: 88.485 sec
Tests run: 2, Failures: 0, Errors: 0, Skipped: 0, Time elapsed: 108.431 sec
Running org.apache.hadoop.hbase.client.TestTimestampsFilter
Tests run: 3, Failures: 0, Errors: 0, Skipped: 0, Time elapsed: 46.634 sec
Running org.apache.hadoop.hbase.client.TestMultipleTimestamps
Tests run: 8, Failures: 0, Errors: 0, Skipped: 0, Time elapsed: 90.948 sec
Running org.apache.hadoop.hbase.regionserver.wal.TestHLogSplit
Tests run: 30, Failures: 0, Errors: 0, Skipped: 1, Time elapsed: 363.597 sec
Running org.apache.hadoop.hbase.client.TestHCM
Tests run: 7, Failures: 0, Errors: 0, Skipped: 0, Time elapsed: 80.908 sec
Running org.apache.hadoop.hbase.client.TestHTablePool$TestHTableReusablePool
Tests run: 8, Failures: 0, Errors: 0, Skipped: 0, Time elapsed: 6.389 sec
Running org.apache.hadoop.hbase.client.TestHTablePool$TestHTableThreadLocalPool
Tests run: 8, Failures: 0, Errors: 0, Skipped: 0, Time elapsed: 41.464 sec
Running org.apache.hadoop.hbase.client.TestHTableUtil
Tests run: 2, Failures: 0, Errors: 0, Skipped: 0, Time elapsed: 34.712 sec
Running org.apache.hadoop.hbase.client.TestFromClientSide3
Tests run: 1, Failures: 0, Errors: 0, Skipped: 0, Time elapsed: 87.674 sec
Running org.apache.hadoop.hbase.client.TestMetaScanner
Tests run: 1, Failures: 0, Errors: 0, Skipped: 0, Time elapsed: 112.193 sec
Running org.apache.hadoop.hbase.client.TestScannerTimeout
Tests run: 4, Failures: 0, Errors: 0, Skipped: 0, Time elapsed: 96.682 sec
Running org.apache.hadoop.hbase.client.TestScannersFromClientSide
Tests run: 4, Failures: 0, Errors: 0, Skipped: 0, Time elapsed: 81.194 sec
Running org.apache.hadoop.hbase.client.TestFromClientSideWithCoprocessor
Tests run: 59, Failures: 0, Errors: 0, Skipped: 3, Time elapsed: 485.47 sec
Running org.apache.hadoop.hbase.client.TestShell
Tests run: 1, Failures: 0, Errors: 0, Skipped: 0, Time elapsed: 302.304 sec
Running org.apache.hadoop.hbase.TestMultiVersions
Tests run: 3, Failures: 0, Errors: 0, Skipped: 0, Time elapsed: 62.165 sec
Running org.apache.hadoop.hbase.client.TestFromClientSide
Tests run: 59, Failures: 0, Errors: 0, Skipped: 3, Time elapsed: 505.607 sec
Running org.apache.hadoop.hbase.client.TestMultiParallel
Tests run: 11, Failures: 0, Errors: 0, Skipped: 0, Time elapsed: 135.875 sec
Running org.apache.hadoop.hbase.master.TestActiveMasterManager
Tests run: 2, Failures: 0, Errors: 0, Skipped: 0, Time elapsed: 1.4 sec
Running org.apache.hadoop.hbase.master.TestMasterNoCluster
Tests run: 3, Failures: 0, Errors: 0, Skipped: 0, Time elapsed: 8.985 sec
Running org.apache.hadoop.hbase.thrift.TestThriftServerCmdLine
Tests run: 32, Failures: 0, Errors: 0, Skipped: 0, Time elapsed: 93.743 sec
Running org.apache.hadoop.hbase.master.balancer.TestDefaultLoadBalancer
Tests run: 1, Failures: 0, Errors: 0, Skipped: 0, Time elapsed: 1.512 sec
Running org.apache.hadoop.hbase.master.balancer.TestBaseLoadBalancer
Tests run: 3, Failures: 0, Errors: 0, Skipped: 0, Time elapsed: 0.362 sec
Running org.apache.hadoop.hbase.master.TestRollingRestart
Tests run: 1, Failures: 0, Errors: 0, Skipped: 0, Time elapsed: 104.304 sec
Running org.apache.hadoop.hbase.master.TestZKBasedOpenCloseRegion
Tests run: 4, Failures: 0, Errors: 0, Skipped: 0, Time elapsed: 41.525 sec
Running org.apache.hadoop.hbase.master.TestMasterFileSystem
Tests run: 1, Failures: 0, Errors: 0, Skipped: 0, Time elapsed: 17.434 sec
Running org.apache.hadoop.hbase.thrift.TestThriftServer
Tests run: 1, Failures: 0, Errors: 0, Skipped: 0, Time elapsed: 133.966 sec
Running org.apache.hadoop.hbase.master.TestMaster
Tests run: 1, Failures: 0, Errors: 0, Skipped: 0, Time elapsed: 30.639 sec
Running org.apache.hadoop.hbase.master.TestMasterTransitions
Tests run: 3, Failures: 0, Errors: 0, Skipped: 3, Time elapsed: 42.896 sec
Running org.apache.hadoop.hbase.master.balancer.TestStochasticLoadBalancer
Tests run: 4, Failures: 0, Errors: 0, Skipped: 0, Time elapsed: 103.134 sec
Running org.apache.hadoop.hbase.master.TestOpenedRegionHandler
Tests run: 2, Failures: 0, Errors: 0, Skipped: 0, Time elapsed: 24.679 sec
Running org.apache.hadoop.hbase.master.TestSplitLogManager
Tests run: 12, Failures: 0, Errors: 0, Skipped: 0, Time elapsed: 18.658 sec
Running org.apache.hadoop.hbase.master.metrics.TestMasterMetricsWrapper
Tests run: 1, Failures: 0, Errors: 0, Skipped: 0, Time elapsed: 34.286 sec
Running org.apache.hadoop.hbase.master.TestAssignmentManager
Tests run: 12, Failures: 0, Errors: 0, Skipped: 0, Time elapsed: 5.225 sec
Running org.apache.hadoop.hbase.master.handler.TestTableDeleteFamilyHandler
Tests run: 1, Failures: 0, Errors: 0, Skipped: 0, Time elapsed: 95.425 sec
Running org.apache.hadoop.hbase.master.TestMasterStatusServlet
Tests run: 5, Failures: 0, Errors: 0, Skipped: 0, Time elapsed: 1.589 sec
Running org.apache.hadoop.hbase.master.TestHMasterRPCException
Tests run: 1, Failures: 0, Errors: 0, Skipped: 0, Time elapsed: 5.2 sec
Running org.apache.hadoop.hbase.master.TestMasterRestartAfterDisablingTable
Tests run: 1, Failures: 0, Errors: 0, Skipped: 0, Time elapsed: 40.931 sec
Running org.apache.hadoop.hbase.master.TestAssignmentManagerOnCluster
Tests run: 3, Failures: 0, Errors: 0, Skipped: 0, Time elapsed: 54.034 sec
Running org.apache.hadoop.hbase.master.cleaner.TestLogsCleaner
Tests run: 1, Failures: 0, Errors: 0, Skipped: 0, Time elapsed: 3.766 sec
Running org.apache.hadoop.hbase.master.TestMasterShutdown
Tests run: 1, Failures: 0, Errors: 0, Skipped: 0, Time elapsed: 23.636 sec
Running org.apache.hadoop.hbase.master.TestRestartCluster
Tests run: 2, Failures: 0, Errors: 0, Skipped: 0, Time elapsed: 49.357 sec
Running org.apache.hadoop.hbase.master.TestMasterFailover
Tests run: 5, Failures: 0, Errors: 0, Skipped: 0, Time elapsed: 115.877 sec
Running org.apache.hadoop.hbase.master.TestDistributedLogSplitting
Tests run: 4, Failures: 0, Errors: 0, Skipped: 0, Time elapsed: 156.263 sec
Running org.apache.hadoop.hbase.ipc.TestProtoBufRpc
Tests run: 1, Failures: 0, Errors: 0, Skipped: 0, Time elapsed: 0.846 sec
Running org.apache.hadoop.hbase.ipc.TestDelayedRpc
Tests run: 4, Failures: 0, Errors: 0, Skipped: 0, Time elapsed: 2.341 sec
Running org.apache.hadoop.hbase.ipc.TestHBaseClient
Tests run: 1, Failures: 0, Errors: 0, Skipped: 0, Time elapsed: 0.149 sec
Running org.apache.hadoop.hbase.TestZooKeeper
Tests run: 9, Failures: 0, Errors: 0, Skipped: 0, Time elapsed: 40.028 sec
Running org.apache.hadoop.hbase.thrift2.TestThriftHBaseServiceHandler
Running org.apache.hadoop.hbase.TestRegionRebalancing
Tests run: 12, Failures: 0, Errors: 0, Skipped: 0, Time elapsed: 19.354 sec
Tests run: 2, Failures: 0, Errors: 0, Skipped: 0, Time elapsed: 140.969 sec
Running org.apache.hadoop.hbase.TestInfoServers
Tests run: 2, Failures: 0, Errors: 0, Skipped: 0, Time elapsed: 15.363 sec
Running org.apache.hadoop.hbase.TestAcidGuarantees
Tests run: 3, Failures: 0, Errors: 0, Skipped: 0, Time elapsed: 119.55 sec
Running org.apache.hadoop.hbase.client.TestAdmin
Tests run: 41, Failures: 2, Errors: 21, Skipped: 0, Time elapsed: 794.128 sec <<<
FAILURE!

Results :

Failed tests:   testMultipleTables(org.apache.hadoop.hbase.backup.example.TestZooKeeperTableArchiveClient):
Archived HFiles (hdfs://localhost:53691/user/hudson/hbase/.archive/otherTable/5ef2d7f80f45a6a878a5dfdb5c511259/fam)
should have gotten deleted, but didn't, remaining files:[hdfs://localhost:53691/user/hudson/hbase/.archive/otherTable/5ef2d7f80f45a6a878a5dfdb5c511259/fam/7cd64f3150d64fc6815678adc9197dd7,
hdfs://localhost:53691/user/hudson/hbase/.archive/otherTable/5ef2d7f80f45a6a878a5dfdb5c511259/fam/7e6c921cdb034115990a6f25740510a6,
hdfs://localhost:53691/user/hudson/hbase/.archive/otherTable/5ef2d7f80f45a6a878a5dfdb5c511259/fam/890595cbd6014f1f833a537f32bc8d3a,
hdfs://localhost:53691/user/hudson/hbase/.archive/otherTable/5ef2d7f80f45a6a878a5dfdb5c511259/fam/9c8c808f01e94a3da8e4a26dd8bd4860,
hdfs://localhost:53691/user/hudson/hbase/.archive/otherTable/5ef2d7f80f45a6a878a5dfdb5c511259/fam/a2f3a3472f9e46bc81d42b011295f778,
hdfs://localhost:53691/user/hudson/hbase/.archive/otherTable/5ef2d7f80f45a6a878a5dfdb5c511259/fam/af9badcc1f9d4ad2b4cf1570980569b4,
hdfs://localhost:53691/user/hudson/hbase/.archive/otherTable/5ef2d7f80f45a6a878a5dfdb5c511259/fam/b217d363f69544448e650a559c61860e,
hdfs://localhost:53691/user/hudson/hbase/.archive/otherTable/5ef2d7f80f45a6a878a5dfdb5c511259/fam/b683c9ef34094b07a4ce4a030b82311d,
hdfs://localhost:53691/user/hudson/hbase/.archive/otherTable/5ef2d7f80f45a6a878a5dfdb5c511259/fam/ba8bd1529211438884dbcafb134fb6b4,
hdfs://localhost:53691/user/hudson/hbase/.archive/otherTable/5ef2d7f80f45a6a878a5dfdb5c511259/fam/bbe862406cbe47da9679a31099af3c04,
hdfs://localhost:53691/user/hudson/hbase/.archive/otherTable/5ef2d7f80f45a6a878a5dfdb5c511259/fam/bef43afdacbc4f728b0abcd396c1bfd6,
hdfs://localhost:53691/user/hudson/hbase/.archive/otherTable/5ef2d7f80f45a6a878a5dfdb5c511259/fam/c71a804cafab41dab3a86b38d3e50077,
hdfs://localhost:53691/user/hudson/hbase/.archive/otherTable/5ef2d7f80f45a6a878a5dfdb5c511259/fam/cc24a246ca3c4b5dbb5255d2e7f1c303,
hdfs://localhost:53691/user/hudson/hbase/.archive/otherTable/5ef2d7f80f45a6a878a5dfdb5c511259/fam/ccf0bcd79bdc4c27ac799270f36b1f1a,
hdfs://localhost:53691/user/hudson/hbase/.archive/otherTable/5ef2d7f80f45a6a878a5dfdb5c511259/fam/d0b16d57652f4f1d96c6a1044a831b00,
hdfs://localhost:53691/user/hudson/hbase/.archive/otherTable/5ef2d7f80f45a6a878a5dfdb5c511259/fam/e1cbfdc538eb40e4a94647f9ae00f0c5,
hdfs://localhost:53691/user/hudson/hbase/.archive/otherTable/5ef2d7f80f45a6a878a5dfdb5c511259/fam/e424464cc89f4426be8abeae3d5c76e8,
hdfs://localhost:53691/user/hudson/hbase/.archive/otherTable/5ef2d7f80f45a6a878a5dfdb5c511259/fam/e83d89d1e0c54e1587ba102952093011,
hdfs://localhost:53691/user/hudson/hbase/.archive/otherTable/5ef2d7f80f45a6a878a5dfdb5c511259/fam/e99be2873cbf4305a0fa9558444510e9,
hdfs://localhost:53691/user/hudson/hbase/.archive/otherTable/5ef2d7f80f45a6a878a5dfdb5c511259/fam/ed71b11a9e02407fa37c76bbc71f7193,
hdfs://localhost:53691/user/hudson/hbase/.archive/otherTable/5ef2d7f80f45a6a878a5dfdb5c511259/fam/f07aab3f489b4d5b96c7496a132be212,
hdfs://localhost:53691/user/hudson/hbase/.archive/otherTable/5ef2d7f80f45a6a878a5dfdb5c511259/fam/f104a4c8b93247f694f23e7cfc68c3e6,
hdfs://localhost:53691/user/hudson/hbase/.archive/otherTable/5ef2d7f80f45a6a878a5dfdb5c511259/fam/f6c3ef1a52dd45ac8280489165955b05]
  testForceSplitMultiFamily(org.apache.hadoop.hbase.client.TestAdmin)
  testCreateBadTables(org.apache.hadoop.hbase.client.TestAdmin): expected:<1> but was:<0>

Tests in error: 
  testReconstruction(org.apache.hadoop.hbase.TestFullLogReconstruction): No server address
listed in .META. for region tabletest,uuu,1347765581999.c446187289ad6958923faea8d652cf1c.
containing row uuu
  testMultiSlaveReplication(org.apache.hadoop.hbase.replication.TestMultiSlaveReplication):
Shutting down
  testCyclicReplication(org.apache.hadoop.hbase.replication.TestMasterReplication): Shutting
down
  testForceSplit(org.apache.hadoop.hbase.client.TestAdmin): Retries exhausted, it took too
long to wait for the table testForceSplit to be disabled.
  testEnableTableRoundRobinAssignment(org.apache.hadoop.hbase.client.TestAdmin): com.google.protobuf.ServiceException:
org.apache.hadoop.hbase.ipc.HBaseClient$FailedServerException: This server is in the failed
servers list: vesta.apache.org/67.195.138.9:44378
  testEnableDisableAddColumnDeleteColumn(org.apache.hadoop.hbase.client.TestAdmin): com.google.protobuf.ServiceException:
org.apache.hadoop.hbase.ipc.HBaseClient$FailedServerException: This server is in the failed
servers list: vesta.apache.org/67.195.138.9:44378
  testTableNameClash(org.apache.hadoop.hbase.client.TestAdmin): com.google.protobuf.ServiceException:
org.apache.hadoop.hbase.ipc.HBaseClient$FailedServerException: This server is in the failed
servers list: vesta.apache.org/67.195.138.9:44378
  testCreateTableRPCTimeOut(org.apache.hadoop.hbase.client.TestAdmin): com.google.protobuf.ServiceException:
org.apache.hadoop.hbase.ipc.HBaseClient$FailedServerException: This server is in the failed
servers list: vesta.apache.org/67.195.138.9:44378
  testReadOnlyTable(org.apache.hadoop.hbase.client.TestAdmin): com.google.protobuf.ServiceException:
org.apache.hadoop.hbase.ipc.HBaseClient$FailedServerException: This server is in the failed
servers list: vesta.apache.org/67.195.138.9:44378
  testTableExistsExceptionWithATable(org.apache.hadoop.hbase.client.TestAdmin): Unexpected
exception, expected<org.apache.hadoop.hbase.TableExistsException> but was<org.apache.hadoop.hbase.MasterNotRunningException>
  testTableNotEnabledExceptionWithATable(org.apache.hadoop.hbase.client.TestAdmin): Unexpected
exception, expected<org.apache.hadoop.hbase.TableNotEnabledException> but was<org.apache.hadoop.hbase.MasterNotRunningException>
  testTableNotDisabledExceptionWithATable(org.apache.hadoop.hbase.client.TestAdmin): Unexpected
exception, expected<org.apache.hadoop.hbase.TableNotDisabledException> but was<org.apache.hadoop.hbase.MasterNotRunningException>
  testShouldCloseTheRegionBasedOnTheEncodedRegionName(org.apache.hadoop.hbase.client.TestAdmin):
com.google.protobuf.ServiceException: org.apache.hadoop.hbase.ipc.HBaseClient$FailedServerException:
This server is in the failed servers list: vesta.apache.org/67.195.138.9:44378
  testCloseRegionIfInvalidRegionNameIsPassed(org.apache.hadoop.hbase.client.TestAdmin): com.google.protobuf.ServiceException:
org.apache.hadoop.hbase.ipc.HBaseClient$FailedServerException: This server is in the failed
servers list: vesta.apache.org/67.195.138.9:44378
  testCloseRegionThatFetchesTheHRIFromMeta(org.apache.hadoop.hbase.client.TestAdmin): com.google.protobuf.ServiceException:
org.apache.hadoop.hbase.ipc.HBaseClient$FailedServerException: This server is in the failed
servers list: vesta.apache.org/67.195.138.9:44378
  testCloseRegionWhenServerNameIsNull(org.apache.hadoop.hbase.client.TestAdmin): com.google.protobuf.ServiceException:
java.net.ConnectException: Connection refused
  testCloseRegionWhenServerNameIsEmpty(org.apache.hadoop.hbase.client.TestAdmin): com.google.protobuf.ServiceException:
org.apache.hadoop.hbase.ipc.HBaseClient$FailedServerException: This server is in the failed
servers list: vesta.apache.org/67.195.138.9:44378
  testCloseRegionWhenEncodedRegionNameIsNotGiven(org.apache.hadoop.hbase.client.TestAdmin):
com.google.protobuf.ServiceException: org.apache.hadoop.hbase.ipc.HBaseClient$FailedServerException:
This server is in the failed servers list: vesta.apache.org/67.195.138.9:44378
  testGetTableRegions(org.apache.hadoop.hbase.client.TestAdmin): com.google.protobuf.ServiceException:
org.apache.hadoop.hbase.ipc.HBaseClient$FailedServerException: This server is in the failed
servers list: vesta.apache.org/67.195.138.9:44378
  testHLogRollWriting(org.apache.hadoop.hbase.client.TestAdmin): com.google.protobuf.ServiceException:
org.apache.hadoop.hbase.ipc.HBaseClient$FailedServerException: This server is in the failed
servers list: vesta.apache.org/67.195.138.9:44378
  testMoveToPreviouslyAssignedRS(org.apache.hadoop.hbase.client.TestAdmin): com.google.protobuf.ServiceException:
org.apache.hadoop.hbase.ipc.HBaseClient$FailedServerException: This server is in the failed
servers list: vesta.apache.org/67.195.138.9:44378
  testCheckHBaseAvailableClosesConnection(org.apache.hadoop.hbase.client.TestAdmin): com.google.protobuf.ServiceException:
org.apache.hadoop.hbase.ipc.HBaseClient$FailedServerException: This server is in the failed
servers list: vesta.apache.org/67.195.138.9:44378
  testDisableCatalogTable(org.apache.hadoop.hbase.client.TestAdmin): com.google.protobuf.ServiceException:
org.apache.hadoop.hbase.ipc.HBaseClient$FailedServerException: This server is in the failed
servers list: vesta.apache.org/67.195.138.9:44378
  testGetRegion(org.apache.hadoop.hbase.client.TestAdmin): com.google.protobuf.ServiceException:
org.apache.hadoop.hbase.ipc.HBaseClient$FailedServerException: This server is in the failed
servers list: vesta.apache.org/67.195.138.9:44378

Tests run: 1131, Failures: 3, Errors: 24, Skipped: 12

[INFO]                                                                         
[INFO] ------------------------------------------------------------------------
[INFO] Skipping HBase
[INFO] This project has been banned from the build due to previous failures.
[INFO] ------------------------------------------------------------------------
[INFO]                                                                         
[INFO] ------------------------------------------------------------------------
[INFO] Skipping HBase
[INFO] This project has been banned from the build due to previous failures.
[INFO] ------------------------------------------------------------------------
[INFO] ------------------------------------------------------------------------
[INFO] Reactor Summary:
[INFO] 
[INFO] HBase ............................................. SUCCESS [4.050s]
[INFO] HBase - Common .................................... SUCCESS [5.513s]
[INFO] HBase - Hadoop Compatibility ...................... SUCCESS [0.541s]
[INFO] HBase - Hadoop One Compatibility .................. SUCCESS [1.032s]
[INFO] HBase - Server .................................... FAILURE [1:04:10.904s]
[INFO] HBase - Hadoop Two Compatibility .................. SKIPPED
[INFO] HBase - Integration Tests ......................... SKIPPED
[INFO] ------------------------------------------------------------------------
[INFO] BUILD FAILURE
[INFO] ------------------------------------------------------------------------
[INFO] Total time: 1:04:23.236s
[INFO] Finished at: Sun Sep 16 04:11:15 UTC 2012
[INFO] Final Memory: 57M/508M
[INFO] ------------------------------------------------------------------------
[ERROR] Failed to execute goal org.apache.maven.plugins:maven-surefire-plugin:2.12-TRUNK-HBASE-2:test
(secondPartTestsExecution) on project hbase-server: Failure or timeout -> [Help 1]
[ERROR] 
[ERROR] To see the full stack trace of the errors, re-run Maven with the -e switch.
[ERROR] Re-run Maven using the -X switch to enable full debug logging.
[ERROR] 
[ERROR] For more information about the errors and possible solutions, please read the following
articles:
[ERROR] [Help 1] http://cwiki.apache.org/confluence/display/MAVEN/MojoExecutionException
[ERROR] 
[ERROR] After correcting the problems, you can resume the build with the command
[ERROR]   mvn <goals> -rf :hbase-server
Build step 'Invoke top-level Maven targets' marked build as failure
Archiving artifacts
Recording test results
Updating HBASE-6438

Mime
View raw message