hbase-dev mailing list archives

Site index · List index
Message view « Date » · « Thread »
Top « Date » · « Thread »
From Apache Jenkins Server <jenk...@builds.apache.org>
Subject Build failed in Jenkins: HBase-TRUNK #3398
Date Sun, 30 Sep 2012 06:37:00 GMT
See <https://builds.apache.org/job/HBase-TRUNK/3398/changes>

Changes:

[stack] HBASE-6890 Colorize test-patch results that goes to JIRA as a comment

------------------------------------------
[...truncated 3000 lines...]
Running org.apache.hadoop.hbase.replication.TestMasterReplication
Tests run: 2, Failures: 0, Errors: 2, Skipped: 0, Time elapsed: 217.334 sec <<< FAILURE!
Running org.apache.hadoop.hbase.TestHBaseTestingUtility
Tests run: 7, Failures: 0, Errors: 3, Skipped: 0, Time elapsed: 335.525 sec <<< FAILURE!

Results :

Failed tests:   testLeaderSelection(org.apache.hadoop.hbase.zookeeper.TestZKLeaderManager):
Leader should exist

Tests in error: 
  testLogCleaning(org.apache.hadoop.hbase.master.cleaner.TestLogsCleaner): KeeperErrorCode
= ConnectionLoss for /hbase/replication/peers
  org.apache.hadoop.hbase.master.TestMasterFileSystem: Shutting down
  org.apache.hadoop.hbase.master.TestMaster: Shutting down
  testOpenedRegionHandlerOnMasterRestart(org.apache.hadoop.hbase.master.TestOpenedRegionHandler):
Shutting down
  testShouldNotCompeleteOpenedRegionSuccessfullyIfVersionMismatches(org.apache.hadoop.hbase.master.TestOpenedRegionHandler):
MockServer,123,-1-0x13a158f4f7e0000-0x13a158f4f7e0000-0x13a158f4f7e0000-0x13a158f4f7e0000
Unexpected KeeperException creating base node
  testRecoveredEdits(org.apache.hadoop.hbase.master.TestDistributedLogSplitting): Shutting
down
  testWorkerAbort(org.apache.hadoop.hbase.master.TestDistributedLogSplitting): Shutting down
  testThreeRSAbort(org.apache.hadoop.hbase.master.TestDistributedLogSplitting): Shutting down
  testDelayedDeleteOnFailure(org.apache.hadoop.hbase.master.TestDistributedLogSplitting):
test timed out after 25000 milliseconds
  org.apache.hadoop.hbase.master.TestMasterMetrics: Shutting down
  org.apache.hadoop.hbase.master.TestMasterTransitions: Shutting down
  testClusterRestart(org.apache.hadoop.hbase.master.TestRestartCluster): Shutting down
  testRestartClusterAfterKill(org.apache.hadoop.hbase.master.TestRestartCluster): cluster1-0x13a1592fc790000-0x13a1592fc790000-0x13a1592fc790000-0x13a1592fc790000
Unexpected KeeperException creating base node
  testMasterFailoverWithMockedRITOnDeadRS(org.apache.hadoop.hbase.master.TestMasterFailover):
Shutting down
  testShouldCheckMasterFailOverWhenMETAIsInOpenedState(org.apache.hadoop.hbase.master.TestMasterFailover):
Shutting down
  testSimpleMasterFailover(org.apache.hadoop.hbase.master.TestMasterFailover): Shutting down
  testMasterFailoverWithMockedRIT(org.apache.hadoop.hbase.master.TestMasterFailover): Shutting
down
  testMasterFailoverBalancerPersistence(org.apache.hadoop.hbase.master.TestMasterFailover):
Shutting down
  org.apache.hadoop.hbase.master.metrics.TestMasterMetricsWrapper: Shutting down
  org.apache.hadoop.hbase.master.TestAssignmentManagerOnCluster: Shutting down
  testActiveMasterManagerFromZK(org.apache.hadoop.hbase.master.TestActiveMasterManager): testActiveMasterManagerFromZK-0x13a159472980000-0x13a159472980000-0x13a159472980000-0x13a159472980000
Unexpected KeeperException creating base node
  testRestartMaster(org.apache.hadoop.hbase.master.TestActiveMasterManager): testActiveMasterManagerFromZK-0x13a159472980001-0x13a159472980001-0x13a159472980001-0x13a159472980001
Unexpected KeeperException creating base node
  testStopDuringStart(org.apache.hadoop.hbase.master.TestMasterNoCluster): KeeperErrorCode
= ConnectionLoss for /hbase
  testFailover(org.apache.hadoop.hbase.master.TestMasterNoCluster): KeeperErrorCode = ConnectionLoss
for /hbase
  testCatalogDeploys(org.apache.hadoop.hbase.master.TestMasterNoCluster): KeeperErrorCode
= ConnectionLoss for /hbase
  testMasterShutdown(org.apache.hadoop.hbase.master.TestMasterShutdown): Shutting down
  testForCheckingIfEnableAndDisableWorksFineAfterSwitch(org.apache.hadoop.hbase.master.TestMasterRestartAfterDisablingTable):
Shutting down
  testRPCException(org.apache.hadoop.hbase.master.TestHMasterRPCException): master:49207-0x13a1598122d0000-0x13a1598122d0000-0x13a1598122d0000-0x13a1598122d0000
Unexpected KeeperException creating base node
  testBasicRollingRestart(org.apache.hadoop.hbase.master.TestRollingRestart): Shutting down
  org.apache.hadoop.hbase.master.TestZKBasedOpenCloseRegion: Shutting down
  testTableStates(org.apache.hadoop.hbase.zookeeper.TestZKTable): testDisabled-0x13a159b63440000-0x13a159b63440000-0x13a159b63440000-0x13a159b63440000
Unexpected KeeperException creating base node
  org.apache.hadoop.hbase.backup.TestHFileArchiving: Shutting down
  org.apache.hadoop.hbase.backup.example.TestZooKeeperTableArchiveClient: Shutting down
  testNodeTracker(org.apache.hadoop.hbase.zookeeper.TestZooKeeperNodeTracker): KeeperErrorCode
= ConnectionLoss for /hbase
  testCleanZNode(org.apache.hadoop.hbase.zookeeper.TestZooKeeperNodeTracker): KeeperErrorCode
= ConnectionLoss for /hbase
  org.apache.hadoop.hbase.TestFullLogReconstruction: Shutting down
  org.apache.hadoop.hbase.TestDrainingServer: Shutting down
  testLocalHBaseCluster(org.apache.hadoop.hbase.TestLocalHBaseCluster): Failed construction
of Master: class org.apache.hadoop.hbase.TestLocalHBaseCluster$MyHMasterKeeperErrorCode =
ConnectionLoss for /hbase
  org.apache.hadoop.hbase.TestMultiVersions: Shutting down
  org.apache.hadoop.hbase.TestInfoServers: Shutting down
  testRebalanceOnRegionServerNumberChange[0](org.apache.hadoop.hbase.TestRegionRebalancing):
Shutting down
  testRebalanceOnRegionServerNumberChange[1](org.apache.hadoop.hbase.TestRegionRebalancing):
Shutting down
  testMergeTable(org.apache.hadoop.hbase.util.TestMergeTable): Shutting down
  org.apache.hadoop.hbase.util.TestHBaseFsck: Shutting down
  testMetaRebuild(org.apache.hadoop.hbase.util.hbck.TestOfflineMetaRebuildBase): Shutting
down
  testMetaRebuildOverlapFail(org.apache.hadoop.hbase.util.hbck.TestOfflineMetaRebuildOverlap):
Shutting down
  testMetaRebuildHoleFail(org.apache.hadoop.hbase.util.hbck.TestOfflineMetaRebuildHole): Shutting
down
  org.apache.hadoop.hbase.util.TestRegionSplitter: Shutting down
  loadTest[0](org.apache.hadoop.hbase.util.TestMiniClusterLoadParallel): Shutting down
  loadTest[1](org.apache.hadoop.hbase.util.TestMiniClusterLoadParallel): Shutting down
  loadTest[2](org.apache.hadoop.hbase.util.TestMiniClusterLoadParallel): Shutting down
  loadTest[3](org.apache.hadoop.hbase.util.TestMiniClusterLoadParallel): Shutting down
  org.apache.hadoop.hbase.util.TestCoprocessorScanPolicy: Shutting down
  org.apache.hadoop.hbase.security.token.TestTokenAuthentication: Shutting down
  org.apache.hadoop.hbase.security.access.TestTablePermissions: Shutting down
  org.apache.hadoop.hbase.security.access.TestAccessControlFilter: Shutting down
  loadTest[0](org.apache.hadoop.hbase.util.TestMiniClusterLoadEncoded): Shutting down
  loadTest[1](org.apache.hadoop.hbase.util.TestMiniClusterLoadEncoded): Shutting down
  loadTest[2](org.apache.hadoop.hbase.util.TestMiniClusterLoadEncoded): Shutting down
  loadTest[3](org.apache.hadoop.hbase.util.TestMiniClusterLoadEncoded): Shutting down
  org.apache.hadoop.hbase.security.access.TestAccessController: Shutting down
  loadTest[0](org.apache.hadoop.hbase.util.TestMiniClusterLoadSequential): Shutting down
  loadTest[1](org.apache.hadoop.hbase.util.TestMiniClusterLoadSequential): Shutting down
  loadTest[2](org.apache.hadoop.hbase.util.TestMiniClusterLoadSequential): Shutting down
  loadTest[3](org.apache.hadoop.hbase.util.TestMiniClusterLoadSequential): Shutting down
  org.apache.hadoop.hbase.security.access.TestZKPermissionsWatcher: Shutting down
  org.apache.hadoop.hbase.regionserver.TestRSKilledWhenMasterInitializing: Shutting down
  org.apache.hadoop.hbase.regionserver.TestRSKilledWhenMasterInitializing: null not an instance
of org.apache.hadoop.hbase.MiniHBaseCluster
  org.apache.hadoop.hbase.regionserver.TestServerCustomProtocol: Shutting down
  testMasterAddressManagerFromZK(org.apache.hadoop.hbase.regionserver.TestMasterAddressManager):
KeeperErrorCode = ConnectionLoss for /hbase
  org.apache.hadoop.hbase.regionserver.TestMXBean: Shutting down
  org.apache.hadoop.hbase.regionserver.TestCompactionState: Shutting down
  org.apache.hadoop.hbase.regionserver.TestSplitTransactionOnCluster: Shutting down
  org.apache.hadoop.hbase.regionserver.TestEndToEndSplitTransaction: Shutting down
  testDataCorrectnessReplayingRecoveredEdits(org.apache.hadoop.hbase.regionserver.TestHRegionOnCluster):
Shutting down
  testgetHDFSBlocksDistribution(org.apache.hadoop.hbase.regionserver.TestHRegion): Shutting
down
  org.apache.hadoop.hbase.regionserver.TestStoreFileBlockCacheSummary: Shutting down
  testClusterId(org.apache.hadoop.hbase.regionserver.TestClusterId): Shutting down
  org.apache.hadoop.hbase.regionserver.wal.TestWALReplay: Shutting down
  testOperationMetrics(org.apache.hadoop.hbase.regionserver.TestRegionServerMetrics): Shutting
down
  testCheckAndMutateMetrics(org.apache.hadoop.hbase.regionserver.TestRegionServerMetrics):
Shutting down
  testRemoveRegionMetrics(org.apache.hadoop.hbase.regionserver.TestRegionServerMetrics): Shutting
down
  testMultipleRegions(org.apache.hadoop.hbase.regionserver.TestRegionServerMetrics): Shutting
down
  testGetNextSize(org.apache.hadoop.hbase.regionserver.TestRegionServerMetrics): Shutting
down
  testFlushedSequenceIdsSentToHMaster(org.apache.hadoop.hbase.regionserver.wal.TestHLogFiltering):
Shutting down
  testRSAbortWithUnflushedEdits(org.apache.hadoop.hbase.regionserver.wal.TestLogRollAbort):
Shutting down
  testAcquireTaskAtStartup(org.apache.hadoop.hbase.regionserver.TestSplitLogWorker): KeeperErrorCode
= ConnectionLoss for /hbase
  testRaceForTask(org.apache.hadoop.hbase.regionserver.TestSplitLogWorker): KeeperErrorCode
= ConnectionLoss for /hbase
  testPreemptTask(org.apache.hadoop.hbase.regionserver.TestSplitLogWorker): KeeperErrorCode
= ConnectionLoss for /hbase
  testMultipleTasks(org.apache.hadoop.hbase.regionserver.TestSplitLogWorker): KeeperErrorCode
= ConnectionLoss for /hbase
  testRescan(org.apache.hadoop.hbase.regionserver.TestSplitLogWorker): KeeperErrorCode = ConnectionLoss
for /hbase
  org.apache.hadoop.hbase.regionserver.wal.TestWALReplayCompressed: Shutting down
  testAtomicBulkLoad(org.apache.hadoop.hbase.regionserver.TestHRegionServerBulkLoad): Shutting
down
  testLogRolling(org.apache.hadoop.hbase.regionserver.wal.TestLogRolling): Shutting down
  testLogRollOnDatanodeDeath(org.apache.hadoop.hbase.regionserver.wal.TestLogRolling): Shutting
down
  testZKClosingNodeVersionMismatch(org.apache.hadoop.hbase.regionserver.handler.TestCloseRegionHandler):
MockServer,123,-1-0x13a15b92a310000-0x13a15b92a310000-0x13a15b92a310000-0x13a15b92a310000
Unexpected KeeperException creating base node
  testCloseRegion(org.apache.hadoop.hbase.regionserver.handler.TestCloseRegionHandler): MockServer,123,-1-0x13a15b92a310001-0x13a15b92a310001-0x13a15b92a310001-0x13a15b92a310001
Unexpected KeeperException creating base node
  org.apache.hadoop.hbase.filter.TestFilterWithScanLimits: Shutting down
  org.apache.hadoop.hbase.filter.TestFilterWrapper: Shutting down
  org.apache.hadoop.hbase.coprocessor.TestClassLoading: Shutting down
  org.apache.hadoop.hbase.filter.TestColumnRangeFilter: Shutting down
  testFailedOpenRegion(org.apache.hadoop.hbase.regionserver.handler.TestOpenRegionHandler):
MockServer,123,-1-0x13a15b94d890000-0x13a15b94d890000-0x13a15b94d890000-0x13a15b94d890000
Unexpected KeeperException creating base node
  testFailedUpdateMeta(org.apache.hadoop.hbase.regionserver.handler.TestOpenRegionHandler):
MockServer,123,-1-0x13a15b94d890001-0x13a15b94d890001-0x13a15b94d890001-0x13a15b94d890001
Unexpected KeeperException creating base node
  testYankingRegionFromUnderIt(org.apache.hadoop.hbase.regionserver.handler.TestOpenRegionHandler):
MockServer,123,-1-0x13a15b94d890002-0x13a15b94d890002-0x13a15b94d890002-0x13a15b94d890002
Unexpected KeeperException creating base node
  org.apache.hadoop.hbase.coprocessor.TestAggregateProtocol: Shutting down
  org.apache.hadoop.hbase.coprocessor.TestRowProcessorEndpoint: Shutting down
  org.apache.hadoop.hbase.coprocessor.TestRegionServerCoprocessorExceptionWithRemove: Shutting
down
  org.apache.hadoop.hbase.coprocessor.TestRegionServerCoprocessorExceptionWithAbort: Shutting
down
  org.apache.hadoop.hbase.coprocessor.TestMasterObserver: Shutting down
  org.apache.hadoop.hbase.coprocessor.TestCoprocessorEndpoint: Shutting down
  org.apache.hadoop.hbase.coprocessor.TestWALObserver: Shutting down
  org.apache.hadoop.hbase.coprocessor.example.TestZooKeeperScanPolicyObserver: Shutting down
  org.apache.hadoop.hbase.coprocessor.TestMasterCoprocessorExceptionWithAbort: Shutting down
  org.apache.hadoop.hbase.coprocessor.example.TestRowCountEndpoint: Shutting down
  org.apache.hadoop.hbase.coprocessor.TestRegionObserverInterface: Shutting down
  org.apache.hadoop.hbase.coprocessor.TestMasterCoprocessorExceptionWithRemove: Shutting down
  org.apache.hadoop.hbase.coprocessor.TestRegionObserverBypass: Shutting down
  org.apache.hadoop.hbase.mapred.TestTableMapReduce: Shutting down
  org.apache.hadoop.hbase.mapred.TestTableInputFormat: Shutting down
  testGlobalMemStore(org.apache.hadoop.hbase.TestGlobalMemStoreSize): Shutting down
  org.apache.hadoop.hbase.mapreduce.TestTableMapReduce: Shutting down
  org.apache.hadoop.hbase.mapreduce.TestLoadIncrementalHFilesSplitRecovery: Shutting down
  org.apache.hadoop.hbase.mapreduce.TestWALPlayer: Shutting down
  testHBaseCluster(org.apache.hadoop.hbase.fs.TestBlockReorder): Shutting down
  testBlockLocation(org.apache.hadoop.hbase.fs.TestBlockReorder): Shutting down
  org.apache.hadoop.hbase.mapreduce.TestRowCounter: Shutting down
  org.apache.hadoop.hbase.mapreduce.TestTableInputFormatScan: Shutting down
  org.apache.hadoop.hbase.mapreduce.TestMultithreadedTableMapper: Shutting down
  org.apache.hadoop.hbase.mapreduce.TestTimeRangeMapRed: Shutting down
  testMRIncrementalLoad(org.apache.hadoop.hbase.mapreduce.TestHFileOutputFormat): Shutting
down
  testMRIncrementalLoadWithSplit(org.apache.hadoop.hbase.mapreduce.TestHFileOutputFormat):
Shutting down
  testExcludeMinorCompaction(org.apache.hadoop.hbase.mapreduce.TestHFileOutputFormat): Shutting
down
  org.apache.hadoop.hbase.mapreduce.TestLoadIncrementalHFiles: Shutting down
  org.apache.hadoop.hbase.mapreduce.TestImportExport: Shutting down
  org.apache.hadoop.hbase.trace.TestHTraceHooks: Shutting down
  org.apache.hadoop.hbase.thrift2.TestThriftHBaseServiceHandler: Shutting down
  testRideOverServerNotRunning(org.apache.hadoop.hbase.catalog.TestMetaReaderEditorNoCluster):
TestMetaReaderEditorNoCluster-0x13a15c9f65c0000-0x13a15c9f65c0000-0x13a15c9f65c0000-0x13a15c9f65c0000
Unexpected KeeperException creating base node
  testMROnTable(org.apache.hadoop.hbase.mapreduce.TestImportTsv): Shutting down
  testMROnTableWithTimestamp(org.apache.hadoop.hbase.mapreduce.TestImportTsv): Shutting down
  testMROnTableWithCustomMapper(org.apache.hadoop.hbase.mapreduce.TestImportTsv): Shutting
down
  testBulkOutputWithoutAnExistingTable(org.apache.hadoop.hbase.mapreduce.TestImportTsv): Shutting
down
  org.apache.hadoop.hbase.catalog.TestMetaReaderEditor: Shutting down
  org.apache.hadoop.hbase.catalog.TestMetaReaderEditor
  testBadOriginalRootLocation(org.apache.hadoop.hbase.catalog.TestCatalogTrackerOnCluster):
Shutting down
  testGetAtomicity(org.apache.hadoop.hbase.TestAcidGuarantees): Shutting down
  testScanAtomicity(org.apache.hadoop.hbase.TestAcidGuarantees): Shutting down
  testMixedAtomicity(org.apache.hadoop.hbase.TestAcidGuarantees): Shutting down
  org.apache.hadoop.hbase.catalog.TestMetaMigrationConvertingToPB: Shutting down
  org.apache.hadoop.hbase.client.TestFromClientSide3: Shutting down
  org.apache.hadoop.hbase.client.TestTimestampsFilter: Shutting down
  org.apache.hadoop.hbase.client.TestShell: Shutting down
  org.apache.hadoop.hbase.client.TestFromClientSide: Shutting down
  org.apache.hadoop.hbase.client.TestScannersFromClientSide: Shutting down
  org.apache.hadoop.hbase.client.TestHCM: Shutting down
  org.apache.hadoop.hbase.client.TestScannerTimeout: Shutting down
  org.apache.hadoop.hbase.client.TestFromClientSideWithCoprocessor: Shutting down
  org.apache.hadoop.hbase.client.TestMetaScanner: Shutting down
  org.apache.hadoop.hbase.client.TestHTableUtil: Shutting down
  org.apache.hadoop.hbase.client.TestMultipleTimestamps: Shutting down
  org.apache.hadoop.hbase.client.TestMultiParallel: Shutting down
  org.apache.hadoop.hbase.client.TestAdmin: Shutting down
  org.apache.hadoop.hbase.constraint.TestConstraint: Shutting down
  org.apache.hadoop.hbase.client.replication.TestReplicationAdmin: Unable setup the ZooKeeper
connection
  org.apache.hadoop.hbase.rest.TestGzipFilter: Shutting down
  org.apache.hadoop.hbase.rest.TestMultiRowResource: Shutting down
  org.apache.hadoop.hbase.rest.TestScannersWithFilters: Shutting down
  org.apache.hadoop.hbase.rest.TestRowResource: Shutting down
  org.apache.hadoop.hbase.rest.client.TestRemoteAdmin: Shutting down
  org.apache.hadoop.hbase.rest.client.TestRemoteTable: Shutting down
  org.apache.hadoop.hbase.rest.client.TestRemoteTable
  org.apache.hadoop.hbase.rest.TestVersionResource: Shutting down
  org.apache.hadoop.hbase.rest.TestScannerResource: Shutting down
  org.apache.hadoop.hbase.rest.TestTableResource: Shutting down
  org.apache.hadoop.hbase.rest.TestStatusResource: Shutting down
  org.apache.hadoop.hbase.rest.TestSchemaResource: Shutting down
  org.apache.hadoop.hbase.thrift.TestThriftServerCmdLine: Shutting down
  org.apache.hadoop.hbase.thrift.TestThriftServer: Shutting down
  loadTest[0](org.apache.hadoop.hbase.io.encoding.TestLoadAndSwitchEncodeOnDisk): Shutting
down
  org.apache.hadoop.hbase.io.encoding.TestChangingEncoding: Shutting down
  org.apache.hadoop.hbase.io.encoding.TestUpgradeFromHFileV1ToEncoding: Shutting down
  org.apache.hadoop.hbase.replication.TestMultiSlaveReplication: cluster1-0x13a15dc42fb0000-0x13a15dc42fb0000-0x13a15dc42fb0000-0x13a15dc42fb0000
Unexpected KeeperException creating base node
  org.apache.hadoop.hbase.replication.regionserver.TestReplicationSourceManager: KeeperErrorCode
= ConnectionLoss for /hbase/replication
  org.apache.hadoop.hbase.replication.regionserver.TestReplicationSourceManager
  org.apache.hadoop.hbase.replication.regionserver.TestReplicationSink: Shutting down
  org.apache.hadoop.hbase.TestZooKeeper: Shutting down
  org.apache.hadoop.hbase.replication.TestReplication: cluster1-0x13a15de15950000-0x13a15de15950000
Unexpected KeeperException creating base node
  org.apache.hadoop.hbase.replication.TestReplication
  org.apache.hadoop.hbase.replication.TestReplicationZookeeper: KeeperErrorCode = ConnectionLoss
for /hbase/replication/peers
  testBootRegionServerFirst(org.apache.hadoop.hbase.TestClusterBootOrder): Failed construction
of Master: class org.apache.hadoop.hbase.master.HMasterKeeperErrorCode = ConnectionLoss for
/hbase
  testBootMasterFirst(org.apache.hadoop.hbase.TestClusterBootOrder): Failed construction of
Master: class org.apache.hadoop.hbase.master.HMasterKeeperErrorCode = ConnectionLoss for /hbase
  testCyclicReplication(org.apache.hadoop.hbase.replication.TestMasterReplication): cluster1-0x13a15dc99c10000-0x13a15dc99c10000-0x13a15dc99c10000-0x13a15dc99c10000
Unexpected KeeperException creating base node
  testSimplePutDelete(org.apache.hadoop.hbase.replication.TestMasterReplication): cluster1-0x13a15de43b90000-0x13a15de43b90000-0x13a15de43b90000-0x13a15de43b90000
Unexpected KeeperException creating base node
  testMiniCluster(org.apache.hadoop.hbase.TestHBaseTestingUtility): Shutting down
  testMultipleStartStop(org.apache.hadoop.hbase.TestHBaseTestingUtility): Shutting down
  testMultiClusters(org.apache.hadoop.hbase.TestHBaseTestingUtility): Shutting down

Tests run: 616, Failures: 1, Errors: 195, Skipped: 2

[INFO]                                                                         
[INFO] ------------------------------------------------------------------------
[INFO] Skipping HBase
[INFO] This project has been banned from the build due to previous failures.
[INFO] ------------------------------------------------------------------------
[INFO]                                                                         
[INFO] ------------------------------------------------------------------------
[INFO] Skipping HBase
[INFO] This project has been banned from the build due to previous failures.
[INFO] ------------------------------------------------------------------------
[INFO] ------------------------------------------------------------------------
[INFO] Reactor Summary:
[INFO] 
[INFO] HBase ............................................. SUCCESS [3.598s]
[INFO] HBase - Common .................................... SUCCESS [10.300s]
[INFO] HBase - Hadoop Compatibility ...................... SUCCESS [0.718s]
[INFO] HBase - Hadoop One Compatibility .................. SUCCESS [1.342s]
[INFO] HBase - Server .................................... FAILURE [1:36:07.888s]
[INFO] HBase - Hadoop Two Compatibility .................. SKIPPED
[INFO] HBase - Integration Tests ......................... SKIPPED
[INFO] ------------------------------------------------------------------------
[INFO] BUILD FAILURE
[INFO] ------------------------------------------------------------------------
[INFO] Total time: 1:36:24.565s
[INFO] Finished at: Sun Sep 30 06:36:34 UTC 2012
[INFO] Final Memory: 61M/1172M
[INFO] ------------------------------------------------------------------------
[ERROR] Failed to execute goal org.apache.maven.plugins:maven-surefire-plugin:2.12-TRUNK-HBASE-2:test
(secondPartTestsExecution) on project hbase-server: Failure or timeout -> [Help 1]
[ERROR] 
[ERROR] To see the full stack trace of the errors, re-run Maven with the -e switch.
[ERROR] Re-run Maven using the -X switch to enable full debug logging.
[ERROR] 
[ERROR] For more information about the errors and possible solutions, please read the following
articles:
[ERROR] [Help 1] http://cwiki.apache.org/confluence/display/MAVEN/MojoExecutionException
[ERROR] 
[ERROR] After correcting the problems, you can resume the build with the command
[ERROR]   mvn <goals> -rf :hbase-server
Build step 'Invoke top-level Maven targets' marked build as failure
Archiving artifacts
Recording test results
Updating HBASE-6890

Mime
View raw message