hbase-dev mailing list archives

Site index · List index
Message view « Date » · « Thread »
Top « Date » · « Thread »
From Apache Jenkins Server <jenk...@builds.apache.org>
Subject Build failed in Jenkins: HBase-TRUNK-on-Hadoop-2.0.0 #199
Date Sat, 29 Sep 2012 11:19:01 GMT
See <https://builds.apache.org/job/HBase-TRUNK-on-Hadoop-2.0.0/199/changes>

Changes:

[ramkrishna] HBASE-6853 IllegalArgument Exception is thrown when an empty region is spliitted(Priya)

[stack] HBASE-6871 HFileBlockIndex Write Error in HFile V2 due to incorrect split into intermediate
index blocks

[stack] HBASE-6476 Replace all occurrances of System.currentTimeMillis() with EnvironmentEdge
equivalent

------------------------------------------
[...truncated 9742 lines...]
]
[DEBUG]   (s) reportFormat = brief
[DEBUG]   (s) reportsDirectory = <https://builds.apache.org/job/HBase-TRUNK-on-Hadoop-2.0.0/ws/trunk/hbase-common/target/surefire-reports>
[DEBUG]   (s) runOrder = filesystem
[DEBUG]   (s) session = org.apache.maven.execution.MavenSession@8201a7
[DEBUG]   (s) skip = false
[DEBUG]   (s) skipTests = false
[DEBUG]   (s) testClassesDirectory = <https://builds.apache.org/job/HBase-TRUNK-on-Hadoop-2.0.0/ws/trunk/hbase-common/target/test-classes>
[DEBUG]   (s) testFailureIgnore = false
[DEBUG]   (s) testNGArtifactName = org.testng:testng
[DEBUG]   (s) testSourceDirectory = <https://builds.apache.org/job/HBase-TRUNK-on-Hadoop-2.0.0/ws/trunk/hbase-common/src/test/java>
[DEBUG]   (s) threadCount = 1
[DEBUG]   (s) trimStackTrace = true
[DEBUG]   (s) useFile = true
[DEBUG]   (s) useManifestOnlyJar = true
[DEBUG]   (s) useSystemClassLoader = true
[DEBUG]   (s) useUnlimitedThreads = false
[DEBUG]   (s) workingDirectory = <https://builds.apache.org/job/HBase-TRUNK-on-Hadoop-2.0.0/ws/trunk/hbase-common>
[DEBUG] -- end configuration --
[INFO] Surefire report directory: <https://builds.apache.org/job/HBase-TRUNK-on-Hadoop-2.0.0/ws/trunk/hbase-common/target/surefire-reports>
[INFO] Using configured provider org.apache.maven.surefire.junitcore.JUnitCoreProvider
[DEBUG] dummy:dummy:jar:1.0 (selected for null)
[DEBUG]   org.apache.maven.surefire:surefire-booter:jar:2.12-TRUNK-HBASE-2:compile (selected
for compile)
[DEBUG]     org.apache.maven.surefire:surefire-api:jar:2.12-TRUNK-HBASE-2:compile (selected
for compile)
[DEBUG] Adding to surefire booter test classpath: /home/hudson/.m2/repository/org/apache/maven/surefire/surefire-booter/2.12-TRUNK-HBASE-2/surefire-booter-2.12-TRUNK-HBASE-2.jar
Scope: compile
[DEBUG] Adding to surefire booter test classpath: /home/hudson/.m2/repository/org/apache/maven/surefire/surefire-api/2.12-TRUNK-HBASE-2/surefire-api-2.12-TRUNK-HBASE-2.jar
Scope: compile
[DEBUG] Setting system property [hadoop.profile]=[2.0]
[DEBUG] Setting system property [user.dir]=[<https://builds.apache.org/job/HBase-TRUNK-on-Hadoop-2.0.0/ws/trunk/hbase-common]>
[DEBUG] Setting system property [localRepository]=[/home/hudson/.m2/repository]
[DEBUG] Setting system property [basedir]=[<https://builds.apache.org/job/HBase-TRUNK-on-Hadoop-2.0.0/ws/trunk/hbase-common]>
[DEBUG] Setting system property [maven.test.redirectTestOutputToFile]=[true]
[DEBUG] Using JVM: /home/hudson/tools/java/jdk1.6.0_27-32/jre/bin/java
[DEBUG] dummy:dummy:jar:1.0 (selected for null)
[DEBUG]   org.apache.maven.surefire:surefire-junit47:jar:2.12-TRUNK-HBASE-2:test (selected
for test)
[DEBUG]     org.apache.maven.surefire:common-junit48:jar:2.12-TRUNK-HBASE-2:test (selected
for test)
[DEBUG]       org.apache.maven.surefire:common-junit4:jar:2.12-TRUNK-HBASE-2:test (selected
for test)
[DEBUG]         org.apache.maven.surefire:common-junit3:jar:2.12-TRUNK-HBASE-2:test (selected
for test)
[DEBUG]           org.apache.maven.surefire:surefire-api:jar:2.12-TRUNK-HBASE-2:test (selected
for test)
[DEBUG]         org.apache.maven.surefire:surefire-api:jar:2.12-TRUNK-HBASE-2:test (selected
for test)
[DEBUG]       org.apache.maven.surefire:surefire-api:jar:2.12-TRUNK-HBASE-2:test (selected
for test)
[DEBUG]     org.apache.maven.surefire:surefire-api:jar:2.12-TRUNK-HBASE-2:test (selected for
test)
[DEBUG] Adding to surefire test classpath: /home/hudson/.m2/repository/org/apache/maven/surefire/surefire-junit47/2.12-TRUNK-HBASE-2/surefire-junit47-2.12-TRUNK-HBASE-2.jar
Scope: test
[DEBUG] Adding to surefire test classpath: /home/hudson/.m2/repository/org/apache/maven/surefire/common-junit48/2.12-TRUNK-HBASE-2/common-junit48-2.12-TRUNK-HBASE-2.jar
Scope: test
[DEBUG] Adding to surefire test classpath: /home/hudson/.m2/repository/org/apache/maven/surefire/common-junit4/2.12-TRUNK-HBASE-2/common-junit4-2.12-TRUNK-HBASE-2.jar
Scope: test
[DEBUG] Adding to surefire test classpath: /home/hudson/.m2/repository/org/apache/maven/surefire/common-junit3/2.12-TRUNK-HBASE-2/common-junit3-2.12-TRUNK-HBASE-2.jar
Scope: test
[DEBUG] Adding to surefire test classpath: /home/hudson/.m2/repository/org/apache/maven/surefire/surefire-api/2.12-TRUNK-HBASE-2/surefire-api-2.12-TRUNK-HBASE-2.jar
Scope: test
[DEBUG] test classpath classpath:
[DEBUG]   <https://builds.apache.org/job/HBase-TRUNK-on-Hadoop-2.0.0/ws/trunk/hbase-common/target/test-classes>
[DEBUG]   <https://builds.apache.org/job/HBase-TRUNK-on-Hadoop-2.0.0/ws/trunk/hbase-common/target/classes>
[DEBUG]   /home/hudson/.m2/repository/com/google/guava/guava/12.0.1/guava-12.0.1.jar
[DEBUG]   /home/hudson/.m2/repository/com/google/code/findbugs/jsr305/1.3.9/jsr305-1.3.9.jar
[DEBUG]   /home/hudson/.m2/repository/commons-logging/commons-logging/1.1.1/commons-logging-1.1.1.jar
[DEBUG]   /home/hudson/.m2/repository/org/apache/hadoop/hadoop-client/2.0.1-alpha/hadoop-client-2.0.1-alpha.jar
[DEBUG]   /home/hudson/.m2/repository/org/apache/hadoop/hadoop-common/2.0.1-alpha/hadoop-common-2.0.1-alpha.jar
[DEBUG]   /home/hudson/.m2/repository/org/apache/commons/commons-math/2.1/commons-math-2.1.jar
[DEBUG]   /home/hudson/.m2/repository/xmlenc/xmlenc/0.52/xmlenc-0.52.jar
[DEBUG]   /home/hudson/.m2/repository/commons-codec/commons-codec/1.7/commons-codec-1.7.jar
[DEBUG]   /home/hudson/.m2/repository/commons-net/commons-net/3.1/commons-net-3.1.jar
[DEBUG]   /home/hudson/.m2/repository/commons-io/commons-io/2.4/commons-io-2.4.jar
[DEBUG]   /home/hudson/.m2/repository/asm/asm/3.2/asm-3.2.jar
[DEBUG]   /home/hudson/.m2/repository/commons-el/commons-el/1.0/commons-el-1.0.jar
[DEBUG]   /home/hudson/.m2/repository/log4j/log4j/1.2.17/log4j-1.2.17.jar
[DEBUG]   /home/hudson/.m2/repository/commons-lang/commons-lang/2.6/commons-lang-2.6.jar
[DEBUG]   /home/hudson/.m2/repository/commons-collections/commons-collections/3.2.1/commons-collections-3.2.1.jar
[DEBUG]   /home/hudson/.m2/repository/commons-configuration/commons-configuration/1.6/commons-configuration-1.6.jar
[DEBUG]   /home/hudson/.m2/repository/commons-digester/commons-digester/1.8/commons-digester-1.8.jar
[DEBUG]   /home/hudson/.m2/repository/commons-beanutils/commons-beanutils/1.7.0/commons-beanutils-1.7.0.jar
[DEBUG]   /home/hudson/.m2/repository/commons-beanutils/commons-beanutils-core/1.8.0/commons-beanutils-core-1.8.0.jar
[DEBUG]   /home/hudson/.m2/repository/org/slf4j/slf4j-api/1.6.1/slf4j-api-1.6.1.jar
[DEBUG]   /home/hudson/.m2/repository/org/slf4j/slf4j-log4j12/1.6.1/slf4j-log4j12-1.6.1.jar
[DEBUG]   /home/hudson/.m2/repository/oro/oro/2.0.8/oro-2.0.8.jar
[DEBUG]   /home/hudson/.m2/repository/org/codehaus/jackson/jackson-mapper-asl/1.8.8/jackson-mapper-asl-1.8.8.jar
[DEBUG]   /home/hudson/.m2/repository/org/codehaus/jackson/jackson-core-asl/1.8.8/jackson-core-asl-1.8.8.jar
[DEBUG]   /home/hudson/.m2/repository/com/google/protobuf/protobuf-java/2.4.1/protobuf-java-2.4.1.jar
[DEBUG]   /home/hudson/.m2/repository/org/apache/hadoop/hadoop-auth/2.0.1-alpha/hadoop-auth-2.0.1-alpha.jar
[DEBUG]   /home/hudson/.m2/repository/com/googlecode/json-simple/json-simple/1.1/json-simple-1.1.jar
[DEBUG]   /home/hudson/.m2/repository/com/jcraft/jsch/0.1.42/jsch-0.1.42.jar
[DEBUG]   /home/hudson/.m2/repository/org/apache/zookeeper/zookeeper/3.4.4/zookeeper-3.4.4.jar
[DEBUG]   /home/hudson/.m2/repository/org/apache/hadoop/hadoop-hdfs/2.0.1-alpha/hadoop-hdfs-2.0.1-alpha.jar
[DEBUG]   /home/hudson/.m2/repository/org/apache/hadoop/hadoop-mapreduce-client-app/2.0.1-alpha/hadoop-mapreduce-client-app-2.0.1-alpha.jar
[DEBUG]   /home/hudson/.m2/repository/org/apache/hadoop/hadoop-mapreduce-client-common/2.0.1-alpha/hadoop-mapreduce-client-common-2.0.1-alpha.jar
[DEBUG]   /home/hudson/.m2/repository/org/apache/hadoop/hadoop-mapreduce-client-shuffle/2.0.1-alpha/hadoop-mapreduce-client-shuffle-2.0.1-alpha.jar
[DEBUG]   /home/hudson/.m2/repository/org/jboss/netty/netty/3.2.3.Final/netty-3.2.3.Final.jar
[DEBUG]   /home/hudson/.m2/repository/org/apache/hadoop/hadoop-yarn-api/2.0.1-alpha/hadoop-yarn-api-2.0.1-alpha.jar
[DEBUG]   /home/hudson/.m2/repository/org/apache/hadoop/hadoop-mapreduce-client-core/2.0.1-alpha/hadoop-mapreduce-client-core-2.0.1-alpha.jar
[DEBUG]   /home/hudson/.m2/repository/org/apache/hadoop/hadoop-yarn-common/2.0.1-alpha/hadoop-yarn-common-2.0.1-alpha.jar
[DEBUG]   /home/hudson/.m2/repository/org/apache/hadoop/hadoop-mapreduce-client-jobclient/2.0.1-alpha/hadoop-mapreduce-client-jobclient-2.0.1-alpha.jar
[DEBUG]   /home/hudson/tools/java/jdk1.6.0_27-32/jre/../lib/tools.jar
[DEBUG]   /home/hudson/.m2/repository/org/apache/hadoop/hadoop-annotations/2.0.1-alpha/hadoop-annotations-2.0.1-alpha.jar
[DEBUG]   /home/hudson/.m2/repository/jdiff/jdiff/1.0.9/jdiff-1.0.9.jar
[DEBUG]   /home/hudson/.m2/repository/org/apache/hadoop/hadoop-minicluster/2.0.1-alpha/hadoop-minicluster-2.0.1-alpha.jar
[DEBUG]   /home/hudson/.m2/repository/org/apache/hadoop/hadoop-common/2.0.1-alpha/hadoop-common-2.0.1-alpha-tests.jar
[DEBUG]   /home/hudson/.m2/repository/commons-cli/commons-cli/1.2/commons-cli-1.2.jar
[DEBUG]   /home/hudson/.m2/repository/commons-httpclient/commons-httpclient/3.1/commons-httpclient-3.1.jar
[DEBUG]   /home/hudson/.m2/repository/javax/servlet/servlet-api/2.5/servlet-api-2.5.jar
[DEBUG]   /home/hudson/.m2/repository/org/mortbay/jetty/jetty/6.1.26/jetty-6.1.26.jar
[DEBUG]   /home/hudson/.m2/repository/org/mortbay/jetty/jetty-util/6.1.26/jetty-util-6.1.26.jar
[DEBUG]   /home/hudson/.m2/repository/com/sun/jersey/jersey-core/1.8/jersey-core-1.8.jar
[DEBUG]   /home/hudson/.m2/repository/com/sun/jersey/jersey-json/1.8/jersey-json-1.8.jar
[DEBUG]   /home/hudson/.m2/repository/org/codehaus/jettison/jettison/1.3.1/jettison-1.3.1.jar
[DEBUG]   /home/hudson/.m2/repository/stax/stax-api/1.0.1/stax-api-1.0.1.jar
[DEBUG]   /home/hudson/.m2/repository/com/sun/xml/bind/jaxb-impl/2.2.3-1/jaxb-impl-2.2.3-1.jar
[DEBUG]   /home/hudson/.m2/repository/javax/xml/bind/jaxb-api/2.1/jaxb-api-2.1.jar
[DEBUG]   /home/hudson/.m2/repository/javax/activation/activation/1.1/activation-1.1.jar
[DEBUG]   /home/hudson/.m2/repository/org/codehaus/jackson/jackson-jaxrs/1.8.8/jackson-jaxrs-1.8.8.jar
[DEBUG]   /home/hudson/.m2/repository/org/codehaus/jackson/jackson-xc/1.8.8/jackson-xc-1.8.8.jar
[DEBUG]   /home/hudson/.m2/repository/com/sun/jersey/jersey-server/1.8/jersey-server-1.8.jar
[DEBUG]   /home/hudson/.m2/repository/tomcat/jasper-compiler/5.5.23/jasper-compiler-5.5.23.jar
[DEBUG]   /home/hudson/.m2/repository/tomcat/jasper-runtime/5.5.23/jasper-runtime-5.5.23.jar
[DEBUG]   /home/hudson/.m2/repository/javax/servlet/jsp/jsp-api/2.1/jsp-api-2.1.jar
[DEBUG]   /home/hudson/.m2/repository/commons-logging/commons-logging-api/1.1/commons-logging-api-1.1.jar
[DEBUG]   /home/hudson/.m2/repository/net/java/dev/jets3t/jets3t/0.6.1/jets3t-0.6.1.jar
[DEBUG]   /home/hudson/.m2/repository/org/eclipse/jdt/core/3.1.1/core-3.1.1.jar
[DEBUG]   /home/hudson/.m2/repository/org/aspectj/aspectjrt/1.6.5/aspectjrt-1.6.5.jar
[DEBUG]   /home/hudson/.m2/repository/org/apache/avro/avro/1.5.3/avro-1.5.3.jar
[DEBUG]   /home/hudson/.m2/repository/com/thoughtworks/paranamer/paranamer/2.3/paranamer-2.3.jar
[DEBUG]   /home/hudson/.m2/repository/org/xerial/snappy/snappy-java/1.0.3.2/snappy-java-1.0.3.2.jar
[DEBUG]   /home/hudson/.m2/repository/net/sf/kosmosfs/kfs/0.3/kfs-0.3.jar
[DEBUG]   /home/hudson/.m2/repository/org/apache/hadoop/hadoop-hdfs/2.0.1-alpha/hadoop-hdfs-2.0.1-alpha-tests.jar
[DEBUG]   /home/hudson/.m2/repository/commons-daemon/commons-daemon/1.0.3/commons-daemon-1.0.3.jar
[DEBUG]   /home/hudson/.m2/repository/org/apache/hadoop/hadoop-yarn-server-tests/2.0.1-alpha/hadoop-yarn-server-tests-2.0.1-alpha-tests.jar
[DEBUG]   /home/hudson/.m2/repository/org/apache/hadoop/hadoop-yarn-server-common/2.0.1-alpha/hadoop-yarn-server-common-2.0.1-alpha.jar
[DEBUG]   /home/hudson/.m2/repository/org/apache/hadoop/hadoop-yarn-server-nodemanager/2.0.1-alpha/hadoop-yarn-server-nodemanager-2.0.1-alpha.jar
[DEBUG]   /home/hudson/.m2/repository/org/apache/hadoop/hadoop-yarn-server-resourcemanager/2.0.1-alpha/hadoop-yarn-server-resourcemanager-2.0.1-alpha.jar
[DEBUG]   /home/hudson/.m2/repository/org/apache/hadoop/hadoop-yarn-server-web-proxy/2.0.1-alpha/hadoop-yarn-server-web-proxy-2.0.1-alpha.jar
[DEBUG]   /home/hudson/.m2/repository/com/google/inject/extensions/guice-servlet/3.0/guice-servlet-3.0.jar
[DEBUG]   /home/hudson/.m2/repository/com/google/inject/guice/3.0/guice-3.0.jar
[DEBUG]   /home/hudson/.m2/repository/javax/inject/javax.inject/1/javax.inject-1.jar
[DEBUG]   /home/hudson/.m2/repository/aopalliance/aopalliance/1.0/aopalliance-1.0.jar
[DEBUG]   /home/hudson/.m2/repository/com/sun/jersey/jersey-test-framework/jersey-test-framework-grizzly2/1.8/jersey-test-framework-grizzly2-1.8.jar
[DEBUG]   /home/hudson/.m2/repository/com/sun/jersey/jersey-test-framework/jersey-test-framework-core/1.8/jersey-test-framework-core-1.8.jar
[DEBUG]   /home/hudson/.m2/repository/org/glassfish/javax.servlet/3.0/javax.servlet-3.0.jar
[DEBUG]   /home/hudson/.m2/repository/com/sun/jersey/jersey-client/1.8/jersey-client-1.8.jar
[DEBUG]   /home/hudson/.m2/repository/com/sun/jersey/jersey-grizzly2/1.8/jersey-grizzly2-1.8.jar
[DEBUG]   /home/hudson/.m2/repository/org/glassfish/grizzly/grizzly-http/2.1.1/grizzly-http-2.1.1.jar
[DEBUG]   /home/hudson/.m2/repository/org/glassfish/grizzly/grizzly-framework/2.1.1/grizzly-framework-2.1.1.jar
[DEBUG]   /home/hudson/.m2/repository/org/glassfish/gmbal/gmbal-api-only/3.0.0-b023/gmbal-api-only-3.0.0-b023.jar
[DEBUG]   /home/hudson/.m2/repository/org/glassfish/external/management-api/3.0.0-b012/management-api-3.0.0-b012.jar
[DEBUG]   /home/hudson/.m2/repository/org/glassfish/grizzly/grizzly-http-server/2.1.1/grizzly-http-server-2.1.1.jar
[DEBUG]   /home/hudson/.m2/repository/org/glassfish/grizzly/grizzly-rcm/2.1.1/grizzly-rcm-2.1.1.jar
[DEBUG]   /home/hudson/.m2/repository/org/glassfish/grizzly/grizzly-http-servlet/2.1.1/grizzly-http-servlet-2.1.1.jar
[DEBUG]   /home/hudson/.m2/repository/org/glassfish/grizzly/grizzly-framework/2.1.1/grizzly-framework-2.1.1-tests.jar
[DEBUG]   /home/hudson/.m2/repository/com/sun/jersey/contribs/jersey-guice/1.8/jersey-guice-1.8.jar
[DEBUG]   /home/hudson/.m2/repository/org/apache/hadoop/hadoop-mapreduce-client-jobclient/2.0.1-alpha/hadoop-mapreduce-client-jobclient-2.0.1-alpha-tests.jar
[DEBUG]   /home/hudson/.m2/repository/org/apache/hadoop/hadoop-mapreduce-client-hs/2.0.1-alpha/hadoop-mapreduce-client-hs-2.0.1-alpha.jar
[DEBUG]   /home/hudson/.m2/repository/junit/junit/4.10-HBASE-1/junit-4.10-HBASE-1.jar
[DEBUG]   /home/hudson/.m2/repository/org/mockito/mockito-all/1.9.0/mockito-all-1.9.0.jar
[DEBUG] provider classpath classpath:
[DEBUG]   /home/hudson/.m2/repository/org/apache/maven/surefire/surefire-junit47/2.12-TRUNK-HBASE-2/surefire-junit47-2.12-TRUNK-HBASE-2.jar
[DEBUG]   /home/hudson/.m2/repository/org/apache/maven/surefire/common-junit48/2.12-TRUNK-HBASE-2/common-junit48-2.12-TRUNK-HBASE-2.jar
[DEBUG]   /home/hudson/.m2/repository/org/apache/maven/surefire/common-junit4/2.12-TRUNK-HBASE-2/common-junit4-2.12-TRUNK-HBASE-2.jar
[DEBUG]   /home/hudson/.m2/repository/org/apache/maven/surefire/common-junit3/2.12-TRUNK-HBASE-2/common-junit3-2.12-TRUNK-HBASE-2.jar
[DEBUG]   /home/hudson/.m2/repository/org/apache/maven/surefire/surefire-api/2.12-TRUNK-HBASE-2/surefire-api-2.12-TRUNK-HBASE-2.jar

-------------------------------------------------------
 T E S T S
-------------------------------------------------------
Forking command line: /bin/sh -c cd <https://builds.apache.org/job/HBase-TRUNK-on-Hadoop-2.0.0/ws/trunk/hbase-common>
&& /home/hudson/tools/java/jdk1.6.0_27-32/jre/bin/java -enableassertions -Xmx1900m
-Djava.security.egd=file:/dev/./urandom -jar <https://builds.apache.org/job/HBase-TRUNK-on-Hadoop-2.0.0/ws/trunk/hbase-common/target/surefire/surefirebooter8483955422564128797.jar>
<https://builds.apache.org/job/HBase-TRUNK-on-Hadoop-2.0.0/ws/trunk/hbase-common/target/surefire/surefire4972166226730439716tmp>
<https://builds.apache.org/job/HBase-TRUNK-on-Hadoop-2.0.0/ws/trunk/hbase-common/target/surefire/surefire_08665683883315229361tmp>
Running org.apache.hadoop.hbase.TestKeyValue
Tests run: 16, Failures: 0, Errors: 0, Skipped: 0, Time elapsed: 0.041 sec
Running org.apache.hadoop.hbase.util.TestLoadTestKVGenerator
Tests run: 3, Failures: 0, Errors: 0, Skipped: 0, Time elapsed: 0.639 sec
Running org.apache.hadoop.hbase.util.TestEnvironmentEdgeManager
Tests run: 2, Failures: 0, Errors: 0, Skipped: 0, Time elapsed: 0.219 sec
Running org.apache.hadoop.hbase.util.TestThreads
Tests run: 1, Failures: 0, Errors: 1, Skipped: 0, Time elapsed: 7.003 sec <<< FAILURE!
Running org.apache.hadoop.hbase.util.TestBytes
Tests run: 15, Failures: 0, Errors: 0, Skipped: 0, Time elapsed: 7.003 sec

Results :

Tests in error: 
  testSleepWithoutInterrupt(org.apache.hadoop.hbase.util.TestThreads): test timed out after
6000 milliseconds

Tests run: 37, Failures: 0, Errors: 1, Skipped: 0

[INFO]                                                                         
[INFO] ------------------------------------------------------------------------
[INFO] Skipping HBase
[INFO] This project has been banned from the build due to previous failures.
[INFO] ------------------------------------------------------------------------
[INFO] ------------------------------------------------------------------------
[INFO] Reactor Summary:
[INFO] 
[INFO] HBase ............................................. SUCCESS [8.453s]
[INFO] HBase - Common .................................... FAILURE [42.623s]
[INFO] HBase - Hadoop Compatibility ...................... SKIPPED
[INFO] HBase - Hadoop Two Compatibility .................. SKIPPED
[INFO] HBase - Server .................................... SKIPPED
[INFO] HBase - Hadoop One Compatibility .................. SKIPPED
[INFO] HBase - Integration Tests ......................... SKIPPED
[INFO] ------------------------------------------------------------------------
[INFO] BUILD FAILURE
[INFO] ------------------------------------------------------------------------
[INFO] Total time: 56.849s
[INFO] Finished at: Sat Sep 29 11:18:55 UTC 2012
[INFO] Final Memory: 36M/181M
[INFO] ------------------------------------------------------------------------
[ERROR] Failed to execute goal org.apache.maven.plugins:maven-surefire-plugin:2.12-TRUNK-HBASE-2:test
(default-test) on project hbase-common: There are test failures.
[ERROR] 
[ERROR] Please refer to <https://builds.apache.org/job/HBase-TRUNK-on-Hadoop-2.0.0/ws/trunk/hbase-common/target/surefire-reports>
for the individual test results.
[ERROR] -> [Help 1]
org.apache.maven.lifecycle.LifecycleExecutionException: Failed to execute goal org.apache.maven.plugins:maven-surefire-plugin:2.12-TRUNK-HBASE-2:test
(default-test) on project hbase-common: There are test failures.

Please refer to <https://builds.apache.org/job/HBase-TRUNK-on-Hadoop-2.0.0/ws/trunk/hbase-common/target/surefire-reports>
for the individual test results.
	at org.apache.maven.lifecycle.internal.MojoExecutor.execute(MojoExecutor.java:213)
	at org.apache.maven.lifecycle.internal.MojoExecutor.execute(MojoExecutor.java:153)
	at org.apache.maven.lifecycle.internal.MojoExecutor.execute(MojoExecutor.java:145)
	at org.apache.maven.lifecycle.internal.LifecycleModuleBuilder.buildProject(LifecycleModuleBuilder.java:84)
	at org.apache.maven.lifecycle.internal.LifecycleModuleBuilder.buildProject(LifecycleModuleBuilder.java:59)
	at org.apache.maven.lifecycle.internal.LifecycleStarter.singleThreadedBuild(LifecycleStarter.java:183)
	at org.apache.maven.lifecycle.internal.LifecycleStarter.execute(LifecycleStarter.java:161)
	at org.apache.maven.DefaultMaven.doExecute(DefaultMaven.java:319)
	at org.apache.maven.DefaultMaven.execute(DefaultMaven.java:156)
	at org.apache.maven.cli.MavenCli.execute(MavenCli.java:537)
	at org.apache.maven.cli.MavenCli.doMain(MavenCli.java:196)
	at org.apache.maven.cli.MavenCli.main(MavenCli.java:141)
	at sun.reflect.NativeMethodAccessorImpl.invoke0(Native Method)
	at sun.reflect.NativeMethodAccessorImpl.invoke(NativeMethodAccessorImpl.java:39)
	at sun.reflect.DelegatingMethodAccessorImpl.invoke(DelegatingMethodAccessorImpl.java:25)
	at java.lang.reflect.Method.invoke(Method.java:597)
	at org.codehaus.plexus.classworlds.launcher.Launcher.launchEnhanced(Launcher.java:290)
	at org.codehaus.plexus.classworlds.launcher.Launcher.launch(Launcher.java:230)
	at org.codehaus.plexus.classworlds.launcher.Launcher.mainWithExitCode(Launcher.java:409)
	at org.codehaus.plexus.classworlds.launcher.Launcher.main(Launcher.java:352)
Caused by: org.apache.maven.plugin.MojoFailureException: There are test failures.

Please refer to <https://builds.apache.org/job/HBase-TRUNK-on-Hadoop-2.0.0/ws/trunk/hbase-common/target/surefire-reports>
for the individual test results.
	at org.apache.maven.plugin.surefire.SurefireHelper.reportExecution(SurefireHelper.java:87)
	at org.apache.maven.plugin.surefire.SurefirePlugin.writeSummary(SurefirePlugin.java:651)
	at org.apache.maven.plugin.surefire.SurefirePlugin.handleSummary(SurefirePlugin.java:625)
	at org.apache.maven.plugin.surefire.AbstractSurefireMojo.executeAfterPreconditionsChecked(AbstractSurefireMojo.java:137)
	at org.apache.maven.plugin.surefire.AbstractSurefireMojo.execute(AbstractSurefireMojo.java:98)
	at org.apache.maven.plugin.DefaultBuildPluginManager.executeMojo(DefaultBuildPluginManager.java:101)
	at org.apache.maven.lifecycle.internal.MojoExecutor.execute(MojoExecutor.java:209)
	... 19 more
[ERROR] 
[ERROR] 
[ERROR] For more information about the errors and possible solutions, please read the following
articles:
[ERROR] [Help 1] http://cwiki.apache.org/confluence/display/MAVEN/MojoFailureException
[ERROR] 
[ERROR] After correcting the problems, you can resume the build with the command
[ERROR]   mvn <goals> -rf :hbase-common
Build step 'Invoke top-level Maven targets' marked build as failure
Archiving artifacts
Recording test results
Updating HBASE-6476
Updating HBASE-6871
Updating HBASE-6853

Mime
View raw message