hbase-dev mailing list archives

Site index · List index
Message view « Date » · « Thread »
Top « Date » · « Thread »
From Apache Jenkins Server <jenk...@builds.apache.org>
Subject Build failed in Jenkins: HBase-TRUNK #3368
Date Fri, 21 Sep 2012 22:12:58 GMT
See <https://builds.apache.org/job/HBase-TRUNK/3368/changes>

Changes:

[stack] HBASE-6858 Fix the incorrect BADVERSION checking in the recoverable zookeeper

[stack] Added component owners role description and a section on our patch +1'ing policy

[jdcryans] HBASE-6860  [replication] HBASE-6550 is too aggressive, DDOSes .META.

------------------------------------------
[...truncated 2067 lines...]
[INFO] --- maven-resources-plugin:2.5:testResources (default-testResources) @ hbase-hadoop-compat
---
[debug] execute contextualize
[INFO] Using 'UTF-8' encoding to copy filtered resources.
[INFO] skip non existing resourceDirectory <https://builds.apache.org/job/HBase-TRUNK/ws/trunk/hbase-hadoop-compat/src/test/resources>
[INFO] Copying 3 resources
[INFO] 
[INFO] --- maven-compiler-plugin:2.5.1:testCompile (default-testCompile) @ hbase-hadoop-compat
---
[INFO] Compiling 6 source files to <https://builds.apache.org/job/HBase-TRUNK/ws/trunk/hbase-hadoop-compat/target/test-classes>
[INFO] 
[INFO] --- maven-surefire-plugin:2.12-TRUNK-HBASE-2:test (default-test) @ hbase-hadoop-compat
---
[INFO] Surefire report directory: <https://builds.apache.org/job/HBase-TRUNK/ws/trunk/hbase-hadoop-compat/target/surefire-reports>
[INFO] Using configured provider org.apache.maven.surefire.junitcore.JUnitCoreProvider

-------------------------------------------------------
 T E S T S
-------------------------------------------------------
Running org.apache.hadoop.hbase.rest.metrics.TestRESTMetricsSource
Tests run: 1, Failures: 0, Errors: 0, Skipped: 0, Time elapsed: 0.027 sec
Running org.apache.hadoop.hbase.replication.regionserver.metrics.TestReplicationMetricsSourceFactory
Tests run: 1, Failures: 0, Errors: 0, Skipped: 0, Time elapsed: 0.002 sec
Running org.apache.hadoop.hbase.thrift.metrics.TestThriftServerMetricsSourceFactory
Tests run: 1, Failures: 0, Errors: 0, Skipped: 0, Time elapsed: 0.002 sec
Running org.apache.hadoop.hbase.master.metrics.TestMasterMetricsSourceFactory
Tests run: 1, Failures: 0, Errors: 0, Skipped: 0, Time elapsed: 0.043 sec

Results :

Tests run: 4, Failures: 0, Errors: 0, Skipped: 0

[INFO] 
[INFO] --- maven-surefire-plugin:2.12-TRUNK-HBASE-2:test (secondPartTestsExecution) @ hbase-hadoop-compat
---
[INFO] Tests are skipped.
[INFO] 
[INFO] --- maven-jar-plugin:2.3:test-jar (default) @ hbase-hadoop-compat ---
[INFO] Building jar: <https://builds.apache.org/job/HBase-TRUNK/ws/trunk/hbase-hadoop-compat/target/hbase-hadoop-compat-0.95-SNAPSHOT-tests.jar>
[INFO] 
[INFO] --- maven-jar-plugin:2.3:jar (default-jar) @ hbase-hadoop-compat ---
[INFO] Building jar: <https://builds.apache.org/job/HBase-TRUNK/ws/trunk/hbase-hadoop-compat/target/hbase-hadoop-compat-0.95-SNAPSHOT.jar>
[INFO] 
[INFO] --- apache-rat-plugin:0.8:check (default) @ hbase-hadoop-compat ---
[INFO] Exclude: **/*.log
[INFO] Exclude: **/.*
[INFO] Exclude: **/*.tgz
[INFO] Exclude: **/*.orig
[INFO] Exclude: **/test/**
[INFO] Exclude: **/8e8ab58dcf39412da19833fcd8f687ac
[INFO] Exclude: **/.git/**
[INFO] Exclude: **/.idea/**
[INFO] Exclude: **/target/**
[INFO] Exclude: **/CHANGES.txt
[INFO] Exclude: **/generated/**
[INFO] Exclude: **/conf/*
[INFO] Exclude: **/*.avpr
[INFO] Exclude: **/*.svg
[INFO] Exclude: **/META-INF/services/**
[INFO] Exclude: **/html5shiv.js
[INFO] Exclude: **/jquery.min.js
[INFO] Exclude: **/*.vm
[INFO] Exclude: **/control
[INFO] Exclude: **/conffile
[INFO] Exclude: docs/*
[INFO] Exclude: **/src/site/resources/css/freebsd_docbook.css
[INFO]                                                                         
[INFO] ------------------------------------------------------------------------
[INFO] Building HBase - Hadoop One Compatibility 0.95-SNAPSHOT
[INFO] ------------------------------------------------------------------------
[INFO] 
[INFO] --- maven-remote-resources-plugin:1.1:process (default) @ hbase-hadoop1-compat ---
[INFO] 
[INFO] --- maven-resources-plugin:2.5:resources (default-resources) @ hbase-hadoop1-compat
---
[debug] execute contextualize
[INFO] Using 'UTF-8' encoding to copy filtered resources.
[INFO] Copying 5 resources
[INFO] Copying 3 resources
[INFO] 
[INFO] --- maven-compiler-plugin:2.5.1:compile (default-compile) @ hbase-hadoop1-compat ---
[INFO] Compiling 14 source files to <https://builds.apache.org/job/HBase-TRUNK/ws/trunk/hbase-hadoop1-compat/target/classes>
[INFO] 
[INFO] --- maven-resources-plugin:2.5:testResources (default-testResources) @ hbase-hadoop1-compat
---
[debug] execute contextualize
[INFO] Using 'UTF-8' encoding to copy filtered resources.
[INFO] Copying 2 resources
[INFO] Copying 3 resources
[INFO] 
[INFO] --- maven-compiler-plugin:2.5.1:testCompile (default-testCompile) @ hbase-hadoop1-compat
---
[INFO] Compiling 7 source files to <https://builds.apache.org/job/HBase-TRUNK/ws/trunk/hbase-hadoop1-compat/target/test-classes>
[INFO] 
[INFO] --- maven-surefire-plugin:2.12-TRUNK-HBASE-2:test (default-test) @ hbase-hadoop1-compat
---
[INFO] Surefire report directory: <https://builds.apache.org/job/HBase-TRUNK/ws/trunk/hbase-hadoop1-compat/target/surefire-reports>
[INFO] Using configured provider org.apache.maven.surefire.junitcore.JUnitCoreProvider

-------------------------------------------------------
 T E S T S
-------------------------------------------------------
Running org.apache.hadoop.hbase.rest.metrics.TestRESTMetricsSourceImpl
Tests run: 1, Failures: 0, Errors: 0, Skipped: 0, Time elapsed: 0.184 sec
Running org.apache.hadoop.hbase.metrics.TestBaseMetricsSourceImplTest
Tests run: 6, Failures: 0, Errors: 0, Skipped: 0, Time elapsed: 0.003 sec
Running org.apache.hadoop.hbase.replication.regionserver.metrics.TestReplicationMetricsSourceImpl
Tests run: 1, Failures: 0, Errors: 0, Skipped: 0, Time elapsed: 0.002 sec
Running org.apache.hadoop.hbase.thrift.metrics.TestThriftServerMetricsSourceFactoryImpl
Tests run: 3, Failures: 0, Errors: 0, Skipped: 0, Time elapsed: 0.004 sec
Running org.apache.hadoop.hbase.master.metrics.TestMasterMetricsSourceImpl
Tests run: 1, Failures: 0, Errors: 0, Skipped: 0, Time elapsed: 0.214 sec

Results :

Tests run: 12, Failures: 0, Errors: 0, Skipped: 0

[INFO] 
[INFO] --- maven-surefire-plugin:2.12-TRUNK-HBASE-2:test (secondPartTestsExecution) @ hbase-hadoop1-compat
---
[INFO] Tests are skipped.
[INFO] 
[INFO] --- maven-jar-plugin:2.3:test-jar (default) @ hbase-hadoop1-compat ---
[INFO] Building jar: <https://builds.apache.org/job/HBase-TRUNK/ws/trunk/hbase-hadoop1-compat/target/hbase-hadoop1-compat-0.95-SNAPSHOT-tests.jar>
[INFO] 
[INFO] --- maven-jar-plugin:2.3:jar (default-jar) @ hbase-hadoop1-compat ---
[INFO] Building jar: <https://builds.apache.org/job/HBase-TRUNK/ws/trunk/hbase-hadoop1-compat/target/hbase-hadoop1-compat-0.95-SNAPSHOT.jar>
[INFO] 
[INFO] --- apache-rat-plugin:0.8:check (default) @ hbase-hadoop1-compat ---
[INFO] Exclude: **/*.log
[INFO] Exclude: **/.*
[INFO] Exclude: **/*.tgz
[INFO] Exclude: **/*.orig
[INFO] Exclude: **/test/**
[INFO] Exclude: **/8e8ab58dcf39412da19833fcd8f687ac
[INFO] Exclude: **/.git/**
[INFO] Exclude: **/.idea/**
[INFO] Exclude: **/target/**
[INFO] Exclude: **/CHANGES.txt
[INFO] Exclude: **/generated/**
[INFO] Exclude: **/conf/*
[INFO] Exclude: **/*.avpr
[INFO] Exclude: **/*.svg
[INFO] Exclude: **/META-INF/services/**
[INFO] Exclude: **/html5shiv.js
[INFO] Exclude: **/jquery.min.js
[INFO] Exclude: **/*.vm
[INFO] Exclude: **/control
[INFO] Exclude: **/conffile
[INFO] Exclude: docs/*
[INFO] Exclude: **/src/site/resources/css/freebsd_docbook.css
[INFO]                                                                         
[INFO] ------------------------------------------------------------------------
[INFO] Building HBase - Server 0.95-SNAPSHOT
[INFO] ------------------------------------------------------------------------
[INFO] 
[INFO] --- maven-antrun-plugin:1.6:run (generate) @ hbase-server ---
[INFO] Executing tasks

main:
    [mkdir] Created dir: <https://builds.apache.org/job/HBase-TRUNK/ws/trunk/hbase-server/target/hbase-webapps>
     [copy] Copying 14 files to <https://builds.apache.org/job/HBase-TRUNK/ws/trunk/hbase-server/target/hbase-webapps>
12/09/21 22:12:31 INFO mortbay.log: Logging to org.slf4j.impl.Log4jLoggerAdapter(org.mortbay.log)
via org.mortbay.log.Slf4jLog
    [mkdir] Created dir: <https://builds.apache.org/job/HBase-TRUNK/ws/trunk/hbase-server/target/hbase-webapps/master/WEB-INF>
    [mkdir] Created dir: <https://builds.apache.org/job/HBase-TRUNK/ws/trunk/hbase-server/target/hbase-webapps/regionserver/WEB-INF>
[INFO] Executed tasks
[INFO] 
[INFO] --- build-helper-maven-plugin:1.5:add-source (jspcSource-packageInfo-Avro-source) @
hbase-server ---
[INFO] Source directory: <https://builds.apache.org/job/HBase-TRUNK/ws/trunk/hbase-server/target/generated-jamon>
added.
[INFO] Source directory: <https://builds.apache.org/job/HBase-TRUNK/ws/trunk/hbase-server/target/generated-sources/java>
added.
[INFO] 
[INFO] --- jamon-maven-plugin:2.3.4:translate (default) @ hbase-server ---
[INFO] Translating 7 templates from <https://builds.apache.org/job/HBase-TRUNK/ws/trunk/hbase-server/src/main/jamon>
to <https://builds.apache.org/job/HBase-TRUNK/ws/trunk/hbase-server/target/generated-jamon>
[INFO] 
[INFO] --- maven-remote-resources-plugin:1.1:process (default) @ hbase-server ---
[INFO] 
[INFO] --- maven-resources-plugin:2.5:resources (default-resources) @ hbase-server ---
[debug] execute contextualize
[INFO] Using 'UTF-8' encoding to copy filtered resources.
[INFO] Copying 16 resources
[INFO] Copying 1 resource
[INFO] Copying 3 resources
[INFO] 
[INFO] --- maven-compiler-plugin:2.5.1:compile (default-compile) @ hbase-server ---
[INFO] Compiling 779 source files to <https://builds.apache.org/job/HBase-TRUNK/ws/trunk/hbase-server/target/classes>
[INFO] -------------------------------------------------------------
[ERROR] COMPILATION ERROR : 
[INFO] -------------------------------------------------------------
[ERROR] <https://builds.apache.org/job/HBase-TRUNK/ws/trunk/hbase-server/src/main/java/org/apache/hadoop/hbase/zookeeper/RecoverableZooKeeper.java>:[360,50]
cannot find symbol
symbol  : variable MAGIC_OFFSET
location: class org.apache.hadoop.hbase.zookeeper.RecoverableZooKeeper
[ERROR] <https://builds.apache.org/job/HBase-TRUNK/ws/trunk/hbase-server/src/main/java/org/apache/hadoop/hbase/zookeeper/RecoverableZooKeeper.java>:[361,43]
cannot find symbol
symbol  : variable MAGIC_OFFSET
location: class org.apache.hadoop.hbase.zookeeper.RecoverableZooKeeper
[ERROR] <https://builds.apache.org/job/HBase-TRUNK/ws/trunk/hbase-server/src/main/java/org/apache/hadoop/hbase/zookeeper/RecoverableZooKeeper.java>:[361,58]
cannot find symbol
symbol  : variable ID_OFFSET
location: class org.apache.hadoop.hbase.zookeeper.RecoverableZooKeeper
[ERROR] <https://builds.apache.org/job/HBase-TRUNK/ws/trunk/hbase-server/src/main/java/org/apache/hadoop/hbase/zookeeper/RecoverableZooKeeper.java>:[361,23]
cannot find symbol
symbol  : method compareTo(byte[],java.lang.String,int,byte[],int,int)
location: class org.apache.hadoop.hbase.util.Bytes
[INFO] 4 errors 
[INFO] -------------------------------------------------------------
[INFO]                                                                         
[INFO] ------------------------------------------------------------------------
[INFO] Skipping HBase
[INFO] This project has been banned from the build due to previous failures.
[INFO] ------------------------------------------------------------------------
[INFO]                                                                         
[INFO] ------------------------------------------------------------------------
[INFO] Skipping HBase
[INFO] This project has been banned from the build due to previous failures.
[INFO] ------------------------------------------------------------------------
[INFO] ------------------------------------------------------------------------
[INFO] Reactor Summary:
[INFO] 
[INFO] HBase ............................................. SUCCESS [4.100s]
[INFO] HBase - Common .................................... SUCCESS [4.674s]
[INFO] HBase - Hadoop Compatibility ...................... SUCCESS [0.678s]
[INFO] HBase - Hadoop One Compatibility .................. SUCCESS [1.270s]
[INFO] HBase - Server .................................... FAILURE [22.766s]
[INFO] HBase - Hadoop Two Compatibility .................. SKIPPED
[INFO] HBase - Integration Tests ......................... SKIPPED
[INFO] ------------------------------------------------------------------------
[INFO] BUILD FAILURE
[INFO] ------------------------------------------------------------------------
[INFO] Total time: 34.122s
[INFO] Finished at: Fri Sep 21 22:12:52 UTC 2012
[INFO] Final Memory: 37M/407M
[INFO] ------------------------------------------------------------------------
[ERROR] Failed to execute goal org.apache.maven.plugins:maven-compiler-plugin:2.5.1:compile
(default-compile) on project hbase-server: Compilation failure: Compilation failure:
[ERROR] <https://builds.apache.org/job/HBase-TRUNK/ws/trunk/hbase-server/src/main/java/org/apache/hadoop/hbase/zookeeper/RecoverableZooKeeper.java>:[360,50]
cannot find symbol
[ERROR] symbol  : variable MAGIC_OFFSET
[ERROR] location: class org.apache.hadoop.hbase.zookeeper.RecoverableZooKeeper
[ERROR] <https://builds.apache.org/job/HBase-TRUNK/ws/trunk/hbase-server/src/main/java/org/apache/hadoop/hbase/zookeeper/RecoverableZooKeeper.java>:[361,43]
cannot find symbol
[ERROR] symbol  : variable MAGIC_OFFSET
[ERROR] location: class org.apache.hadoop.hbase.zookeeper.RecoverableZooKeeper
[ERROR] <https://builds.apache.org/job/HBase-TRUNK/ws/trunk/hbase-server/src/main/java/org/apache/hadoop/hbase/zookeeper/RecoverableZooKeeper.java>:[361,58]
cannot find symbol
[ERROR] symbol  : variable ID_OFFSET
[ERROR] location: class org.apache.hadoop.hbase.zookeeper.RecoverableZooKeeper
[ERROR] <https://builds.apache.org/job/HBase-TRUNK/ws/trunk/hbase-server/src/main/java/org/apache/hadoop/hbase/zookeeper/RecoverableZooKeeper.java>:[361,23]
cannot find symbol
[ERROR] symbol  : method compareTo(byte[],java.lang.String,int,byte[],int,int)
[ERROR] location: class org.apache.hadoop.hbase.util.Bytes
[ERROR] -> [Help 1]
[ERROR] 
[ERROR] To see the full stack trace of the errors, re-run Maven with the -e switch.
[ERROR] Re-run Maven using the -X switch to enable full debug logging.
[ERROR] 
[ERROR] For more information about the errors and possible solutions, please read the following
articles:
[ERROR] [Help 1] http://cwiki.apache.org/confluence/display/MAVEN/MojoFailureException
[ERROR] 
[ERROR] After correcting the problems, you can resume the build with the command
[ERROR]   mvn <goals> -rf :hbase-server
Build step 'Invoke top-level Maven targets' marked build as failure
Archiving artifacts
Recording test results
Updating HBASE-6858
Updating HBASE-6550
Updating HBASE-6860

Mime
View raw message