hbase-dev mailing list archives

Site index · List index
Message view « Date » · « Thread »
Top « Date » · « Thread »
From Apache Jenkins Server <jenk...@builds.apache.org>
Subject Build failed in Jenkins: HBase-TRUNK-on-Hadoop-2.0.0 #192
Date Tue, 25 Sep 2012 23:26:52 GMT
See <https://builds.apache.org/job/HBase-TRUNK-on-Hadoop-2.0.0/192/changes>

Changes:

[enis] Added enis as a committer

[larsh] HBASE-6637 Argghh... Missed deleted files too

[larsh] HBASE-6637 Missed new files

[larsh] HBASE-6637 Move DaemonThreadFactory into Threads and Threads to hbase-common (Jesse
Yates)

[stack] HBASE-5691 and HBASE-3678 New standard HBase code formatter AND Add Eclipse-based
Apache Formatter to HBase Wiki

[stack] HBASE-5691 and HBASE-3678 New standard HBase code formatter AND Add Eclipse-based
Apache Formatter to HBase Wiki

[larsh] HBASE-6868 Skip checksum is broke; are we double-checksumming by default?

------------------------------------------
[...truncated 2878 lines...]
snapshots: [enabled => true, update => daily]
 releases: [enabled => true, update => daily]
,        id: apache non-releases
      url: http://people.apache.org/~stack/m2/repository
   layout: default
snapshots: [enabled => false, update => daily]
 releases: [enabled => true, update => daily]
,        id: java.net
      url: http://download.java.net/maven/2/
   layout: default
snapshots: [enabled => false, update => daily]
 releases: [enabled => true, update => daily]
,        id: codehaus
      url: http://repository.codehaus.org/
   layout: default
snapshots: [enabled => false, update => daily]
 releases: [enabled => true, update => daily]
,        id: repository.jboss.org
      url: http://repository.jboss.org/nexus/content/groups/public-jboss/
   layout: default
snapshots: [enabled => false, update => daily]
 releases: [enabled => true, update => daily]
,        id: ghelmling.testing
      url: http://people.apache.org/~garyh/mvn/
   layout: default
snapshots: [enabled => true, update => daily]
 releases: [enabled => true, update => daily]
,        id: Nexus
      url: http://repository.apache.org/snapshots
   layout: default
snapshots: [enabled => true, update => daily]
 releases: [enabled => false, update => daily]
,        id: central
      url: http://repo1.maven.org/maven2
   layout: default
snapshots: [enabled => false, update => daily]
 releases: [enabled => true, update => daily]
]
[DEBUG]   (s) skip = false
[DEBUG]   (s) sourceEncoding = UTF-8
[DEBUG]   (s) testClassFilesDirectory = <https://builds.apache.org/job/HBase-TRUNK-on-Hadoop-2.0.0/ws/trunk/target/test-classes>
[DEBUG]   (s) testSourceRoots = [<https://builds.apache.org/job/HBase-TRUNK-on-Hadoop-2.0.0/ws/trunk/src/test/java]>
[DEBUG]   (s) threshold = Default
[DEBUG]   (s) timeout = 600000
[DEBUG]   (s) trace = false
[DEBUG]   (s) xmlEncoding = UTF-8
[DEBUG]   (s) xmlOutput = true
[DEBUG]   (s) xmlOutputDirectory = <https://builds.apache.org/job/HBase-TRUNK-on-Hadoop-2.0.0/ws/trunk/target>
[DEBUG]   (s) xrefLocation = <https://builds.apache.org/job/HBase-TRUNK-on-Hadoop-2.0.0/192/artifact/trunk/target/site/xref>
[DEBUG]   (s) xrefTestLocation = <https://builds.apache.org/job/HBase-TRUNK-on-Hadoop-2.0.0/192/artifact/trunk/target/site/xref-test>
[DEBUG] -- end configuration --
[DEBUG] ****** FindBugsMojo execute *******
[DEBUG] XML outputFile is <https://builds.apache.org/job/HBase-TRUNK-on-Hadoop-2.0.0/ws/trunk/target/findbugsXml.xml>
[DEBUG] Generating Findbugs XML
[DEBUG] Inside canGenerateReport..... false 
[DEBUG] canGenerate is false
[INFO] 
[INFO] --- apache-rat-plugin:0.8:check (default) @ hbase ---
[DEBUG] org.apache.rat:apache-rat-plugin:jar:0.8:
[DEBUG]    org.apache.rat:apache-rat-core:jar:0.8:compile
[DEBUG]       commons-collections:commons-collections:jar:3.2:compile
[DEBUG]       commons-lang:commons-lang:jar:2.1:compile
[DEBUG]       commons-io:commons-io:jar:1.4:compile
[DEBUG]       org.apache.commons:commons-compress:jar:1.0:compile
[DEBUG]       commons-cli:commons-cli:jar:1.2:compile
[DEBUG]    org.codehaus.plexus:plexus-utils:jar:1.4:compile
[DEBUG]    org.apache.maven:maven-plugin-api:jar:2.0.4:compile
[DEBUG]    org.apache.maven.doxia:doxia-site-renderer:jar:1.0-alpha-8:compile
[DEBUG]       org.apache.maven.doxia:doxia-core:jar:1.0-alpha-8:compile
[DEBUG]          org.apache.maven.doxia:doxia-sink-api:jar:1.0-alpha-8:compile
[DEBUG]       org.codehaus.plexus:plexus-i18n:jar:1.0-beta-6:compile
[DEBUG]       org.codehaus.plexus:plexus-velocity:jar:1.1.3:compile
[DEBUG]          velocity:velocity:jar:1.4:compile
[DEBUG]             velocity:velocity-dep:jar:1.4:runtime
[DEBUG]       org.apache.maven.doxia:doxia-decoration-model:jar:1.0-alpha-8:compile
[DEBUG]    org.apache.maven.reporting:maven-reporting-impl:jar:2.0.4:compile
[DEBUG]       org.apache.maven:maven-project:jar:2.0.4:compile
[DEBUG]          org.apache.maven:maven-settings:jar:2.0.4:compile
[DEBUG]          org.apache.maven:maven-profile:jar:2.0.4:compile
[DEBUG]          org.apache.maven:maven-model:jar:2.0.4:compile
[DEBUG]       commons-validator:commons-validator:jar:1.2.0:compile
[DEBUG]          commons-beanutils:commons-beanutils:jar:1.7.0:compile
[DEBUG]          commons-digester:commons-digester:jar:1.6:compile
[DEBUG]          commons-logging:commons-logging:jar:1.0.4:compile
[DEBUG]          xml-apis:xml-apis:jar:1.0.b2:compile
[DEBUG]       oro:oro:jar:2.0.7:compile
[DEBUG]       org.apache.maven.reporting:maven-reporting-api:jar:2.0.4:compile
[DEBUG]    org.apache.maven:maven-artifact-manager:jar:2.0.4:compile
[DEBUG]       org.apache.maven:maven-repository-metadata:jar:2.0.4:compile
[DEBUG]       org.apache.maven:maven-artifact:jar:2.0.4:compile
[DEBUG]       org.codehaus.plexus:plexus-container-default:jar:1.0-alpha-9:compile
[DEBUG]          classworlds:classworlds:jar:1.1-alpha-2:compile
[DEBUG]    org.apache.maven.shared:maven-plugin-testing-harness:jar:1.1:compile
[DEBUG]       org.apache.maven:maven-core:jar:2.0:compile
[DEBUG]          org.apache.maven:maven-plugin-parameter-documenter:jar:2.0:compile
[DEBUG]          org.apache.maven:maven-error-diagnostics:jar:2.0:compile
[DEBUG]          org.apache.maven:maven-plugin-registry:jar:2.0:compile
[DEBUG]          org.apache.maven:maven-plugin-descriptor:jar:2.0:compile
[DEBUG]          org.codehaus.plexus:plexus-interactivity-api:jar:1.0-alpha-4:compile
[DEBUG]          org.apache.maven:maven-monitor:jar:2.0:compile
[DEBUG]       junit:junit:jar:3.8.2:test (scope managed from compile) (version managed from
3.8.1)
[DEBUG]       org.codehaus.plexus:plexus-archiver:jar:1.0-alpha-7:compile
[DEBUG] Created new class realm plugin>org.apache.rat:apache-rat-plugin:0.8
[DEBUG] Importing foreign packages into class realm plugin>org.apache.rat:apache-rat-plugin:0.8
[DEBUG]   Imported:  < maven.api
[DEBUG] Populating class realm plugin>org.apache.rat:apache-rat-plugin:0.8
[DEBUG]   Included: org.apache.rat:apache-rat-plugin:jar:0.8
[DEBUG]   Included: org.apache.rat:apache-rat-core:jar:0.8
[DEBUG]   Included: commons-collections:commons-collections:jar:3.2
[DEBUG]   Included: commons-lang:commons-lang:jar:2.1
[DEBUG]   Included: commons-io:commons-io:jar:1.4
[DEBUG]   Included: org.apache.commons:commons-compress:jar:1.0
[DEBUG]   Included: commons-cli:commons-cli:jar:1.2
[DEBUG]   Included: org.codehaus.plexus:plexus-utils:jar:1.4
[DEBUG]   Included: org.apache.maven.doxia:doxia-site-renderer:jar:1.0-alpha-8
[DEBUG]   Included: org.apache.maven.doxia:doxia-core:jar:1.0-alpha-8
[DEBUG]   Included: org.apache.maven.doxia:doxia-sink-api:jar:1.0-alpha-8
[DEBUG]   Included: org.codehaus.plexus:plexus-i18n:jar:1.0-beta-6
[DEBUG]   Included: org.codehaus.plexus:plexus-velocity:jar:1.1.3
[DEBUG]   Included: velocity:velocity:jar:1.4
[DEBUG]   Included: velocity:velocity-dep:jar:1.4
[DEBUG]   Included: org.apache.maven.doxia:doxia-decoration-model:jar:1.0-alpha-8
[DEBUG]   Included: org.apache.maven.reporting:maven-reporting-impl:jar:2.0.4
[DEBUG]   Included: commons-validator:commons-validator:jar:1.2.0
[DEBUG]   Included: commons-beanutils:commons-beanutils:jar:1.7.0
[DEBUG]   Included: commons-digester:commons-digester:jar:1.6
[DEBUG]   Included: commons-logging:commons-logging:jar:1.0.4
[DEBUG]   Included: xml-apis:xml-apis:jar:1.0.b2
[DEBUG]   Included: oro:oro:jar:2.0.7
[DEBUG]   Included: org.apache.maven.reporting:maven-reporting-api:jar:2.0.4
[DEBUG]   Included: org.apache.maven.shared:maven-plugin-testing-harness:jar:1.1
[DEBUG]   Included: org.codehaus.plexus:plexus-interactivity-api:jar:1.0-alpha-4
[DEBUG]   Included: org.codehaus.plexus:plexus-archiver:jar:1.0-alpha-7
[DEBUG]   Excluded: org.apache.maven:maven-plugin-api:jar:2.0.4
[DEBUG]   Excluded: org.apache.maven:maven-project:jar:2.0.4
[DEBUG]   Excluded: org.apache.maven:maven-settings:jar:2.0.4
[DEBUG]   Excluded: org.apache.maven:maven-profile:jar:2.0.4
[DEBUG]   Excluded: org.apache.maven:maven-model:jar:2.0.4
[DEBUG]   Excluded: org.apache.maven:maven-artifact-manager:jar:2.0.4
[DEBUG]   Excluded: org.apache.maven:maven-repository-metadata:jar:2.0.4
[DEBUG]   Excluded: org.apache.maven:maven-artifact:jar:2.0.4
[DEBUG]   Excluded: org.codehaus.plexus:plexus-container-default:jar:1.0-alpha-9
[DEBUG]   Excluded: classworlds:classworlds:jar:1.1-alpha-2
[DEBUG]   Excluded: org.apache.maven:maven-core:jar:2.0
[DEBUG]   Excluded: org.apache.maven:maven-plugin-parameter-documenter:jar:2.0
[DEBUG]   Excluded: org.apache.maven:maven-error-diagnostics:jar:2.0
[DEBUG]   Excluded: org.apache.maven:maven-plugin-registry:jar:2.0
[DEBUG]   Excluded: org.apache.maven:maven-plugin-descriptor:jar:2.0
[DEBUG]   Excluded: org.apache.maven:maven-monitor:jar:2.0
[DEBUG]   Excluded: junit:junit:jar:3.8.2
[DEBUG] Configuring mojo org.apache.rat:apache-rat-plugin:0.8:check from plugin realm ClassRealm[plugin>org.apache.rat:apache-rat-plugin:0.8,
parent: sun.misc.Launcher$AppClassLoader@192d342]
[DEBUG] Configuring mojo 'org.apache.rat:apache-rat-plugin:0.8:check' with basic configurator
-->
[DEBUG]   (f) addDefaultLicenseMatchers = true
[DEBUG]   (f) addLicenseHeaders = false
[DEBUG]   (f) basedir = <https://builds.apache.org/job/HBase-TRUNK-on-Hadoop-2.0.0/ws/trunk>
[DEBUG]   (f) excludeSubProjects = true
[DEBUG]   (f) excludes = [**/*.log, **/.*, **/*.tgz, **/*.orig, **/test/**, **/8e8ab58dcf39412da19833fcd8f687ac,
**/.git/**, **/.idea/**, **/target/**, **/CHANGES.txt, **/generated/**, **/conf/*, **/*.avpr,
**/*.svg, **/META-INF/services/**, **/html5shiv.js, **/jquery.min.js, **/*.vm, **/control,
**/conffile, docs/*, **/src/site/resources/css/freebsd_docbook.css]
[DEBUG]   (f) numUnapprovedLicenses = 0
[DEBUG]   (f) project = MavenProject: org.apache.hbase:hbase:0.95-SNAPSHOT @ <https://builds.apache.org/job/HBase-TRUNK-on-Hadoop-2.0.0/ws/trunk/pom.xml>
[DEBUG]   (f) reportFile = <https://builds.apache.org/job/HBase-TRUNK-on-Hadoop-2.0.0/192/artifact/trunk/target/rat.txt>
[DEBUG]   (f) reportStyle = plain
[DEBUG]   (f) useDefaultExcludes = true
[DEBUG]   (f) useEclipseDefaultExcludes = true
[DEBUG]   (f) useIdeaDefaultExcludes = true
[DEBUG]   (f) useMavenDefaultExcludes = true
[DEBUG] -- end configuration --
[INFO] Exclude: **/*.log
[INFO] Exclude: **/.*
[INFO] Exclude: **/*.tgz
[INFO] Exclude: **/*.orig
[INFO] Exclude: **/test/**
[INFO] Exclude: **/8e8ab58dcf39412da19833fcd8f687ac
[INFO] Exclude: **/.git/**
[INFO] Exclude: **/.idea/**
[INFO] Exclude: **/target/**
[INFO] Exclude: **/CHANGES.txt
[INFO] Exclude: **/generated/**
[INFO] Exclude: **/conf/*
[INFO] Exclude: **/*.avpr
[INFO] Exclude: **/*.svg
[INFO] Exclude: **/META-INF/services/**
[INFO] Exclude: **/html5shiv.js
[INFO] Exclude: **/jquery.min.js
[INFO] Exclude: **/*.vm
[INFO] Exclude: **/control
[INFO] Exclude: **/conffile
[INFO] Exclude: docs/*
[INFO] Exclude: **/src/site/resources/css/freebsd_docbook.css
[INFO]                                                                         
[INFO] ------------------------------------------------------------------------
[INFO] Skipping HBase
[INFO] This project has been banned from the build due to previous failures.
[INFO] ------------------------------------------------------------------------
[INFO] ------------------------------------------------------------------------
[INFO] Reactor Summary:
[INFO] 
[INFO] HBase ............................................. FAILURE [5.300s]
[INFO] HBase - Common .................................... SKIPPED
[INFO] HBase - Hadoop Compatibility ...................... SKIPPED
[INFO] HBase - Hadoop Two Compatibility .................. SKIPPED
[INFO] HBase - Server .................................... SKIPPED
[INFO] HBase - Hadoop One Compatibility .................. SKIPPED
[INFO] HBase - Integration Tests ......................... SKIPPED
[INFO] ------------------------------------------------------------------------
[INFO] BUILD FAILURE
[INFO] ------------------------------------------------------------------------
[INFO] Total time: 8.630s
[INFO] Finished at: Tue Sep 25 23:26:49 UTC 2012
[INFO] Final Memory: 25M/260M
[INFO] ------------------------------------------------------------------------
[ERROR] Failed to execute goal org.apache.rat:apache-rat-plugin:0.8:check (default) on project
hbase: Too many unapproved licenses: 1 -> [Help 1]
org.apache.maven.lifecycle.LifecycleExecutionException: Failed to execute goal org.apache.rat:apache-rat-plugin:0.8:check
(default) on project hbase: Too many unapproved licenses: 1
	at org.apache.maven.lifecycle.internal.MojoExecutor.execute(MojoExecutor.java:213)
	at org.apache.maven.lifecycle.internal.MojoExecutor.execute(MojoExecutor.java:153)
	at org.apache.maven.lifecycle.internal.MojoExecutor.execute(MojoExecutor.java:145)
	at org.apache.maven.lifecycle.internal.LifecycleModuleBuilder.buildProject(LifecycleModuleBuilder.java:84)
	at org.apache.maven.lifecycle.internal.LifecycleModuleBuilder.buildProject(LifecycleModuleBuilder.java:59)
	at org.apache.maven.lifecycle.internal.LifecycleStarter.singleThreadedBuild(LifecycleStarter.java:183)
	at org.apache.maven.lifecycle.internal.LifecycleStarter.execute(LifecycleStarter.java:161)
	at org.apache.maven.DefaultMaven.doExecute(DefaultMaven.java:319)
	at org.apache.maven.DefaultMaven.execute(DefaultMaven.java:156)
	at org.apache.maven.cli.MavenCli.execute(MavenCli.java:537)
	at org.apache.maven.cli.MavenCli.doMain(MavenCli.java:196)
	at org.apache.maven.cli.MavenCli.main(MavenCli.java:141)
	at sun.reflect.NativeMethodAccessorImpl.invoke0(Native Method)
	at sun.reflect.NativeMethodAccessorImpl.invoke(NativeMethodAccessorImpl.java:39)
	at sun.reflect.DelegatingMethodAccessorImpl.invoke(DelegatingMethodAccessorImpl.java:25)
	at java.lang.reflect.Method.invoke(Method.java:597)
	at org.codehaus.plexus.classworlds.launcher.Launcher.launchEnhanced(Launcher.java:290)
	at org.codehaus.plexus.classworlds.launcher.Launcher.launch(Launcher.java:230)
	at org.codehaus.plexus.classworlds.launcher.Launcher.mainWithExitCode(Launcher.java:409)
	at org.codehaus.plexus.classworlds.launcher.Launcher.main(Launcher.java:352)
Caused by: org.apache.rat.mp.RatCheckException: Too many unapproved licenses: 1
	at org.apache.rat.mp.RatCheckMojo.check(RatCheckMojo.java:167)
	at org.apache.rat.mp.RatCheckMojo.execute(RatCheckMojo.java:159)
	at org.apache.maven.plugin.DefaultBuildPluginManager.executeMojo(DefaultBuildPluginManager.java:101)
	at org.apache.maven.lifecycle.internal.MojoExecutor.execute(MojoExecutor.java:209)
	... 19 more
[ERROR] 
[ERROR] 
[ERROR] For more information about the errors and possible solutions, please read the following
articles:
[ERROR] [Help 1] http://cwiki.apache.org/confluence/display/MAVEN/MojoFailureException
Build step 'Invoke top-level Maven targets' marked build as failure
Archiving artifacts
Recording test results
Updating HBASE-6637
Updating HBASE-3678
Updating HBASE-6868
Updating HBASE-5691

Mime
View raw message