hbase-dev mailing list archives

Site index · List index
Message view « Date » · « Thread »
Top « Date » · « Thread »
From Apache Jenkins Server <jenk...@builds.apache.org>
Subject Build failed in Jenkins: HBase-TRUNK #3290
Date Tue, 28 Aug 2012 20:24:22 GMT
See <https://builds.apache.org/job/HBase-TRUNK/3290/changes>

Changes:

[stack] HBASE-6052 Convert .META. and -ROOT- content to pb; ADDENDUM REMOVE UNUSED hbase-4388-root.dir.tgz

------------------------------------------
[...truncated 2653 lines...]
Tests run: 1, Failures: 0, Errors: 0, Skipped: 0, Time elapsed: 0.241 sec
Running org.apache.hadoop.hbase.util.TestMergeTool
Tests run: 1, Failures: 0, Errors: 0, Skipped: 0, Time elapsed: 87.309 sec
Running org.apache.hadoop.hbase.util.TestFSTableDescriptors
Tests run: 10, Failures: 0, Errors: 0, Skipped: 0, Time elapsed: 0.98 sec
Running org.apache.hadoop.hbase.util.TestEnvironmentEdgeManager
Tests run: 2, Failures: 0, Errors: 0, Skipped: 0, Time elapsed: 0.377 sec
Running org.apache.hadoop.hbase.util.TestMiniClusterLoadSequential
Tests run: 4, Failures: 0, Errors: 0, Skipped: 0, Time elapsed: 352.61 sec
Running org.apache.hadoop.hbase.util.TestProcessBasedCluster
Tests run: 1, Failures: 0, Errors: 0, Skipped: 0, Time elapsed: 0.335 sec
Running org.apache.hadoop.hbase.util.TestRegionSplitter
Tests run: 5, Failures: 0, Errors: 0, Skipped: 0, Time elapsed: 129.166 sec
Running org.apache.hadoop.hbase.util.TestMiniClusterLoadParallel
Tests run: 4, Failures: 0, Errors: 0, Skipped: 0, Time elapsed: 375.803 sec
Running org.apache.hadoop.hbase.mapred.TestTableInputFormat
Tests run: 10, Failures: 0, Errors: 0, Skipped: 0, Time elapsed: 85.63 sec
Running org.apache.hadoop.hbase.regionserver.TestStore
Tests run: 12, Failures: 0, Errors: 0, Skipped: 0, Time elapsed: 10.946 sec
Running org.apache.hadoop.hbase.regionserver.TestStoreFileBlockCacheSummary
Tests run: 1, Failures: 0, Errors: 0, Skipped: 0, Time elapsed: 29.043 sec
Running org.apache.hadoop.hbase.regionserver.TestCompaction
Tests run: 15, Failures: 0, Errors: 0, Skipped: 0, Time elapsed: 43.175 sec
Running org.apache.hadoop.hbase.regionserver.TestMemStore
Tests run: 21, Failures: 0, Errors: 0, Skipped: 0, Time elapsed: 32.253 sec
Running org.apache.hadoop.hbase.mapred.TestTableMapReduce
Tests run: 1, Failures: 0, Errors: 0, Skipped: 0, Time elapsed: 173.202 sec
Running org.apache.hadoop.hbase.regionserver.TestCompactionWithCoprocessor
Tests run: 15, Failures: 0, Errors: 0, Skipped: 0, Time elapsed: 39.388 sec
Running org.apache.hadoop.hbase.regionserver.handler.TestOpenRegionHandler
Tests run: 3, Failures: 0, Errors: 0, Skipped: 0, Time elapsed: 1.715 sec
Running org.apache.hadoop.hbase.regionserver.handler.TestCloseRegionHandler
Tests run: 3, Failures: 0, Errors: 0, Skipped: 0, Time elapsed: 2.218 sec
Running org.apache.hadoop.hbase.regionserver.TestParallelPut
Tests run: 2, Failures: 0, Errors: 0, Skipped: 0, Time elapsed: 6.894 sec
Running org.apache.hadoop.hbase.util.TestHBaseFsck
Tests run: 26, Failures: 0, Errors: 0, Skipped: 0, Time elapsed: 689.022 sec
Running org.apache.hadoop.hbase.regionserver.TestRegionServerMetrics
Tests run: 4, Failures: 0, Errors: 0, Skipped: 0, Time elapsed: 152.02 sec
Running org.apache.hadoop.hbase.regionserver.TestServerCustomProtocol
Tests run: 7, Failures: 0, Errors: 0, Skipped: 0, Time elapsed: 37.735 sec
Running org.apache.hadoop.hbase.regionserver.TestHRegionOnCluster
Tests run: 1, Failures: 0, Errors: 0, Skipped: 0, Time elapsed: 34.236 sec
Running org.apache.hadoop.hbase.regionserver.TestBlocksRead
Tests run: 4, Failures: 0, Errors: 0, Skipped: 0, Time elapsed: 1.114 sec
Running org.apache.hadoop.hbase.regionserver.TestAtomicOperation
Tests run: 5, Failures: 0, Errors: 0, Skipped: 0, Time elapsed: 18.528 sec
Running org.apache.hadoop.hbase.regionserver.TestMasterAddressManager
Tests run: 1, Failures: 0, Errors: 0, Skipped: 0, Time elapsed: 5.693 sec
Running org.apache.hadoop.hbase.regionserver.TestSplitTransactionOnCluster
Tests run: 7, Failures: 0, Errors: 0, Skipped: 0, Time elapsed: 190.276 sec
Running org.apache.hadoop.hbase.regionserver.TestRSKilledWhenMasterInitializing
Tests run: 1, Failures: 0, Errors: 0, Skipped: 0, Time elapsed: 169.029 sec
Running org.apache.hadoop.hbase.regionserver.wal.TestHLog
Tests run: 11, Failures: 0, Errors: 0, Skipped: 0, Time elapsed: 160.145 sec
Running org.apache.hadoop.hbase.regionserver.wal.TestWALReplayCompressed
Tests run: 7, Failures: 0, Errors: 0, Skipped: 0, Time elapsed: 166.638 sec
Running org.apache.hadoop.hbase.regionserver.wal.TestWALReplay
Tests run: 7, Failures: 0, Errors: 0, Skipped: 0, Time elapsed: 144.539 sec
Running org.apache.hadoop.hbase.regionserver.TestMXBean
Tests run: 1, Failures: 0, Errors: 0, Skipped: 0, Time elapsed: 34.94 sec
Running org.apache.hadoop.hbase.regionserver.metrics.TestSchemaMetrics
Tests run: 6, Failures: 0, Errors: 0, Skipped: 0, Time elapsed: 15.923 sec
Running org.apache.hadoop.hbase.regionserver.TestRpcMetrics
Tests run: 1, Failures: 0, Errors: 0, Skipped: 0, Time elapsed: 2.553 sec
Running org.apache.hadoop.hbase.regionserver.TestGetClosestAtOrBefore
Tests run: 3, Failures: 0, Errors: 0, Skipped: 0, Time elapsed: 1.527 sec
Running org.apache.hadoop.hbase.regionserver.TestStoreScanner
Tests run: 16, Failures: 0, Errors: 0, Skipped: 0, Time elapsed: 0.384 sec
Running org.apache.hadoop.hbase.regionserver.TestCacheOnWriteInSchema
Tests run: 3, Failures: 0, Errors: 0, Skipped: 0, Time elapsed: 2.402 sec
Running org.apache.hadoop.hbase.regionserver.wal.TestLogRollAbort
Running org.apache.hadoop.hbase.regionserver.TestSeekOptimizations
Tests run: 6, Failures: 0, Errors: 0, Skipped: 0, Time elapsed: 2.837 sec
Tests run: 1, Failures: 0, Errors: 0, Skipped: 0, Time elapsed: 212.574 sec
Running org.apache.hadoop.hbase.regionserver.TestFSErrorsExposed
Tests run: 3, Failures: 0, Errors: 0, Skipped: 0, Time elapsed: 87.073 sec
Running org.apache.hadoop.hbase.regionserver.TestSplitLogWorker
Tests run: 5, Failures: 0, Errors: 0, Skipped: 0, Time elapsed: 11.544 sec
Running org.apache.hadoop.hbase.regionserver.TestHRegionServerBulkLoad
Tests run: 1, Failures: 0, Errors: 0, Skipped: 0, Time elapsed: 104.419 sec
Running org.apache.hadoop.hbase.regionserver.TestCompoundBloomFilter
Tests run: 3, Failures: 0, Errors: 0, Skipped: 0, Time elapsed: 25.76 sec
Running org.apache.hadoop.hbase.regionserver.TestMultiColumnScanner
Tests run: 12, Failures: 0, Errors: 0, Skipped: 0, Time elapsed: 43.224 sec
Running org.apache.hadoop.hbase.regionserver.wal.TestLogRolling
Tests run: 2, Failures: 0, Errors: 0, Skipped: 0, Time elapsed: 417.364 sec
Running org.apache.hadoop.hbase.regionserver.TestHRegion
Tests run: 67, Failures: 0, Errors: 0, Skipped: 0, Time elapsed: 60.584 sec
Running org.apache.hadoop.hbase.regionserver.TestEndToEndSplitTransaction
Tests run: 2, Failures: 0, Errors: 0, Skipped: 0, Time elapsed: 92.707 sec
Running org.apache.hadoop.hbase.client.replication.TestReplicationAdmin
Tests run: 1, Failures: 0, Errors: 0, Skipped: 0, Time elapsed: 1.463 sec
Running org.apache.hadoop.hbase.regionserver.TestCompactionState
Tests run: 2, Failures: 0, Errors: 0, Skipped: 0, Time elapsed: 48.063 sec
Running org.apache.hadoop.hbase.client.TestTimestampsFilter
Tests run: 3, Failures: 0, Errors: 0, Skipped: 0, Time elapsed: 39.939 sec
Running org.apache.hadoop.hbase.client.TestMultipleTimestamps
Tests run: 8, Failures: 0, Errors: 0, Skipped: 0, Time elapsed: 50.234 sec
Running org.apache.hadoop.hbase.regionserver.wal.TestHLogSplit
Tests run: 30, Failures: 0, Errors: 0, Skipped: 1, Time elapsed: 449.515 sec
Running org.apache.hadoop.hbase.client.TestHTablePool$TestHTableReusablePool
Tests run: 8, Failures: 0, Errors: 0, Skipped: 0, Time elapsed: 6.35 sec
Running org.apache.hadoop.hbase.client.TestHCM
Tests run: 7, Failures: 0, Errors: 0, Skipped: 0, Time elapsed: 48.654 sec
Running org.apache.hadoop.hbase.client.TestHTablePool$TestHTableThreadLocalPool
Tests run: 8, Failures: 0, Errors: 0, Skipped: 0, Time elapsed: 42.245 sec
Running org.apache.hadoop.hbase.client.TestHTableUtil
Tests run: 2, Failures: 0, Errors: 0, Skipped: 0, Time elapsed: 25.667 sec
Running org.apache.hadoop.hbase.client.TestFromClientSide3
Tests run: 1, Failures: 0, Errors: 0, Skipped: 0, Time elapsed: 47.729 sec
Running org.apache.hadoop.hbase.client.TestMetaScanner
Tests run: 1, Failures: 0, Errors: 0, Skipped: 0, Time elapsed: 19.593 sec
Running org.apache.hadoop.hbase.client.TestFromClientSideWithCoprocessor
Tests run: 57, Failures: 0, Errors: 0, Skipped: 3, Time elapsed: 249.539 sec
Running org.apache.hadoop.hbase.client.TestScannerTimeout
Tests run: 4, Failures: 0, Errors: 0, Skipped: 0, Time elapsed: 47.34 sec
Running org.apache.hadoop.hbase.client.TestFromClientSide
Tests run: 57, Failures: 0, Errors: 0, Skipped: 3, Time elapsed: 237.03 sec
Running org.apache.hadoop.hbase.client.TestShell
Tests run: 1, Failures: 0, Errors: 0, Skipped: 0, Time elapsed: 128.079 sec
Running org.apache.hadoop.hbase.client.TestScannersFromClientSide
Tests run: 4, Failures: 0, Errors: 0, Skipped: 0, Time elapsed: 27.717 sec
Running org.apache.hadoop.hbase.client.TestAdmin
Tests run: 41, Failures: 0, Errors: 0, Skipped: 0, Time elapsed: 178.597 sec
Running org.apache.hadoop.hbase.client.TestMultiParallel
Tests run: 11, Failures: 0, Errors: 0, Skipped: 0, Time elapsed: 50.108 sec
Running org.apache.hadoop.hbase.TestMultiVersions
Tests run: 3, Failures: 0, Errors: 0, Skipped: 0, Time elapsed: 28.484 sec
Running org.apache.hadoop.hbase.master.TestActiveMasterManager
Tests run: 2, Failures: 0, Errors: 0, Skipped: 0, Time elapsed: 1.45 sec
Running org.apache.hadoop.hbase.master.TestMasterNoCluster
Tests run: 3, Failures: 0, Errors: 0, Skipped: 0, Time elapsed: 7.927 sec
Running org.apache.hadoop.hbase.master.TestRollingRestart
Tests run: 1, Failures: 0, Errors: 0, Skipped: 0, Time elapsed: 61.584 sec
Running org.apache.hadoop.hbase.master.balancer.TestDefaultLoadBalancer
Tests run: 1, Failures: 0, Errors: 0, Skipped: 0, Time elapsed: 1.405 sec
Running org.apache.hadoop.hbase.master.balancer.TestBaseLoadBalancer
Tests run: 3, Failures: 0, Errors: 0, Skipped: 0, Time elapsed: 0.348 sec
Running org.apache.hadoop.hbase.thrift.TestThriftServer
Tests run: 1, Failures: 0, Errors: 0, Skipped: 0, Time elapsed: 94.909 sec
Running org.apache.hadoop.hbase.master.TestZKBasedOpenCloseRegion
Running org.apache.hadoop.hbase.master.TestMasterFileSystem
Tests run: 1, Failures: 0, Errors: 0, Skipped: 0, Time elapsed: 25.602 sec
Tests run: 4, Failures: 0, Errors: 0, Skipped: 0, Time elapsed: 45.17 sec
Running org.apache.hadoop.hbase.master.balancer.TestStochasticLoadBalancer
Tests run: 4, Failures: 0, Errors: 0, Skipped: 0, Time elapsed: 101.496 sec
Running org.apache.hadoop.hbase.master.TestMaster
Tests run: 1, Failures: 0, Errors: 0, Skipped: 0, Time elapsed: 22.373 sec
Running org.apache.hadoop.hbase.master.TestOpenedRegionHandler
Tests run: 2, Failures: 0, Errors: 0, Skipped: 0, Time elapsed: 22.378 sec
Running org.apache.hadoop.hbase.master.TestMasterTransitions
Tests run: 3, Failures: 0, Errors: 0, Skipped: 3, Time elapsed: 32.411 sec
Running org.apache.hadoop.hbase.master.TestSplitLogManager
Tests run: 12, Failures: 0, Errors: 0, Skipped: 0, Time elapsed: 17.316 sec
Running org.apache.hadoop.hbase.master.metrics.TestMasterMetricsWrapper
Tests run: 1, Failures: 0, Errors: 0, Skipped: 0, Time elapsed: 19.973 sec
Running org.apache.hadoop.hbase.master.TestAssignmentManager
Tests run: 12, Failures: 0, Errors: 0, Skipped: 0, Time elapsed: 3.868 sec
Running org.apache.hadoop.hbase.master.TestAssignmentManagerOnCluster
Tests run: 3, Failures: 0, Errors: 0, Skipped: 0, Time elapsed: 28.198 sec
Running org.apache.hadoop.hbase.master.TestMasterRestartAfterDisablingTable
Tests run: 1, Failures: 0, Errors: 0, Skipped: 0, Time elapsed: 22.594 sec
Running org.apache.hadoop.hbase.master.TestMasterStatusServlet
Tests run: 5, Failures: 0, Errors: 0, Skipped: 0, Time elapsed: 1.325 sec
Running org.apache.hadoop.hbase.master.TestHMasterRPCException
Tests run: 1, Failures: 0, Errors: 0, Skipped: 0, Time elapsed: 1.55 sec
Running org.apache.hadoop.hbase.master.TestMasterShutdown
Tests run: 1, Failures: 0, Errors: 0, Skipped: 0, Time elapsed: 24.996 sec
Running org.apache.hadoop.hbase.master.cleaner.TestLogsCleaner
Tests run: 1, Failures: 0, Errors: 0, Skipped: 0, Time elapsed: 4.15 sec
Running org.apache.hadoop.hbase.master.TestRestartCluster
Tests run: 2, Failures: 0, Errors: 0, Skipped: 0, Time elapsed: 50.838 sec
Running org.apache.hadoop.hbase.master.TestMasterFailover
Tests run: 4, Failures: 0, Errors: 0, Skipped: 0, Time elapsed: 119.295 sec
Running org.apache.hadoop.hbase.master.TestDistributedLogSplitting
Tests run: 4, Failures: 0, Errors: 0, Skipped: 0, Time elapsed: 177.889 sec
Running org.apache.hadoop.hbase.TestZooKeeper
Tests run: 9, Failures: 0, Errors: 0, Skipped: 0, Time elapsed: 36.111 sec
Running org.apache.hadoop.hbase.ipc.TestProtoBufRpc
Tests run: 1, Failures: 0, Errors: 0, Skipped: 0, Time elapsed: 0.729 sec
Running org.apache.hadoop.hbase.ipc.TestDelayedRpc
Tests run: 4, Failures: 0, Errors: 0, Skipped: 0, Time elapsed: 2.322 sec
Running org.apache.hadoop.hbase.ipc.TestHBaseClient
Tests run: 1, Failures: 0, Errors: 0, Skipped: 0, Time elapsed: 0.151 sec
Running org.apache.hadoop.hbase.thrift2.TestThriftHBaseServiceHandler
Tests run: 12, Failures: 0, Errors: 0, Skipped: 0, Time elapsed: 21.023 sec
Running org.apache.hadoop.hbase.TestRegionRebalancing
Tests run: 2, Failures: 0, Errors: 0, Skipped: 0, Time elapsed: 160.777 sec
Running org.apache.hadoop.hbase.TestInfoServers
Tests run: 2, Failures: 0, Errors: 0, Skipped: 0, Time elapsed: 18.755 sec
Running org.apache.hadoop.hbase.TestAcidGuarantees
Tests run: 3, Failures: 0, Errors: 0, Skipped: 0, Time elapsed: 127.154 sec
Running org.apache.hadoop.hbase.thrift.TestThriftServerCmdLine
Tests run: 32, Failures: 0, Errors: 0, Skipped: 0, Time elapsed: 800.058 sec

Results :

Failed tests:   testMultipleTables(org.apache.hadoop.hbase.backup.example.TestZooKeeperTableArchiveClient):
Archived HFiles (hdfs://localhost:45357/user/hudson/hbase/.archive/otherTable/54aef2167b3087ba651227dba3455cc6/fam)
should have gotten deleted, but didn't, remaining files:[hdfs://localhost:45357/user/hudson/hbase/.archive/otherTable/54aef2167b3087ba651227dba3455cc6/fam/4524806f6aa24a96bad0612121d76f42,
hdfs://localhost:45357/user/hudson/hbase/.archive/otherTable/54aef2167b3087ba651227dba3455cc6/fam/470e76d9d91a4930bc5f130a04de5fc6,
hdfs://localhost:45357/user/hudson/hbase/.archive/otherTable/54aef2167b3087ba651227dba3455cc6/fam/49cccaf1bc824b0086b76cf1281f4236,
hdfs://localhost:45357/user/hudson/hbase/.archive/otherTable/54aef2167b3087ba651227dba3455cc6/fam/4b2e41028e224debbc168ffd4567b80d,
hdfs://localhost:45357/user/hudson/hbase/.archive/otherTable/54aef2167b3087ba651227dba3455cc6/fam/4b4771dd45814e719630f5433ce1db9c,
hdfs://localhost:45357/user/hudson/hbase/.archive/otherTable/54aef2167b3087ba651227dba3455cc6/fam/4c9f502c14154b61bb240e894b54409b,
hdfs://localhost:45357/user/hudson/hbase/.archive/otherTable/54aef2167b3087ba651227dba3455cc6/fam/4fe2cf59b7fb4aa7b7c2dd4bb7814041,
hdfs://localhost:45357/user/hudson/hbase/.archive/otherTable/54aef2167b3087ba651227dba3455cc6/fam/51ab7622a308488fb816b5239ad7a120,
hdfs://localhost:45357/user/hudson/hbase/.archive/otherTable/54aef2167b3087ba651227dba3455cc6/fam/55efe68a6b2d41f9a8fb12cc2ef5ae34,
hdfs://localhost:45357/user/hudson/hbase/.archive/otherTable/54aef2167b3087ba651227dba3455cc6/fam/5c9b537c65894061ba11cab1a3a87b40,
hdfs://localhost:45357/user/hudson/hbase/.archive/otherTable/54aef2167b3087ba651227dba3455cc6/fam/5d87698195564bc39e2617094119f7d0,
hdfs://localhost:45357/user/hudson/hbase/.archive/otherTable/54aef2167b3087ba651227dba3455cc6/fam/6948537a29f644f4a7be3fed88ec0ac2,
hdfs://localhost:45357/user/hudson/hbase/.archive/otherTable/54aef2167b3087ba651227dba3455cc6/fam/6a21ec340a654dae855f29c1a19c63c8,
hdfs://localhost:45357/user/hudson/hbase/.archive/otherTable/54aef2167b3087ba651227dba3455cc6/fam/6b81264ff262444989b08207a23386f3,
hdfs://localhost:45357/user/hudson/hbase/.archive/otherTable/54aef2167b3087ba651227dba3455cc6/fam/73cf2b39820f47bba6bd0e599a888dca,
hdfs://localhost:45357/user/hudson/hbase/.archive/otherTable/54aef2167b3087ba651227dba3455cc6/fam/74a1e83829224edab936e67ff7dff253,
hdfs://localhost:45357/user/hudson/hbase/.archive/otherTable/54aef2167b3087ba651227dba3455cc6/fam/77b718a3d0e54fac9e9e8576c3a61047,
hdfs://localhost:45357/user/hudson/hbase/.archive/otherTable/54aef2167b3087ba651227dba3455cc6/fam/806527467d974b35b0a60b0f558c21dd,
hdfs://localhost:45357/user/hudson/hbase/.archive/otherTable/54aef2167b3087ba651227dba3455cc6/fam/81b464d466fa45d5b98d8984d2835848,
hdfs://localhost:45357/user/hudson/hbase/.archive/otherTable/54aef2167b3087ba651227dba3455cc6/fam/87dc9d1f3afb43dd88c298cc62bbf744,
hdfs://localhost:45357/user/hudson/hbase/.archive/otherTable/54aef2167b3087ba651227dba3455cc6/fam/88a7800acba14d23ae740cf1877bbffa,
hdfs://localhost:45357/user/hudson/hbase/.archive/otherTable/54aef2167b3087ba651227dba3455cc6/fam/89a14dd3f4c94947b5d08bad178ff47f,
hdfs://localhost:45357/user/hudson/hbase/.archive/otherTable/54aef2167b3087ba651227dba3455cc6/fam/8a40857a6d204ff6b0c1450781282208,
hdfs://localhost:45357/user/hudson/hbase/.archive/otherTable/54aef2167b3087ba651227dba3455cc6/fam/8b09c521617b4ef094e62a74510326c5,
hdfs://localhost:45357/user/hudson/hbase/.archive/otherTable/54aef2167b3087ba651227dba3455cc6/fam/8b7ab52621a941ca9a258f51cb841dbf,
hdfs://localhost:45357/user/hudson/hbase/.archive/otherTable/54aef2167b3087ba651227dba3455cc6/fam/8c70a4a266ac46aea425ce3b8034bf31,
hdfs://localhost:45357/user/hudson/hbase/.archive/otherTable/54aef2167b3087ba651227dba3455cc6/fam/93def6ce02d64b3798ce0862d4d63d54,
hdfs://localhost:45357/user/hudson/hbase/.archive/otherTable/54aef2167b3087ba651227dba3455cc6/fam/95b98d22478e45dc908517195035681c,
hdfs://localhost:45357/user/hudson/hbase/.archive/otherTable/54aef2167b3087ba651227dba3455cc6/fam/991ccc85633c4a6d9b8d8b323f83c25f,
hdfs://localhost:45357/user/hudson/hbase/.archive/otherTable/54aef2167b3087ba651227dba3455cc6/fam/994da203c4ba4e94a47e17111306d7d0,
hdfs://localhost:45357/user/hudson/hbase/.archive/otherTable/54aef2167b3087ba651227dba3455cc6/fam/9bc616d72cdd4fff910b8ea3c7d090a4,
hdfs://localhost:45357/user/hudson/hbase/.archive/otherTable/54aef2167b3087ba651227dba3455cc6/fam/9ebb243403894b18aa6cfb50b11bbabe,
hdfs://localhost:45357/user/hudson/hbase/.archive/otherTable/54aef2167b3087ba651227dba3455cc6/fam/9f0559f9985f4ed3aefc528ac49fabb0,
hdfs://localhost:45357/user/hudson/hbase/.archive/otherTable/54aef2167b3087ba651227dba3455cc6/fam/9f4dc720f7014fa6b56e7b7907c2c7f3,
hdfs://localhost:45357/user/hudson/hbase/.archive/otherTable/54aef2167b3087ba651227dba3455cc6/fam/a092a63e852a425891c744a4ad11f181,
hdfs://localhost:45357/user/hudson/hbase/.archive/otherTable/54aef2167b3087ba651227dba3455cc6/fam/ac75d227b2ca493a84e998292bb67e45,
hdfs://localhost:45357/user/hudson/hbase/.archive/otherTable/54aef2167b3087ba651227dba3455cc6/fam/b25854d926b94982aab482ee8eb40695,
hdfs://localhost:45357/user/hudson/hbase/.archive/otherTable/54aef2167b3087ba651227dba3455cc6/fam/b3612e7679be49d598434f457e4fcd03,
hdfs://localhost:45357/user/hudson/hbase/.archive/otherTable/54aef2167b3087ba651227dba3455cc6/fam/b709b3487f944b64883a117f2d25c6a6,
hdfs://localhost:45357/user/hudson/hbase/.archive/otherTable/54aef2167b3087ba651227dba3455cc6/fam/b78c5a9f71c944c68afb6f523d70dadd,
hdfs://localhost:45357/user/hudson/hbase/.archive/otherTable/54aef2167b3087ba651227dba3455cc6/fam/bb41d92ff62844e9b63371d309d7cf16,
hdfs://localhost:45357/user/hudson/hbase/.archive/otherTable/54aef2167b3087ba651227dba3455cc6/fam/bdf949d439f846f89d67384bdd744dc8,
hdfs://localhost:45357/user/hudson/hbase/.archive/otherTable/54aef2167b3087ba651227dba3455cc6/fam/bf2c852d41a345498248aafc0eee4c1a,
hdfs://localhost:45357/user/hudson/hbase/.archive/otherTable/54aef2167b3087ba651227dba3455cc6/fam/c359188d5c524c168cac436a9c821065,
hdfs://localhost:45357/user/hudson/hbase/.archive/otherTable/54aef2167b3087ba651227dba3455cc6/fam/c3abf63e8038461c8080e7c6acf214d4,
hdfs://localhost:45357/user/hudson/hbase/.archive/otherTable/54aef2167b3087ba651227dba3455cc6/fam/c7a7432b7fec4ce9bf24c54c5f19bc43,
hdfs://localhost:45357/user/hudson/hbase/.archive/otherTable/54aef2167b3087ba651227dba3455cc6/fam/c9a125c31f4e490bb08e06868f1b4ba7,
hdfs://localhost:45357/user/hudson/hbase/.archive/otherTable/54aef2167b3087ba651227dba3455cc6/fam/d0b3390a6b9f4443adf39886ea1635d8,
hdfs://localhost:45357/user/hudson/hbase/.archive/otherTable/54aef2167b3087ba651227dba3455cc6/fam/d16992695ea440c19d7dbcf55fb94bc5,
hdfs://localhost:45357/user/hudson/hbase/.archive/otherTable/54aef2167b3087ba651227dba3455cc6/fam/d1ccb323e25447fdbe4d0eced17d78c1,
hdfs://localhost:45357/user/hudson/hbase/.archive/otherTable/54aef2167b3087ba651227dba3455cc6/fam/d549a4f6bb2b438ab9b0fcc510d5bd81,
hdfs://localhost:45357/user/hudson/hbase/.archive/otherTable/54aef2167b3087ba651227dba3455cc6/fam/d5654ed660da41be82f766221771399d,
hdfs://localhost:45357/user/hudson/hbase/.archive/otherTable/54aef2167b3087ba651227dba3455cc6/fam/d7dc10b72a3e4702a71ad0745c0c27c1,
hdfs://localhost:45357/user/hudson/hbase/.archive/otherTable/54aef2167b3087ba651227dba3455cc6/fam/d8988dbb3a264e88968f456af90897d6,
hdfs://localhost:45357/user/hudson/hbase/.archive/otherTable/54aef2167b3087ba651227dba3455cc6/fam/dd3a0c9ac9ae46a385f0399cf946e2c9,
hdfs://localhost:45357/user/hudson/hbase/.archive/otherTable/54aef2167b3087ba651227dba3455cc6/fam/df39a19a2183490a947b4d4a780ee173,
hdfs://localhost:45357/user/hudson/hbase/.archive/otherTable/54aef2167b3087ba651227dba3455cc6/fam/e030273bb0534c1698144e2a4f0c6120,
hdfs://localhost:45357/user/hudson/hbase/.archive/otherTable/54aef2167b3087ba651227dba3455cc6/fam/e371f871178f404bb5e219cec06efecb,
hdfs://localhost:45357/user/hudson/hbase/.archive/otherTable/54aef2167b3087ba651227dba3455cc6/fam/e80e80697ed7400d8d44e5c1c1e45dce,
hdfs://localhost:45357/user/hudson/hbase/.archive/otherTable/54aef2167b3087ba651227dba3455cc6/fam/ece5af6169034f089846adb5bac2490c,
hdfs://localhost:45357/user/hudson/hbase/.archive/otherTable/54aef2167b3087ba651227dba3455cc6/fam/f1d32dcbc7784448a3dbb03a6de540eb,
hdfs://localhost:45357/user/hudson/hbase/.archive/otherTable/54aef2167b3087ba651227dba3455cc6/fam/f571f11331b4429c87483cffbd06fca0,
hdfs://localhost:45357/user/hudson/hbase/.archive/otherTable/54aef2167b3087ba651227dba3455cc6/fam/f7c99da0e6e249999aad4deee3d74df5,
hdfs://localhost:45357/user/hudson/hbase/.archive/otherTable/54aef2167b3087ba651227dba3455cc6/fam/fa3e932a06254d0c8a5099fb9bffee2f,
hdfs://localhost:45357/user/hudson/hbase/.archive/otherTable/54aef2167b3087ba651227dba3455cc6/fam/faecae8a4aa1424bbcb5a93d26fd6236,
hdfs://localhost:45357/user/hudson/hbase/.archive/otherTable/54aef2167b3087ba651227dba3455cc6/fam/fb3adaaf9bb948e79ab57ca48a38eae1,
hdfs://localhost:45357/user/hudson/hbase/.archive/otherTable/54aef2167b3087ba651227dba3455cc6/fam/fb4e025e0e2f4319b8b9a968abc41309,
hdfs://localhost:45357/user/hudson/hbase/.archive/otherTable/54aef2167b3087ba651227dba3455cc6/fam/fdcb4e48bebb4b64846434a2019bbf24,
hdfs://localhost:45357/user/hudson/hbase/.archive/otherTable/54aef2167b3087ba651227dba3455cc6/fam/ff2d8168d97f4a799c24973c66d9a0dc,
hdfs://localhost:45357/user/hudson/hbase/.archive/otherTable/54aef2167b3087ba651227dba3455cc6/fam/ff6b528ecb5e44dc87240a8f626b4154]

Tests in error: 
  testCacheBlocks[1](org.apache.hadoop.hbase.io.hfile.TestForceCacheImportantBlocks): region:
myTable,,1346182153679.fc256ef5284be268c846185febf9b98f.
  testCacheBlocks[2](org.apache.hadoop.hbase.io.hfile.TestForceCacheImportantBlocks): unable
to create new native thread
  testCacheBlocks[3](org.apache.hadoop.hbase.io.hfile.TestForceCacheImportantBlocks): unable
to create new native thread

Tests run: 1144, Failures: 1, Errors: 3, Skipped: 12

[INFO]                                                                         
[INFO] ------------------------------------------------------------------------
[INFO] Skipping HBase
[INFO] This project has been banned from the build due to previous failures.
[INFO] ------------------------------------------------------------------------
[INFO]                                                                         
[INFO] ------------------------------------------------------------------------
[INFO] Skipping HBase
[INFO] This project has been banned from the build due to previous failures.
[INFO] ------------------------------------------------------------------------
[INFO] ------------------------------------------------------------------------
[INFO] Reactor Summary:
[INFO] 
[INFO] HBase ............................................. SUCCESS [7.514s]
[INFO] HBase - Common .................................... SUCCESS [8.698s]
[INFO] HBase - Hadoop Compatibility ...................... SUCCESS [1.333s]
[INFO] HBase - Hadoop One Compatibility .................. SUCCESS [1.833s]
[INFO] HBase - Server .................................... FAILURE [1:10:22.514s]
[INFO] HBase - Hadoop Two Compatibility .................. SKIPPED
[INFO] HBase - Integration Tests ......................... SKIPPED
[INFO] ------------------------------------------------------------------------
[INFO] BUILD FAILURE
[INFO] ------------------------------------------------------------------------
[INFO] Total time: 1:10:42.666s
[INFO] Finished at: Tue Aug 28 20:19:51 UTC 2012
[INFO] Final Memory: 103M/444M
[INFO] ------------------------------------------------------------------------
[ERROR] Failed to execute goal org.apache.maven.plugins:maven-surefire-plugin:2.12-TRUNK-HBASE-2:test
(secondPartTestsExecution) on project hbase-server: Failure or timeout -> [Help 1]
[ERROR] 
[ERROR] To see the full stack trace of the errors, re-run Maven with the -e switch.
[ERROR] Re-run Maven using the -X switch to enable full debug logging.
[ERROR] 
[ERROR] For more information about the errors and possible solutions, please read the following
articles:
[ERROR] [Help 1] http://cwiki.apache.org/confluence/display/MAVEN/MojoExecutionException
[ERROR] 
[ERROR] After correcting the problems, you can resume the build with the command
[ERROR]   mvn <goals> -rf :hbase-server
Build step 'Invoke top-level Maven targets' marked build as failure
Archiving artifacts
Recording test results
Updating HBASE-6052
Updating HBASE-4388

Mime
View raw message