hbase-dev mailing list archives

Site index · List index
Message view « Date » · « Thread »
Top « Date » · « Thread »
From Apache Jenkins Server <jenk...@builds.apache.org>
Subject Build failed in Jenkins: HBase-0.94-security #48
Date Wed, 22 Aug 2012 13:48:11 GMT
See <https://builds.apache.org/job/HBase-0.94-security/48/changes>

Changes:

[nkeywal] HBASE-6364 Powering down the server host holding the .META. table causes HBase Client
to take excessively long to recover and connect to reassigned .META. table

[stack] HBASE-6632 [0.92 UNIT TESTS] testCreateTableRPCTimeOut sets rpc timeout to 1500ms
and leaves it (testHundredsOfTable fails w/ 1500ms timeout)

[stack] HBASE-6631 TestHMasterRPCException in 0.92 failed twice on socket timeout; ADDENDUM
-- FIX COMPILATION ERROR

[stack] HBASE-6631 TestHMasterRPCException in 0.92 failed twice on socket timeout

[larsh] HBASE-6621 Reduce calls to Bytes.toInt

[larsh] HBASE-6603 RegionMetricsStorage.incrNumericMetric is called too often (M. Chen and
Lars H)

[jmhsieh] HBASE-5714 Add write permissions check before any hbck run that modifies hdfs (Liang
Xie)

[stack] HBASE-6503 HBase Shell Documentation For DROP Is Outdated

[stack] HBASE-6378 the javadoc of setEnabledTable maybe not describe accurately

[tedyu] HBASE-6608 Fix for HBASE-6160, META entries from daughters can be deleted before parent
entries, shouldn't compare HRegionInfo's (Enis)

[stack] HBASE-6602 Region Server Dynamic Metrics can cause high cpu usage.

[stack] HBASE-6538 Remove copy_table.rb script

[stack] HBASE-6596 Revert HBASE-5022; it undoes HBC.create; ADDENDUM 2

[jxiang] HBASE-6593 TestAdmin times out sometimes

[stack] HBASE-6596 Revert HBASE-5022; it undoes HBC.create -- ADDENDUM

[apurtell] HBASE-6565. Coprocessor exec result Map is not thread safe (Yuan Kang)

[larsh] HBASE-6561 Gets/Puts with many columns send the RegionServer into an 'endless' loop

[stack] HBASE-6596 Revert HBASE-5022; it undoes HBC.create

[jxiang] HBASE-6471 Performance regression caused by HBASE-4054

[tedyu] HBASE-6576 HBaseAdmin.createTable should wait until the table is enabled (Gregory)

[larsh] HBASE-6562 Fake KVs are sometimes passed to filters

[apurtell] HBASE-6263. Use default mode for Thrift gateway if not specified

[larsh] HBASE-6579 Unnecessary KV order check in StoreScanner

[larsh] HBASE-6577 RegionScannerImpl.nextRow() should seek to next row

[apurtell] HBASE-6478. TestClassLoading.testClassLoadingFromLibDirInJar occasionally fails

[jxiang] HBASE-5728 Methods Missing in HTableInterface

[apurtell] HBASE-6308. Coprocessors should be loaded in a custom ClassLoader (James Baldassari)

[jmhsieh] HBASE-6512 Incorrect OfflineMetaRepair log class name (Liang Xie)

[jmhsieh] HBASE-6525 bin/replication/copy_tables_desc.rb references non-existent class (David
S. Wang)

[jmhsieh] HBASE-6552 TestAcidGuarantees system test should flush more aggressively (Gregory
Chanan)

[larsh] HBASE-6520 MSLab May cause the Bytes.toLong not work correctly for increment (ShiXing)

[larsh] HBASE-6522 Expose locks and leases to Coprocessors

[larsh] Move the version on past the 0.94.1 release

[jxiang] HBASE-6444 Expose the ability to set custom HTTP Request Headers for the REST client
used by RemoteHTable

[larsh] HBASE-6523 Revert

[larsh] HBASE-6523 HConnectionImplementation still does not recover from all ZK issues.

[stack] HBASE-6373 Add more context information to audit log messages

[larsh] HBASE-6505 Allow shared RegionObserver state

------------------------------------------
[...truncated 6062 lines...]
[DEBUG] Importing foreign packages into class realm plugin>org.apache.maven.plugins:maven-compiler-plugin:2.0.2
[DEBUG]   Imported:  < maven.api
[DEBUG] Populating class realm plugin>org.apache.maven.plugins:maven-compiler-plugin:2.0.2
[DEBUG]   Included: org.apache.maven.plugins:maven-compiler-plugin:jar:2.0.2
[DEBUG]   Included: org.codehaus.plexus:plexus-utils:jar:1.0.4
[DEBUG]   Included: org.codehaus.plexus:plexus-compiler-api:jar:1.5.3
[DEBUG]   Included: junit:junit:jar:3.8.1
[DEBUG]   Included: org.codehaus.plexus:plexus-compiler-manager:jar:1.5.3
[DEBUG]   Included: org.codehaus.plexus:plexus-compiler-javac:jar:1.5.3
[DEBUG]   Excluded: org.apache.maven:maven-plugin-api:jar:2.0
[DEBUG]   Excluded: org.codehaus.plexus:plexus-container-default:jar:1.0-alpha-8
[DEBUG]   Excluded: classworlds:classworlds:jar:1.1-alpha-2
[DEBUG]   Excluded: org.apache.maven:maven-artifact:jar:2.0
[DEBUG] Configuring mojo org.apache.maven.plugins:maven-compiler-plugin:2.0.2:compile from
plugin realm ClassRealm[plugin>org.apache.maven.plugins:maven-compiler-plugin:2.0.2, parent:
sun.misc.Launcher$AppClassLoader@182f0db]
[DEBUG] Configuring mojo 'org.apache.maven.plugins:maven-compiler-plugin:2.0.2:compile' with
basic configurator -->
[DEBUG]   (f) basedir = <https://builds.apache.org/job/HBase-0.94-security/ws/trunk>
[DEBUG]   (f) buildDirectory = <https://builds.apache.org/job/HBase-0.94-security/ws/trunk/target>
[DEBUG]   (f) classpathElements = [<https://builds.apache.org/job/HBase-0.94-security/ws/trunk/target/classes,>
/home/jenkins/.m2/repository/com/yammer/metrics/metrics-core/2.1.2/metrics-core-2.1.2.jar,
/home/jenkins/.m2/repository/com/google/guava/guava/11.0.2/guava-11.0.2.jar, /home/jenkins/.m2/repository/com/google/code/findbugs/jsr305/1.3.9/jsr305-1.3.9.jar,
/home/jenkins/.m2/repository/commons-cli/commons-cli/1.2/commons-cli-1.2.jar, /home/jenkins/.m2/repository/commons-configuration/commons-configuration/1.6/commons-configuration-1.6.jar,
/home/jenkins/.m2/repository/commons-collections/commons-collections/3.2.1/commons-collections-3.2.1.jar,
/home/jenkins/.m2/repository/commons-digester/commons-digester/1.8/commons-digester-1.8.jar,
/home/jenkins/.m2/repository/commons-beanutils/commons-beanutils/1.7.0/commons-beanutils-1.7.0.jar,
/home/jenkins/.m2/repository/commons-beanutils/commons-beanutils-core/1.8.0/commons-beanutils-core-1.8.0.jar,
/home/jenkins/.m2/repository/com/github/stephenc/high-scale-lib/high-scale-lib/1.1.1/high-scale-lib-1.1.1.jar,
/home/jenkins/.m2/repository/commons-codec/commons-codec/1.4/commons-codec-1.4.jar, /home/jenkins/.m2/repository/commons-httpclient/commons-httpclient/3.1/commons-httpclient-3.1.jar,
/home/jenkins/.m2/repository/commons-io/commons-io/2.1/commons-io-2.1.jar, /home/jenkins/.m2/repository/commons-lang/commons-lang/2.5/commons-lang-2.5.jar,
/home/jenkins/.m2/repository/commons-logging/commons-logging/1.1.1/commons-logging-1.1.1.jar,
/home/jenkins/.m2/repository/log4j/log4j/1.2.16/log4j-1.2.16.jar, /home/jenkins/.m2/repository/org/apache/avro/avro/1.5.3/avro-1.5.3.jar,
/home/jenkins/.m2/repository/org/xerial/snappy/snappy-java/1.0.3.2/snappy-java-1.0.3.2.jar,
/home/jenkins/.m2/repository/org/apache/avro/avro-ipc/1.5.3/avro-ipc-1.5.3.jar, /home/jenkins/.m2/repository/org/jboss/netty/netty/3.2.4.Final/netty-3.2.4.Final.jar,
/home/jenkins/.m2/repository/org/apache/velocity/velocity/1.7/velocity-1.7.jar, /home/jenkins/.m2/repository/org/apache/zookeeper/zookeeper/3.4.3/zookeeper-3.4.3.jar,
/home/jenkins/.m2/repository/org/apache/thrift/libthrift/0.8.0/libthrift-0.8.0.jar, /home/jenkins/.m2/repository/org/apache/httpcomponents/httpclient/4.1.2/httpclient-4.1.2.jar,
/home/jenkins/.m2/repository/org/apache/httpcomponents/httpcore/4.1.3/httpcore-4.1.3.jar,
/home/jenkins/.m2/repository/org/jruby/jruby-complete/1.6.5/jruby-complete-1.6.5.jar, /home/jenkins/.m2/repository/org/mortbay/jetty/jetty/6.1.26/jetty-6.1.26.jar,
/home/jenkins/.m2/repository/org/mortbay/jetty/jetty-util/6.1.26/jetty-util-6.1.26.jar, /home/jenkins/.m2/repository/org/mortbay/jetty/jsp-2.1/6.1.14/jsp-2.1-6.1.14.jar,
/home/jenkins/.m2/repository/org/eclipse/jdt/core/3.1.1/core-3.1.1.jar, /home/jenkins/.m2/repository/org/mortbay/jetty/jsp-api-2.1/6.1.14/jsp-api-2.1-6.1.14.jar,
/home/jenkins/.m2/repository/org/mortbay/jetty/servlet-api-2.5/6.1.14/servlet-api-2.5-6.1.14.jar,
/home/jenkins/.m2/repository/org/codehaus/jackson/jackson-core-asl/1.8.8/jackson-core-asl-1.8.8.jar,
/home/jenkins/.m2/repository/org/codehaus/jackson/jackson-mapper-asl/1.8.8/jackson-mapper-asl-1.8.8.jar,
/home/jenkins/.m2/repository/org/codehaus/jackson/jackson-jaxrs/1.8.8/jackson-jaxrs-1.8.8.jar,
/home/jenkins/.m2/repository/org/codehaus/jackson/jackson-xc/1.8.8/jackson-xc-1.8.8.jar, /home/jenkins/.m2/repository/org/slf4j/slf4j-api/1.4.3/slf4j-api-1.4.3.jar,
/home/jenkins/.m2/repository/org/slf4j/slf4j-log4j12/1.4.3/slf4j-log4j12-1.4.3.jar, /home/jenkins/.m2/repository/commons-el/commons-el/1.0/commons-el-1.0.jar,
/home/jenkins/.m2/repository/org/jamon/jamon-runtime/2.3.1/jamon-runtime-2.3.1.jar, /home/jenkins/.m2/repository/com/google/protobuf/protobuf-java/2.4.0a/protobuf-java-2.4.0a.jar,
/home/jenkins/.m2/repository/com/sun/jersey/jersey-core/1.8/jersey-core-1.8.jar, /home/jenkins/.m2/repository/com/sun/jersey/jersey-json/1.8/jersey-json-1.8.jar,
/home/jenkins/.m2/repository/org/codehaus/jettison/jettison/1.1/jettison-1.1.jar, /home/jenkins/.m2/repository/com/sun/xml/bind/jaxb-impl/2.2.3-1/jaxb-impl-2.2.3-1.jar,
/home/jenkins/.m2/repository/com/sun/jersey/jersey-server/1.8/jersey-server-1.8.jar, /home/jenkins/.m2/repository/asm/asm/3.1/asm-3.1.jar,
/home/jenkins/.m2/repository/javax/xml/bind/jaxb-api/2.1/jaxb-api-2.1.jar, /home/jenkins/.m2/repository/javax/activation/activation/1.1/activation-1.1.jar,
/home/jenkins/.m2/repository/stax/stax-api/1.0.1/stax-api-1.0.1.jar, /home/jenkins/.m2/repository/org/apache/hadoop/hadoop-core/1.0.3/hadoop-core-1.0.3.jar,
/home/jenkins/.m2/repository/xmlenc/xmlenc/0.52/xmlenc-0.52.jar, /home/jenkins/.m2/repository/commons-net/commons-net/1.4.1/commons-net-1.4.1.jar]
[DEBUG]   (f) compileSourceRoots = [<https://builds.apache.org/job/HBase-0.94-security/ws/trunk/src/main/java,>
<https://builds.apache.org/job/HBase-0.94-security/ws/trunk/target/generated-sources/java,>
<https://builds.apache.org/job/HBase-0.94-security/ws/trunk/target/generated-jamon,>
<https://builds.apache.org/job/HBase-0.94-security/ws/trunk/security/src/main/java]>
[DEBUG]   (f) compilerArgument = -Xlint:-options
[DEBUG]   (f) compilerId = javac
[DEBUG]   (f) debug = true
[DEBUG]   (f) encoding = UTF-8
[DEBUG]   (f) failOnError = true
[DEBUG]   (f) fork = false
[DEBUG]   (f) optimize = false
[DEBUG]   (f) outputDirectory = <https://builds.apache.org/job/HBase-0.94-security/ws/trunk/target/classes>
[DEBUG]   (f) outputFileName = hbase-0.94.2-SNAPSHOT-security
[DEBUG]   (f) projectArtifact = org.apache.hbase:hbase:jar:0.94.2-SNAPSHOT
[DEBUG]   (f) showDeprecation = false
[DEBUG]   (f) showWarnings = true
[DEBUG]   (f) source = 1.6
[DEBUG]   (f) staleMillis = 0
[DEBUG]   (f) target = 1.6
[DEBUG]   (f) verbose = false
[DEBUG] -- end configuration --
[DEBUG] Using compiler 'javac'.
[DEBUG] Source directories: [<https://builds.apache.org/job/HBase-0.94-security/ws/trunk/src/main/java>
 <https://builds.apache.org/job/HBase-0.94-security/ws/trunk/target/generated-sources/java>
 <https://builds.apache.org/job/HBase-0.94-security/ws/trunk/target/generated-jamon>
 <https://builds.apache.org/job/HBase-0.94-security/ws/trunk/security/src/main/java]>
[DEBUG] Classpath: [<https://builds.apache.org/job/HBase-0.94-security/ws/trunk/target/classes>
 /home/jenkins/.m2/repository/com/yammer/metrics/metrics-core/2.1.2/metrics-core-2.1.2.jar
 /home/jenkins/.m2/repository/com/google/guava/guava/11.0.2/guava-11.0.2.jar
 /home/jenkins/.m2/repository/com/google/code/findbugs/jsr305/1.3.9/jsr305-1.3.9.jar
 /home/jenkins/.m2/repository/commons-cli/commons-cli/1.2/commons-cli-1.2.jar
 /home/jenkins/.m2/repository/commons-configuration/commons-configuration/1.6/commons-configuration-1.6.jar
 /home/jenkins/.m2/repository/commons-collections/commons-collections/3.2.1/commons-collections-3.2.1.jar
 /home/jenkins/.m2/repository/commons-digester/commons-digester/1.8/commons-digester-1.8.jar
 /home/jenkins/.m2/repository/commons-beanutils/commons-beanutils/1.7.0/commons-beanutils-1.7.0.jar
 /home/jenkins/.m2/repository/commons-beanutils/commons-beanutils-core/1.8.0/commons-beanutils-core-1.8.0.jar
 /home/jenkins/.m2/repository/com/github/stephenc/high-scale-lib/high-scale-lib/1.1.1/high-scale-lib-1.1.1.jar
 /home/jenkins/.m2/repository/commons-codec/commons-codec/1.4/commons-codec-1.4.jar
 /home/jenkins/.m2/repository/commons-httpclient/commons-httpclient/3.1/commons-httpclient-3.1.jar
 /home/jenkins/.m2/repository/commons-io/commons-io/2.1/commons-io-2.1.jar
 /home/jenkins/.m2/repository/commons-lang/commons-lang/2.5/commons-lang-2.5.jar
 /home/jenkins/.m2/repository/commons-logging/commons-logging/1.1.1/commons-logging-1.1.1.jar
 /home/jenkins/.m2/repository/log4j/log4j/1.2.16/log4j-1.2.16.jar
 /home/jenkins/.m2/repository/org/apache/avro/avro/1.5.3/avro-1.5.3.jar
 /home/jenkins/.m2/repository/org/xerial/snappy/snappy-java/1.0.3.2/snappy-java-1.0.3.2.jar
 /home/jenkins/.m2/repository/org/apache/avro/avro-ipc/1.5.3/avro-ipc-1.5.3.jar
 /home/jenkins/.m2/repository/org/jboss/netty/netty/3.2.4.Final/netty-3.2.4.Final.jar
 /home/jenkins/.m2/repository/org/apache/velocity/velocity/1.7/velocity-1.7.jar
 /home/jenkins/.m2/repository/org/apache/zookeeper/zookeeper/3.4.3/zookeeper-3.4.3.jar
 /home/jenkins/.m2/repository/org/apache/thrift/libthrift/0.8.0/libthrift-0.8.0.jar
 /home/jenkins/.m2/repository/org/apache/httpcomponents/httpclient/4.1.2/httpclient-4.1.2.jar
 /home/jenkins/.m2/repository/org/apache/httpcomponents/httpcore/4.1.3/httpcore-4.1.3.jar
 /home/jenkins/.m2/repository/org/jruby/jruby-complete/1.6.5/jruby-complete-1.6.5.jar
 /home/jenkins/.m2/repository/org/mortbay/jetty/jetty/6.1.26/jetty-6.1.26.jar
 /home/jenkins/.m2/repository/org/mortbay/jetty/jetty-util/6.1.26/jetty-util-6.1.26.jar
 /home/jenkins/.m2/repository/org/mortbay/jetty/jsp-2.1/6.1.14/jsp-2.1-6.1.14.jar
 /home/jenkins/.m2/repository/org/eclipse/jdt/core/3.1.1/core-3.1.1.jar
 /home/jenkins/.m2/repository/org/mortbay/jetty/jsp-api-2.1/6.1.14/jsp-api-2.1-6.1.14.jar
 /home/jenkins/.m2/repository/org/mortbay/jetty/servlet-api-2.5/6.1.14/servlet-api-2.5-6.1.14.jar
 /home/jenkins/.m2/repository/org/codehaus/jackson/jackson-core-asl/1.8.8/jackson-core-asl-1.8.8.jar
 /home/jenkins/.m2/repository/org/codehaus/jackson/jackson-mapper-asl/1.8.8/jackson-mapper-asl-1.8.8.jar
 /home/jenkins/.m2/repository/org/codehaus/jackson/jackson-jaxrs/1.8.8/jackson-jaxrs-1.8.8.jar
 /home/jenkins/.m2/repository/org/codehaus/jackson/jackson-xc/1.8.8/jackson-xc-1.8.8.jar
 /home/jenkins/.m2/repository/org/slf4j/slf4j-api/1.4.3/slf4j-api-1.4.3.jar
 /home/jenkins/.m2/repository/org/slf4j/slf4j-log4j12/1.4.3/slf4j-log4j12-1.4.3.jar
 /home/jenkins/.m2/repository/commons-el/commons-el/1.0/commons-el-1.0.jar
 /home/jenkins/.m2/repository/org/jamon/jamon-runtime/2.3.1/jamon-runtime-2.3.1.jar
 /home/jenkins/.m2/repository/com/google/protobuf/protobuf-java/2.4.0a/protobuf-java-2.4.0a.jar
 /home/jenkins/.m2/repository/com/sun/jersey/jersey-core/1.8/jersey-core-1.8.jar
 /home/jenkins/.m2/repository/com/sun/jersey/jersey-json/1.8/jersey-json-1.8.jar
 /home/jenkins/.m2/repository/org/codehaus/jettison/jettison/1.1/jettison-1.1.jar
 /home/jenkins/.m2/repository/com/sun/xml/bind/jaxb-impl/2.2.3-1/jaxb-impl-2.2.3-1.jar
 /home/jenkins/.m2/repository/com/sun/jersey/jersey-server/1.8/jersey-server-1.8.jar
 /home/jenkins/.m2/repository/asm/asm/3.1/asm-3.1.jar
 /home/jenkins/.m2/repository/javax/xml/bind/jaxb-api/2.1/jaxb-api-2.1.jar
 /home/jenkins/.m2/repository/javax/activation/activation/1.1/activation-1.1.jar
 /home/jenkins/.m2/repository/stax/stax-api/1.0.1/stax-api-1.0.1.jar
 /home/jenkins/.m2/repository/org/apache/hadoop/hadoop-core/1.0.3/hadoop-core-1.0.3.jar
 /home/jenkins/.m2/repository/xmlenc/xmlenc/0.52/xmlenc-0.52.jar
 /home/jenkins/.m2/repository/commons-net/commons-net/1.4.1/commons-net-1.4.1.jar]
[DEBUG] Output directory: <https://builds.apache.org/job/HBase-0.94-security/ws/trunk/target/classes>
[DEBUG] Classpath:
[DEBUG]  <https://builds.apache.org/job/HBase-0.94-security/ws/trunk/target/classes>
[DEBUG]  /home/jenkins/.m2/repository/com/yammer/metrics/metrics-core/2.1.2/metrics-core-2.1.2.jar
[DEBUG]  /home/jenkins/.m2/repository/com/google/guava/guava/11.0.2/guava-11.0.2.jar
[DEBUG]  /home/jenkins/.m2/repository/com/google/code/findbugs/jsr305/1.3.9/jsr305-1.3.9.jar
[DEBUG]  /home/jenkins/.m2/repository/commons-cli/commons-cli/1.2/commons-cli-1.2.jar
[DEBUG]  /home/jenkins/.m2/repository/commons-configuration/commons-configuration/1.6/commons-configuration-1.6.jar
[DEBUG]  /home/jenkins/.m2/repository/commons-collections/commons-collections/3.2.1/commons-collections-3.2.1.jar
[DEBUG]  /home/jenkins/.m2/repository/commons-digester/commons-digester/1.8/commons-digester-1.8.jar
[DEBUG]  /home/jenkins/.m2/repository/commons-beanutils/commons-beanutils/1.7.0/commons-beanutils-1.7.0.jar
[DEBUG]  /home/jenkins/.m2/repository/commons-beanutils/commons-beanutils-core/1.8.0/commons-beanutils-core-1.8.0.jar
[DEBUG]  /home/jenkins/.m2/repository/com/github/stephenc/high-scale-lib/high-scale-lib/1.1.1/high-scale-lib-1.1.1.jar
[DEBUG]  /home/jenkins/.m2/repository/commons-codec/commons-codec/1.4/commons-codec-1.4.jar
[DEBUG]  /home/jenkins/.m2/repository/commons-httpclient/commons-httpclient/3.1/commons-httpclient-3.1.jar
[DEBUG]  /home/jenkins/.m2/repository/commons-io/commons-io/2.1/commons-io-2.1.jar
[DEBUG]  /home/jenkins/.m2/repository/commons-lang/commons-lang/2.5/commons-lang-2.5.jar
[DEBUG]  /home/jenkins/.m2/repository/commons-logging/commons-logging/1.1.1/commons-logging-1.1.1.jar
[DEBUG]  /home/jenkins/.m2/repository/log4j/log4j/1.2.16/log4j-1.2.16.jar
[DEBUG]  /home/jenkins/.m2/repository/org/apache/avro/avro/1.5.3/avro-1.5.3.jar
[DEBUG]  /home/jenkins/.m2/repository/org/xerial/snappy/snappy-java/1.0.3.2/snappy-java-1.0.3.2.jar
[DEBUG]  /home/jenkins/.m2/repository/org/apache/avro/avro-ipc/1.5.3/avro-ipc-1.5.3.jar
[DEBUG]  /home/jenkins/.m2/repository/org/jboss/netty/netty/3.2.4.Final/netty-3.2.4.Final.jar
[DEBUG]  /home/jenkins/.m2/repository/org/apache/velocity/velocity/1.7/velocity-1.7.jar
[DEBUG]  /home/jenkins/.m2/repository/org/apache/zookeeper/zookeeper/3.4.3/zookeeper-3.4.3.jar
[DEBUG]  /home/jenkins/.m2/repository/org/apache/thrift/libthrift/0.8.0/libthrift-0.8.0.jar
[DEBUG]  /home/jenkins/.m2/repository/org/apache/httpcomponents/httpclient/4.1.2/httpclient-4.1.2.jar
[DEBUG]  /home/jenkins/.m2/repository/org/apache/httpcomponents/httpcore/4.1.3/httpcore-4.1.3.jar
[DEBUG]  /home/jenkins/.m2/repository/org/jruby/jruby-complete/1.6.5/jruby-complete-1.6.5.jar
[DEBUG]  /home/jenkins/.m2/repository/org/mortbay/jetty/jetty/6.1.26/jetty-6.1.26.jar
[DEBUG]  /home/jenkins/.m2/repository/org/mortbay/jetty/jetty-util/6.1.26/jetty-util-6.1.26.jar
[DEBUG]  /home/jenkins/.m2/repository/org/mortbay/jetty/jsp-2.1/6.1.14/jsp-2.1-6.1.14.jar
[DEBUG]  /home/jenkins/.m2/repository/org/eclipse/jdt/core/3.1.1/core-3.1.1.jar
[DEBUG]  /home/jenkins/.m2/repository/org/mortbay/jetty/jsp-api-2.1/6.1.14/jsp-api-2.1-6.1.14.jar
[DEBUG]  /home/jenkins/.m2/repository/org/mortbay/jetty/servlet-api-2.5/6.1.14/servlet-api-2.5-6.1.14.jar
[DEBUG]  /home/jenkins/.m2/repository/org/codehaus/jackson/jackson-core-asl/1.8.8/jackson-core-asl-1.8.8.jar
[DEBUG]  /home/jenkins/.m2/repository/org/codehaus/jackson/jackson-mapper-asl/1.8.8/jackson-mapper-asl-1.8.8.jar
[DEBUG]  /home/jenkins/.m2/repository/org/codehaus/jackson/jackson-jaxrs/1.8.8/jackson-jaxrs-1.8.8.jar
[DEBUG]  /home/jenkins/.m2/repository/org/codehaus/jackson/jackson-xc/1.8.8/jackson-xc-1.8.8.jar
[DEBUG]  /home/jenkins/.m2/repository/org/slf4j/slf4j-api/1.4.3/slf4j-api-1.4.3.jar
[DEBUG]  /home/jenkins/.m2/repository/org/slf4j/slf4j-log4j12/1.4.3/slf4j-log4j12-1.4.3.jar
[DEBUG]  /home/jenkins/.m2/repository/commons-el/commons-el/1.0/commons-el-1.0.jar
[DEBUG]  /home/jenkins/.m2/repository/org/jamon/jamon-runtime/2.3.1/jamon-runtime-2.3.1.jar
[DEBUG]  /home/jenkins/.m2/repository/com/google/protobuf/protobuf-java/2.4.0a/protobuf-java-2.4.0a.jar
[DEBUG]  /home/jenkins/.m2/repository/com/sun/jersey/jersey-core/1.8/jersey-core-1.8.jar
[DEBUG]  /home/jenkins/.m2/repository/com/sun/jersey/jersey-json/1.8/jersey-json-1.8.jar
[DEBUG]  /home/jenkins/.m2/repository/org/codehaus/jettison/jettison/1.1/jettison-1.1.jar
[DEBUG]  /home/jenkins/.m2/repository/com/sun/xml/bind/jaxb-impl/2.2.3-1/jaxb-impl-2.2.3-1.jar
[DEBUG]  /home/jenkins/.m2/repository/com/sun/jersey/jersey-server/1.8/jersey-server-1.8.jar
[DEBUG]  /home/jenkins/.m2/repository/asm/asm/3.1/asm-3.1.jar
[DEBUG]  /home/jenkins/.m2/repository/javax/xml/bind/jaxb-api/2.1/jaxb-api-2.1.jar
[DEBUG]  /home/jenkins/.m2/repository/javax/activation/activation/1.1/activation-1.1.jar
[DEBUG]  /home/jenkins/.m2/repository/stax/stax-api/1.0.1/stax-api-1.0.1.jar
[DEBUG]  /home/jenkins/.m2/repository/org/apache/hadoop/hadoop-core/1.0.3/hadoop-core-1.0.3.jar
[DEBUG]  /home/jenkins/.m2/repository/xmlenc/xmlenc/0.52/xmlenc-0.52.jar
[DEBUG]  /home/jenkins/.m2/repository/commons-net/commons-net/1.4.1/commons-net-1.4.1.jar
[DEBUG] Source roots:
[DEBUG]  <https://builds.apache.org/job/HBase-0.94-security/ws/trunk/src/main/java>
[DEBUG]  <https://builds.apache.org/job/HBase-0.94-security/ws/trunk/target/generated-sources/java>
[DEBUG]  <https://builds.apache.org/job/HBase-0.94-security/ws/trunk/target/generated-jamon>
[DEBUG]  <https://builds.apache.org/job/HBase-0.94-security/ws/trunk/security/src/main/java>
[INFO] Compiling 733 source files to <https://builds.apache.org/job/HBase-0.94-security/ws/trunk/target/classes>
[INFO] ------------------------------------------------------------------------
[INFO] BUILD FAILURE
[INFO] ------------------------------------------------------------------------
[INFO] Total time: 46.217s
[INFO] Finished at: Wed Aug 22 13:48:00 UTC 2012
[INFO] Final Memory: 46M/885M
[INFO] ------------------------------------------------------------------------
[ERROR] Failed to execute goal org.apache.maven.plugins:maven-compiler-plugin:2.0.2:compile
(default-compile) on project hbase: Compilation failure: Compilation failure:
[ERROR] <https://builds.apache.org/job/HBase-0.94-security/ws/trunk/src/main/java/org/apache/hadoop/hbase/util/Bytes.java>:[45,15]
sun.misc.Unsafe is Sun proprietary API and may be removed in a future release
[ERROR] 
[ERROR] <https://builds.apache.org/job/HBase-0.94-security/ws/trunk/src/main/java/org/apache/hadoop/hbase/util/Bytes.java>:[1036,19]
sun.misc.Unsafe is Sun proprietary API and may be removed in a future release
[ERROR] 
[ERROR] <https://builds.apache.org/job/HBase-0.94-security/ws/trunk/src/main/java/org/apache/hadoop/hbase/util/Bytes.java>:[1042,21]
sun.misc.Unsafe is Sun proprietary API and may be removed in a future release
[ERROR] 
[ERROR] <https://builds.apache.org/job/HBase-0.94-security/ws/trunk/src/main/java/org/apache/hadoop/hbase/util/Bytes.java>:[1047,28]
sun.misc.Unsafe is Sun proprietary API and may be removed in a future release
[ERROR] 
[ERROR] <https://builds.apache.org/job/HBase-0.94-security/ws/trunk/security/src/main/java/org/apache/hadoop/hbase/ipc/SecureClient.java>:[496,32]
'void' type not allowed here
[ERROR] -> [Help 1]
org.apache.maven.lifecycle.LifecycleExecutionException: Failed to execute goal org.apache.maven.plugins:maven-compiler-plugin:2.0.2:compile
(default-compile) on project hbase: Compilation failure
	at org.apache.maven.lifecycle.internal.MojoExecutor.execute(MojoExecutor.java:213)
	at org.apache.maven.lifecycle.internal.MojoExecutor.execute(MojoExecutor.java:153)
	at org.apache.maven.lifecycle.internal.MojoExecutor.execute(MojoExecutor.java:145)
	at org.apache.maven.lifecycle.internal.MojoExecutor.executeForkedExecutions(MojoExecutor.java:365)
	at org.apache.maven.lifecycle.internal.MojoExecutor.execute(MojoExecutor.java:199)
	at org.apache.maven.lifecycle.internal.MojoExecutor.execute(MojoExecutor.java:153)
	at org.apache.maven.lifecycle.internal.MojoExecutor.execute(MojoExecutor.java:145)
	at org.apache.maven.lifecycle.internal.LifecycleModuleBuilder.buildProject(LifecycleModuleBuilder.java:84)
	at org.apache.maven.lifecycle.internal.LifecycleModuleBuilder.buildProject(LifecycleModuleBuilder.java:59)
	at org.apache.maven.lifecycle.internal.LifecycleStarter.singleThreadedBuild(LifecycleStarter.java:183)
	at org.apache.maven.lifecycle.internal.LifecycleStarter.execute(LifecycleStarter.java:161)
	at org.apache.maven.DefaultMaven.doExecute(DefaultMaven.java:319)
	at org.apache.maven.DefaultMaven.execute(DefaultMaven.java:156)
	at org.apache.maven.cli.MavenCli.execute(MavenCli.java:537)
	at org.apache.maven.cli.MavenCli.doMain(MavenCli.java:196)
	at org.apache.maven.cli.MavenCli.main(MavenCli.java:141)
	at sun.reflect.NativeMethodAccessorImpl.invoke0(Native Method)
	at sun.reflect.NativeMethodAccessorImpl.invoke(NativeMethodAccessorImpl.java:39)
	at sun.reflect.DelegatingMethodAccessorImpl.invoke(DelegatingMethodAccessorImpl.java:25)
	at java.lang.reflect.Method.invoke(Method.java:597)
	at org.codehaus.plexus.classworlds.launcher.Launcher.launchEnhanced(Launcher.java:290)
	at org.codehaus.plexus.classworlds.launcher.Launcher.launch(Launcher.java:230)
	at org.codehaus.plexus.classworlds.launcher.Launcher.mainWithExitCode(Launcher.java:409)
	at org.codehaus.plexus.classworlds.launcher.Launcher.main(Launcher.java:352)
Caused by: org.apache.maven.plugin.CompilationFailureException: Compilation failure
	at org.apache.maven.plugin.AbstractCompilerMojo.execute(AbstractCompilerMojo.java:516)
	at org.apache.maven.plugin.CompilerMojo.execute(CompilerMojo.java:114)
	at org.apache.maven.plugin.DefaultBuildPluginManager.executeMojo(DefaultBuildPluginManager.java:101)
	at org.apache.maven.lifecycle.internal.MojoExecutor.execute(MojoExecutor.java:209)
	... 23 more
[ERROR] 
[ERROR] 
[ERROR] For more information about the errors and possible solutions, please read the following
articles:
[ERROR] [Help 1] http://cwiki.apache.org/confluence/display/MAVEN/MojoFailureException
Build step 'Invoke top-level Maven targets' marked build as failure
Archiving artifacts
Updating HBASE-6378
Updating HBASE-6593
Updating HBASE-6562
Updating HBASE-6478
Updating HBASE-6561
Updating HBASE-6263
Updating HBASE-6621
Updating HBASE-6160
Updating HBASE-6444
Updating HBASE-6522
Updating HBASE-6503
Updating HBASE-6520
Updating HBASE-5728
Updating HBASE-6525
Updating HBASE-6602
Updating HBASE-6523
Updating HBASE-6603
Updating HBASE-6565
Updating HBASE-4054
Updating HBASE-6577
Updating HBASE-5022
Updating HBASE-6576
Updating HBASE-6471
Updating HBASE-6608
Updating HBASE-6373
Updating HBASE-6579
Updating HBASE-6505
Updating HBASE-6596
Updating HBASE-6308
Updating HBASE-6632
Updating HBASE-6631
Updating HBASE-6364
Updating HBASE-6538
Updating HBASE-6512
Updating HBASE-6552
Updating HBASE-5714
Recording test results

Mime
View raw message