hbase-dev mailing list archives

Site index · List index
Message view « Date » · « Thread »
Top « Date » · « Thread »
From Apache Jenkins Server <jenk...@builds.apache.org>
Subject Build failed in Jenkins: hbase-0.90 #522
Date Mon, 20 Aug 2012 23:37:21 GMT
See <https://builds.apache.org/job/hbase-0.90/522/changes>

Changes:

[jmhsieh] HBASE-5714 Add write permissions check before any hbck run that modifies hdfs (Liang
Xie)

------------------------------------------
[...truncated 1289 lines...]
Tests run: 3, Failures: 0, Errors: 0, Skipped: 0, Time elapsed: 6.488 sec
Running org.apache.hadoop.hbase.rest.model.TestVersionModel
Tests run: 3, Failures: 0, Errors: 0, Skipped: 0, Time elapsed: 0.1 sec
Running org.apache.hadoop.hbase.rest.model.TestCellSetModel
Tests run: 3, Failures: 0, Errors: 0, Skipped: 0, Time elapsed: 0.103 sec
Running org.apache.hadoop.hbase.rest.model.TestStorageClusterStatusModel
Tests run: 3, Failures: 0, Errors: 0, Skipped: 0, Time elapsed: 0.105 sec
Running org.apache.hadoop.hbase.rest.client.TestRemoteTable
Tests run: 3, Failures: 0, Errors: 0, Skipped: 0, Time elapsed: 25.336 sec
Running org.apache.hadoop.hbase.avro.TestAvroServer
Tests run: 3, Failures: 0, Errors: 3, Skipped: 0, Time elapsed: 14.978 sec <<< FAILURE!
Running org.apache.hadoop.hbase.TestFullLogReconstruction
Tests run: 1, Failures: 0, Errors: 0, Skipped: 0, Time elapsed: 52.677 sec
Running org.apache.hadoop.hbase.TestSerialization
Tests run: 19, Failures: 0, Errors: 0, Skipped: 0, Time elapsed: 0.058 sec
Running org.apache.hadoop.hbase.regionserver.TestKeyValueHeap
Tests run: 3, Failures: 0, Errors: 0, Skipped: 0, Time elapsed: 0.067 sec
Running org.apache.hadoop.hbase.regionserver.TestStoreScanner
Tests run: 14, Failures: 0, Errors: 0, Skipped: 0, Time elapsed: 0.025 sec
Running org.apache.hadoop.hbase.TestHMsg
Tests run: 2, Failures: 0, Errors: 0, Skipped: 0, Time elapsed: 0.018 sec
Running org.apache.hadoop.hbase.io.hfile.TestReseekTo
Tests run: 1, Failures: 0, Errors: 0, Skipped: 0, Time elapsed: 0.168 sec
Running org.apache.hadoop.hbase.mapreduce.TestLoadIncrementalHFilesSplitRecovery
Tests run: 4, Failures: 0, Errors: 0, Skipped: 0, Time elapsed: 24.367 sec
Running org.apache.hadoop.hbase.util.TestIncrementingEnvironmentEdge
Tests run: 1, Failures: 0, Errors: 0, Skipped: 0, Time elapsed: 0.013 sec
Running org.apache.hadoop.hbase.util.TestKeying
Tests run: 1, Failures: 0, Errors: 0, Skipped: 0, Time elapsed: 0.019 sec
Running org.apache.hadoop.hbase.regionserver.TestHRegionInfo
Tests run: 3, Failures: 0, Errors: 0, Skipped: 0, Time elapsed: 0.013 sec
Running org.apache.hadoop.hbase.regionserver.TestScanner
Tests run: 6, Failures: 0, Errors: 0, Skipped: 0, Time elapsed: 62.719 sec
Running org.apache.hadoop.hbase.util.TestHBaseFsck
Tests run: 21, Failures: 0, Errors: 0, Skipped: 0, Time elapsed: 154.87 sec
Running org.apache.hadoop.hbase.master.TestRestartCluster
Tests run: 2, Failures: 0, Errors: 0, Skipped: 0, Time elapsed: 39.503 sec
Running org.apache.hadoop.hbase.client.TestShell
Tests run: 1, Failures: 0, Errors: 0, Skipped: 0, Time elapsed: 33.757 sec
Running org.apache.hadoop.hbase.rest.model.TestTableInfoModel
Tests run: 3, Failures: 0, Errors: 0, Skipped: 0, Time elapsed: 0.102 sec
Running org.apache.hadoop.hbase.TestInfoServers
Tests run: 1, Failures: 0, Errors: 0, Skipped: 0, Time elapsed: 12.207 sec
Running org.apache.hadoop.hbase.master.TestLogsCleaner
Tests run: 1, Failures: 0, Errors: 0, Skipped: 0, Time elapsed: 0.567 sec
Running org.apache.hadoop.hbase.regionserver.TestMasterAddressManager
Tests run: 1, Failures: 0, Errors: 0, Skipped: 0, Time elapsed: 0.166 sec
Running org.apache.hadoop.hbase.catalog.TestCatalogTrackerOnCluster
Tests run: 1, Failures: 0, Errors: 0, Skipped: 0, Time elapsed: 205.299 sec
Running org.apache.hadoop.hbase.regionserver.TestQueryMatcher
Tests run: 4, Failures: 0, Errors: 0, Skipped: 0, Time elapsed: 0.06 sec
Running org.apache.hadoop.hbase.zookeeper.TestZKTable
Tests run: 1, Failures: 0, Errors: 0, Skipped: 0, Time elapsed: 0.161 sec
Running org.apache.hadoop.hbase.client.TestAdmin
Tests run: 24, Failures: 0, Errors: 0, Skipped: 0, Time elapsed: 206.904 sec
Running org.apache.hadoop.hbase.util.TestMergeTool
Tests run: 1, Failures: 0, Errors: 0, Skipped: 0, Time elapsed: 17.25 sec
Running org.apache.hadoop.hbase.regionserver.TestPriorityCompactionQueue
Tests run: 1, Failures: 0, Errors: 0, Skipped: 0, Time elapsed: 1.104 sec
Running org.apache.hadoop.hbase.TestAcidGuarantees
Tests run: 3, Failures: 0, Errors: 0, Skipped: 3, Time elapsed: 0.012 sec
Running org.apache.hadoop.hbase.util.TestBase64
Tests run: 1, Failures: 0, Errors: 0, Skipped: 0, Time elapsed: 0.014 sec
Running org.apache.hadoop.hbase.regionserver.TestMemStore
Tests run: 21, Failures: 0, Errors: 0, Skipped: 0, Time elapsed: 40.393 sec
Running org.apache.hadoop.hbase.rest.TestScannerResource
Tests run: 5, Failures: 0, Errors: 0, Skipped: 0, Time elapsed: 38.911 sec
Running org.apache.hadoop.hbase.io.hfile.TestLruBlockCache
Tests run: 7, Failures: 0, Errors: 0, Skipped: 0, Time elapsed: 1.065 sec
Running org.apache.hadoop.hbase.master.TestDeadServer
Tests run: 1, Failures: 0, Errors: 0, Skipped: 0, Time elapsed: 0.015 sec
Running org.apache.hadoop.hbase.rest.TestGzipFilter
Tests run: 3, Failures: 0, Errors: 0, Skipped: 0, Time elapsed: 16.593 sec
Running org.apache.hadoop.hbase.TestKeyValue
Tests run: 14, Failures: 0, Errors: 0, Skipped: 0, Time elapsed: 0.023 sec
Running org.apache.hadoop.hbase.mapreduce.TestTableMapReduce
Tests run: 2, Failures: 0, Errors: 0, Skipped: 0, Time elapsed: 49.088 sec
Running org.apache.hadoop.hbase.client.TestMultiParallel
Tests run: 10, Failures: 0, Errors: 0, Skipped: 0, Time elapsed: 24.873 sec
Running org.apache.hadoop.hbase.master.TestMaster
Tests run: 1, Failures: 0, Errors: 0, Skipped: 0, Time elapsed: 73.056 sec
Running org.apache.hadoop.hbase.master.TestRollingRestart
Running org.apache.hadoop.hbase.client.TestResult
Tests run: 3, Failures: 0, Errors: 0, Skipped: 0, Time elapsed: 0.056 sec
Running org.apache.hadoop.hbase.client.TestHTablePool
Tests run: 5, Failures: 0, Errors: 0, Skipped: 0, Time elapsed: 16.316 sec
Running org.apache.hadoop.hbase.master.TestOpenedRegionHandler
Tests run: 2, Failures: 0, Errors: 0, Skipped: 0, Time elapsed: 18.174 sec
Running org.apache.hadoop.hbase.util.TestByteBloomFilter
Tests run: 3, Failures: 0, Errors: 0, Skipped: 0, Time elapsed: 1.099 sec
Running org.apache.hadoop.hbase.rest.model.TestTableSchemaModel
Tests run: 3, Failures: 0, Errors: 0, Skipped: 0, Time elapsed: 0.124 sec
Running org.apache.hadoop.hbase.filter.TestFilterList
Tests run: 4, Failures: 0, Errors: 0, Skipped: 0, Time elapsed: 0.031 sec
Running org.apache.hadoop.hbase.mapreduce.TestTableInputFormatScan
Tests run: 11, Failures: 0, Errors: 0, Skipped: 0, Time elapsed: 310.608 sec
Running org.apache.hadoop.hbase.regionserver.TestHRegion
Tests run: 54, Failures: 0, Errors: 0, Skipped: 0, Time elapsed: 11.074 sec
Running org.apache.hadoop.hbase.rest.model.TestTableRegionModel
Tests run: 4, Failures: 0, Errors: 0, Skipped: 0, Time elapsed: 0.033 sec
Running org.apache.hadoop.hbase.master.TestMasterFailover
Tests run: 4, Failures: 0, Errors: 0, Skipped: 0, Time elapsed: 69.045 sec
Running org.apache.hadoop.hbase.client.TestTimestampsFilter
Tests run: 3, Failures: 0, Errors: 0, Skipped: 0, Time elapsed: 27.049 sec
Running org.apache.hadoop.hbase.util.TestRootPath
Tests run: 1, Failures: 0, Errors: 0, Skipped: 0, Time elapsed: 0.017 sec
Running org.apache.hadoop.hbase.master.TestLoadBalancer
Tests run: 7, Failures: 0, Errors: 0, Skipped: 0, Time elapsed: 1.614 sec
Running org.apache.hadoop.hbase.mapred.TestTableMapReduce
Tests run: 1, Failures: 0, Errors: 0, Skipped: 0, Time elapsed: 31.538 sec
Running org.apache.hadoop.hbase.client.TestScannerTimeout
Tests run: 4, Failures: 0, Errors: 0, Skipped: 0, Time elapsed: 44.647 sec
Running org.apache.hadoop.hbase.regionserver.wal.TestWALObserver
Tests run: 1, Failures: 0, Errors: 0, Skipped: 0, Time elapsed: 0.139 sec
Running org.apache.hadoop.hbase.util.TestBytes
Tests run: 10, Failures: 0, Errors: 0, Skipped: 0, Time elapsed: 0.017 sec
Running org.apache.hadoop.hbase.replication.regionserver.TestReplicationSourceManager
Tests run: 1, Failures: 0, Errors: 0, Skipped: 0, Time elapsed: 0.485 sec
Running org.apache.hadoop.hbase.master.TestActiveMasterManager
Tests run: 2, Failures: 0, Errors: 0, Skipped: 0, Time elapsed: 0.225 sec
Running org.apache.hadoop.hbase.util.TestCompressionTest
Tests run: 1, Failures: 0, Errors: 0, Skipped: 0, Time elapsed: 0.019 sec
Running org.apache.hadoop.hbase.filter.TestDependentColumnFilter
Tests run: 2, Failures: 0, Errors: 0, Skipped: 0, Time elapsed: 0.176 sec
Running org.apache.hadoop.hbase.client.TestGetRowVersions
Tests run: 1, Failures: 0, Errors: 0, Skipped: 0, Time elapsed: 34.915 sec
Running org.apache.hadoop.hbase.rest.model.TestCellModel
Tests run: 3, Failures: 0, Errors: 0, Skipped: 0, Time elapsed: 0.1 sec
Running org.apache.hadoop.hbase.replication.TestReplicationSource
Tests run: 1, Failures: 0, Errors: 0, Skipped: 0, Time elapsed: 1.091 sec
Running org.apache.hadoop.hbase.master.TestCatalogJanitor
Tests run: 2, Failures: 0, Errors: 0, Skipped: 0, Time elapsed: 0.379 sec
Running org.apache.hadoop.hbase.catalog.TestCatalogTracker
Tests run: 9, Failures: 0, Errors: 0, Skipped: 0, Time elapsed: 3.391 sec
Running org.apache.hadoop.hbase.util.TestRegionSplitCalculator
Tests run: 15, Failures: 0, Errors: 0, Skipped: 0, Time elapsed: 0.055 sec
Running org.apache.hadoop.hbase.rest.TestRowResource
Tests run: 11, Failures: 0, Errors: 0, Skipped: 0, Time elapsed: 18.275 sec
Running org.apache.hadoop.hbase.io.hfile.TestHFile
Tests run: 7, Failures: 0, Errors: 0, Skipped: 0, Time elapsed: 0.179 sec
Running org.apache.hadoop.hbase.catalog.TestMetaReaderEditor
Tests run: 4, Failures: 0, Errors: 0, Skipped: 0, Time elapsed: 18.558 sec
Running org.apache.hadoop.hbase.util.TestStrings
Tests run: 1, Failures: 0, Errors: 0, Skipped: 0, Time elapsed: 0.013 sec
Running org.apache.hadoop.hbase.util.TestHBaseFsckComparator
Tests run: 7, Failures: 0, Errors: 0, Skipped: 0, Time elapsed: 0.133 sec
Running org.apache.hadoop.hbase.mapreduce.TestImportTsv
Tests run: 7, Failures: 0, Errors: 0, Skipped: 0, Time elapsed: 15.622 sec
Running org.apache.hadoop.hbase.rest.client.TestRemoteAdmin
Tests run: 2, Failures: 0, Errors: 0, Skipped: 0, Time elapsed: 20.004 sec
Running org.apache.hadoop.hbase.regionserver.wal.TestHLog
Tests run: 8, Failures: 0, Errors: 0, Skipped: 0, Time elapsed: 83.298 sec
Running org.apache.hadoop.hbase.client.TestTimestamp
Tests run: 1, Failures: 0, Errors: 0, Skipped: 0, Time elapsed: 13.098 sec
Running org.apache.hadoop.hbase.TestScanMultipleVersions
Tests run: 1, Failures: 0, Errors: 0, Skipped: 0, Time elapsed: 12.532 sec
Running org.apache.hadoop.hbase.rest.model.TestStorageClusterVersionModel
Tests run: 2, Failures: 0, Errors: 0, Skipped: 0, Time elapsed: 0.024 sec
Running org.apache.hadoop.hbase.client.TestHCM
Tests run: 4, Failures: 0, Errors: 0, Skipped: 0, Time elapsed: 45.577 sec

Results :

Tests in error: 

Tests run: 733, Failures: 0, Errors: 3, Skipped: 9

[INFO] ------------------------------------------------------------------------
[INFO] BUILD FAILURE
[INFO] ------------------------------------------------------------------------
[INFO] Total time: 1:21:10.604s
[INFO] Finished at: Mon Aug 20 23:37:06 UTC 2012
[INFO] Final Memory: 36M/533M
[INFO] ------------------------------------------------------------------------
[ERROR] Failed to execute goal org.apache.maven.plugins:maven-surefire-plugin:2.4.3:test (default-test)
on project hbase: There are test failures.
[ERROR] 
[ERROR] Please refer to /x1/jenkins/jenkins-slave/workspace/hbase-0.90/trunk/target/surefire-reports
for the individual test results.
[ERROR] -> [Help 1]
[ERROR] 
[ERROR] To see the full stack trace of the errors, re-run Maven with the -e switch.
[ERROR] Re-run Maven using the -X switch to enable full debug logging.
[ERROR] 
[ERROR] For more information about the errors and possible solutions, please read the following
articles:
[ERROR] [Help 1] http://cwiki.apache.org/confluence/display/MAVEN/MojoFailureException
Build step 'Invoke top-level Maven targets' marked build as failure
[locks-and-latches] Releasing all the locks
[locks-and-latches] All the locks released
Archiving artifacts
Recording test results
ERROR: Failed to archive test reports
hudson.util.IOException2: remote file operation failed: <https://builds.apache.org/job/hbase-0.90/ws/>
at hudson.remoting.Channel@41196ce4:ubuntu3
	at hudson.FilePath.act(FilePath.java:838)
	at hudson.FilePath.act(FilePath.java:824)
	at hudson.tasks.junit.JUnitParser.parse(JUnitParser.java:87)
	at hudson.tasks.junit.JUnitResultArchiver.parse(JUnitResultArchiver.java:122)
	at hudson.tasks.junit.JUnitResultArchiver.perform(JUnitResultArchiver.java:134)
	at hudson.tasks.BuildStepMonitor$1.perform(BuildStepMonitor.java:19)
	at hudson.model.AbstractBuild$AbstractBuildExecution.perform(AbstractBuild.java:717)
	at hudson.model.AbstractBuild$AbstractBuildExecution.performAllBuildSteps(AbstractBuild.java:692)
	at hudson.model.Build$BuildExecution.post2(Build.java:183)
	at hudson.model.AbstractBuild$AbstractBuildExecution.post(AbstractBuild.java:639)
	at hudson.model.Run.execute(Run.java:1513)
	at hudson.model.FreeStyleBuild.run(FreeStyleBuild.java:46)
	at hudson.model.ResourceController.execute(ResourceController.java:88)
	at hudson.model.Executor.run(Executor.java:236)
Caused by: hudson.util.IOException2: Failed to read <https://builds.apache.org/job/hbase-0.90/522/artifact/trunk/target/surefire-reports/TEST-org.apache.hadoop.hbase.master.TestRollingRestart.xml>
	at hudson.tasks.junit.TestResult.parse(TestResult.java:244)
	at hudson.tasks.junit.TestResult.parse(TestResult.java:163)
	at hudson.tasks.junit.TestResult.parse(TestResult.java:140)
	at hudson.tasks.junit.TestResult.<init>(TestResult.java:116)
	at hudson.tasks.junit.JUnitParser$ParseResultCallable.invoke(JUnitParser.java:117)
	at hudson.tasks.junit.JUnitParser$ParseResultCallable.invoke(JUnitParser.java:90)
	at hudson.FilePath$FileCallableWrapper.call(FilePath.java:2196)
	at hudson.remoting.UserRequest.perform(UserRequest.java:118)
	at hudson.remoting.UserRequest.perform(UserRequest.java:48)
	at hudson.remoting.Request$2.run(Request.java:326)
	at hudson.remoting.InterceptingExecutorService$1.call(InterceptingExecutorService.java:72)
	at java.util.concurrent.FutureTask$Sync.innerRun(FutureTask.java:303)
	at java.util.concurrent.FutureTask.run(FutureTask.java:138)
	at java.util.concurrent.ThreadPoolExecutor$Worker.runTask(ThreadPoolExecutor.java:886)
	at java.util.concurrent.ThreadPoolExecutor$Worker.run(ThreadPoolExecutor.java:908)
	at java.lang.Thread.run(Thread.java:662)
Caused by: org.dom4j.DocumentException: Error on line 101 of document file://<https://builds.apache.org/job/hbase-0.90/522/artifact/trunk/target/surefire-reports/TEST-org.apache.hadoop.hbase.master.TestRollingRestart.xml>
: XML document structures must start and end within the same entity. Nested exception: XML
document structures must start and end within the same entity.
	at org.dom4j.io.SAXReader.read(SAXReader.java:482)
	at org.dom4j.io.SAXReader.read(SAXReader.java:264)
	at hudson.tasks.junit.SuiteResult.parse(SuiteResult.java:112)
	at hudson.tasks.junit.TestResult.parse(TestResult.java:227)
	... 15 more
Caused by: org.xml.sax.SAXParseException; systemId: file://<https://builds.apache.org/job/hbase-0.90/522/artifact/trunk/target/surefire-reports/TEST-org.apache.hadoop.hbase.master.TestRollingRestart.xml;>
lineNumber: 101; columnNumber: 17; XML document structures must start and end within the same
entity.
	at com.sun.org.apache.xerces.internal.util.ErrorHandlerWrapper.createSAXParseException(ErrorHandlerWrapper.java:195)
	at com.sun.org.apache.xerces.internal.util.ErrorHandlerWrapper.fatalError(ErrorHandlerWrapper.java:174)
	at com.sun.org.apache.xerces.internal.impl.XMLErrorReporter.reportError(XMLErrorReporter.java:388)
	at com.sun.org.apache.xerces.internal.impl.XMLScanner.reportFatalError(XMLScanner.java:1414)
	at com.sun.org.apache.xerces.internal.impl.XMLDocumentFragmentScannerImpl.endEntity(XMLDocumentFragmentScannerImpl.java:905)
	at com.sun.org.apache.xerces.internal.impl.XMLDocumentScannerImpl.endEntity(XMLDocumentScannerImpl.java:605)
	at com.sun.org.apache.xerces.internal.impl.XMLEntityManager.endEntity(XMLEntityManager.java:1393)
	at com.sun.org.apache.xerces.internal.impl.XMLEntityScanner.load(XMLEntityScanner.java:1763)
	at com.sun.org.apache.xerces.internal.impl.XMLEntityScanner.peekChar(XMLEntityScanner.java:487)
	at com.sun.org.apache.xerces.internal.impl.XMLDocumentFragmentScannerImpl$FragmentContentDriver.next(XMLDocumentFragmentScannerImpl.java:2687)
	at com.sun.org.apache.xerces.internal.impl.XMLDocumentScannerImpl.next(XMLDocumentScannerImpl.java:648)
	at com.sun.org.apache.xerces.internal.impl.XMLNSDocumentScannerImpl.next(XMLNSDocumentScannerImpl.java:140)
	at com.sun.org.apache.xerces.internal.impl.XMLDocumentFragmentScannerImpl.scanDocument(XMLDocumentFragmentScannerImpl.java:511)
	at com.sun.org.apache.xerces.internal.parsers.XML11Configuration.parse(XML11Configuration.java:808)
	at com.sun.org.apache.xerces.internal.parsers.XML11Configuration.parse(XML11Configuration.java:737)
	at com.sun.org.apache.xerces.internal.parsers.XMLParser.parse(XMLParser.java:119)
	at com.sun.org.apache.xerces.internal.parsers.AbstractSAXParser.parse(AbstractSAXParser.java:1205)
	at com.sun.org.apache.xerces.internal.jaxp.SAXParserImpl$JAXPSAXParser.parse(SAXParserImpl.java:522)
	at org.dom4j.io.SAXReader.read(SAXReader.java:465)
	... 18 more

Mime
View raw message