hbase-dev mailing list archives

Site index · List index
Message view « Date » · « Thread »
Top « Date » · « Thread »
From Apache Jenkins Server <jenk...@builds.apache.org>
Subject Build failed in Jenkins: HBase-0.92-security #116
Date Thu, 23 Aug 2012 08:55:34 GMT
See <https://builds.apache.org/job/HBase-0.92-security/116/changes>

Changes:

[stack] HBASE-5549 Master can fail if ZooKeeper session expires

[stack] HBASE-6632 [0.92 UNIT TESTS] testCreateTableRPCTimeOut sets rpc timeout to 1500ms
and leaves it (testHundredsOfTable fails w/ 1500ms timeout)

[stack] HBASE-6631 TestHMasterRPCException in 0.92 failed twice on socket timeout

[jmhsieh] HBASE-5714 Add write permissions check before any hbck run that modifies hdfs (Liang
Xie)

[stack] HBASE-6503 HBase Shell Documentation For DROP Is Outdated

[tedyu] HBASE-6608 Fix for HBASE-6160, META entries from daughters can be deleted before parent
entries, shouldn't compare HRegionInfo's (Enis)

[stack] HBASE-6538 Remove copy_table.rb script

[apurtell] HBASE-6565. Coprocessor exec result Map is not thread safe (Yuan Kang)

[tedyu] HBASE-6576 HBaseAdmin.createTable should wait until the table is enabled (Gregory)

[apurtell] HBASE-6308. Coprocessors should be loaded in a custom ClassLoader (James Baldassari)

[jmhsieh] HBASE-6512 Incorrect OfflineMetaRepair log class name (Liang Xie)

[jmhsieh] HBASE-6552 TestAcidGuarantees system test should flush more aggresively (Gregory
Chanan)

------------------------------------------
[...truncated 7221 lines...]
Running org.apache.hadoop.hbase.regionserver.TestStoreFileBlockCacheSummary
Tests run: 1, Failures: 0, Errors: 0, Skipped: 0, Time elapsed: 18.584 sec
Forking command line: /bin/sh -c cd <https://builds.apache.org/job/HBase-0.92-security/ws/trunk>
&& /home/jenkins/tools/java/jdk1.6.0_27-32/jre/bin/java -enableassertions -Xmx1400m
-Djava.security.egd=file:/dev/./urandom -jar <https://builds.apache.org/job/HBase-0.92-security/ws/trunk/target/surefire/surefirebooter5778637714485715579.jar>
<https://builds.apache.org/job/HBase-0.92-security/ws/trunk/target/surefire/surefire7704681835043642549tmp>
<https://builds.apache.org/job/HBase-0.92-security/ws/trunk/target/surefire/surefire7073425818076808580tmp>
Running org.apache.hadoop.hbase.regionserver.TestStore
Tests run: 11, Failures: 0, Errors: 0, Skipped: 0, Time elapsed: 1.912 sec
Forking command line: /bin/sh -c cd <https://builds.apache.org/job/HBase-0.92-security/ws/trunk>
&& /home/jenkins/tools/java/jdk1.6.0_27-32/jre/bin/java -enableassertions -Xmx1400m
-Djava.security.egd=file:/dev/./urandom -jar <https://builds.apache.org/job/HBase-0.92-security/ws/trunk/target/surefire/surefirebooter2344393719139743006.jar>
<https://builds.apache.org/job/HBase-0.92-security/ws/trunk/target/surefire/surefire3907716436425314334tmp>
<https://builds.apache.org/job/HBase-0.92-security/ws/trunk/target/surefire/surefire8446837019272655519tmp>
Running org.apache.hadoop.hbase.regionserver.TestBlocksRead
Tests run: 3, Failures: 0, Errors: 0, Skipped: 0, Time elapsed: 1.1 sec
Forking command line: /bin/sh -c cd <https://builds.apache.org/job/HBase-0.92-security/ws/trunk>
&& /home/jenkins/tools/java/jdk1.6.0_27-32/jre/bin/java -enableassertions -Xmx1400m
-Djava.security.egd=file:/dev/./urandom -jar <https://builds.apache.org/job/HBase-0.92-security/ws/trunk/target/surefire/surefirebooter5279812272795697327.jar>
<https://builds.apache.org/job/HBase-0.92-security/ws/trunk/target/surefire/surefire8036684863990134768tmp>
<https://builds.apache.org/job/HBase-0.92-security/ws/trunk/target/surefire/surefire3485334479288693689tmp>
Running org.apache.hadoop.hbase.regionserver.TestRSKilledWhenMasterInitializing
Tests run: 1, Failures: 0, Errors: 0, Skipped: 0, Time elapsed: 76.017 sec
Forking command line: /bin/sh -c cd <https://builds.apache.org/job/HBase-0.92-security/ws/trunk>
&& /home/jenkins/tools/java/jdk1.6.0_27-32/jre/bin/java -enableassertions -Xmx1400m
-Djava.security.egd=file:/dev/./urandom -jar <https://builds.apache.org/job/HBase-0.92-security/ws/trunk/target/surefire/surefirebooter44087200181162855.jar>
<https://builds.apache.org/job/HBase-0.92-security/ws/trunk/target/surefire/surefire3996132485136452376tmp>
<https://builds.apache.org/job/HBase-0.92-security/ws/trunk/target/surefire/surefire5988230764122745525tmp>
Running org.apache.hadoop.hbase.regionserver.TestFSErrorsExposed
Tests run: 3, Failures: 0, Errors: 0, Skipped: 0, Time elapsed: 34.247 sec
Forking command line: /bin/sh -c cd <https://builds.apache.org/job/HBase-0.92-security/ws/trunk>
&& /home/jenkins/tools/java/jdk1.6.0_27-32/jre/bin/java -enableassertions -Xmx1400m
-Djava.security.egd=file:/dev/./urandom -jar <https://builds.apache.org/job/HBase-0.92-security/ws/trunk/target/surefire/surefirebooter7959771095675185882.jar>
<https://builds.apache.org/job/HBase-0.92-security/ws/trunk/target/surefire/surefire2250957501587615764tmp>
<https://builds.apache.org/job/HBase-0.92-security/ws/trunk/target/surefire/surefire793022006502862190tmp>
Running org.apache.hadoop.hbase.regionserver.handler.TestCloseRegionHandler
Tests run: 3, Failures: 0, Errors: 0, Skipped: 0, Time elapsed: 1.554 sec
Forking command line: /bin/sh -c cd <https://builds.apache.org/job/HBase-0.92-security/ws/trunk>
&& /home/jenkins/tools/java/jdk1.6.0_27-32/jre/bin/java -enableassertions -Xmx1400m
-Djava.security.egd=file:/dev/./urandom -jar <https://builds.apache.org/job/HBase-0.92-security/ws/trunk/target/surefire/surefirebooter1319776761763109766.jar>
<https://builds.apache.org/job/HBase-0.92-security/ws/trunk/target/surefire/surefire7056449818555683914tmp>
<https://builds.apache.org/job/HBase-0.92-security/ws/trunk/target/surefire/surefire3148732621949355398tmp>
Running org.apache.hadoop.hbase.regionserver.handler.TestOpenRegionHandler
Tests run: 3, Failures: 0, Errors: 0, Skipped: 0, Time elapsed: 1.079 sec
Forking command line: /bin/sh -c cd <https://builds.apache.org/job/HBase-0.92-security/ws/trunk>
&& /home/jenkins/tools/java/jdk1.6.0_27-32/jre/bin/java -enableassertions -Xmx1400m
-Djava.security.egd=file:/dev/./urandom -jar <https://builds.apache.org/job/HBase-0.92-security/ws/trunk/target/surefire/surefirebooter3149581902497490463.jar>
<https://builds.apache.org/job/HBase-0.92-security/ws/trunk/target/surefire/surefire6793822666324905465tmp>
<https://builds.apache.org/job/HBase-0.92-security/ws/trunk/target/surefire/surefire4327891737656867503tmp>
Running org.apache.hadoop.hbase.regionserver.TestScanDeleteTracker
Tests run: 6, Failures: 0, Errors: 0, Skipped: 0, Time elapsed: 0.605 sec
Forking command line: /bin/sh -c cd <https://builds.apache.org/job/HBase-0.92-security/ws/trunk>
&& /home/jenkins/tools/java/jdk1.6.0_27-32/jre/bin/java -enableassertions -Xmx1400m
-Djava.security.egd=file:/dev/./urandom -jar <https://builds.apache.org/job/HBase-0.92-security/ws/trunk/target/surefire/surefirebooter7465996791985695974.jar>
<https://builds.apache.org/job/HBase-0.92-security/ws/trunk/target/surefire/surefire8689018310999255030tmp>
<https://builds.apache.org/job/HBase-0.92-security/ws/trunk/target/surefire/surefire3962873160839421475tmp>
Running org.apache.hadoop.hbase.regionserver.TestSplitTransactionOnCluster
Tests run: 7, Failures: 0, Errors: 0, Skipped: 0, Time elapsed: 82.881 sec
Forking command line: /bin/sh -c cd <https://builds.apache.org/job/HBase-0.92-security/ws/trunk>
&& /home/jenkins/tools/java/jdk1.6.0_27-32/jre/bin/java -enableassertions -Xmx1400m
-Djava.security.egd=file:/dev/./urandom -jar <https://builds.apache.org/job/HBase-0.92-security/ws/trunk/target/surefire/surefirebooter2514650480762142765.jar>
<https://builds.apache.org/job/HBase-0.92-security/ws/trunk/target/surefire/surefire4141576791519615316tmp>
<https://builds.apache.org/job/HBase-0.92-security/ws/trunk/target/surefire/surefire4702821711079791771tmp>
Running org.apache.hadoop.hbase.regionserver.TestHRegionServerBulkLoad
Tests run: 1, Failures: 0, Errors: 0, Skipped: 0, Time elapsed: 50.409 sec
Forking command line: /bin/sh -c cd <https://builds.apache.org/job/HBase-0.92-security/ws/trunk>
&& /home/jenkins/tools/java/jdk1.6.0_27-32/jre/bin/java -enableassertions -Xmx1400m
-Djava.security.egd=file:/dev/./urandom -jar <https://builds.apache.org/job/HBase-0.92-security/ws/trunk/target/surefire/surefirebooter9177234840475742281.jar>
<https://builds.apache.org/job/HBase-0.92-security/ws/trunk/target/surefire/surefire2098585846480013525tmp>
<https://builds.apache.org/job/HBase-0.92-security/ws/trunk/target/surefire/surefire3256014567058970652tmp>
Running org.apache.hadoop.hbase.regionserver.TestSplitTransaction
Tests run: 7, Failures: 0, Errors: 0, Skipped: 0, Time elapsed: 4.167 sec
Forking command line: /bin/sh -c cd <https://builds.apache.org/job/HBase-0.92-security/ws/trunk>
&& /home/jenkins/tools/java/jdk1.6.0_27-32/jre/bin/java -enableassertions -Xmx1400m
-Djava.security.egd=file:/dev/./urandom -jar <https://builds.apache.org/job/HBase-0.92-security/ws/trunk/target/surefire/surefirebooter8195595915175576767.jar>
<https://builds.apache.org/job/HBase-0.92-security/ws/trunk/target/surefire/surefire2969167169832180282tmp>
<https://builds.apache.org/job/HBase-0.92-security/ws/trunk/target/surefire/surefire8660556367725160398tmp>
Running org.apache.hadoop.hbase.regionserver.TestReadWriteConsistencyControl
Tests run: 1, Failures: 0, Errors: 0, Skipped: 0, Time elapsed: 10.11 sec
Forking command line: /bin/sh -c cd <https://builds.apache.org/job/HBase-0.92-security/ws/trunk>
&& /home/jenkins/tools/java/jdk1.6.0_27-32/jre/bin/java -enableassertions -Xmx1400m
-Djava.security.egd=file:/dev/./urandom -jar <https://builds.apache.org/job/HBase-0.92-security/ws/trunk/target/surefire/surefirebooter2701910434026406505.jar>
<https://builds.apache.org/job/HBase-0.92-security/ws/trunk/target/surefire/surefire5878403295637819274tmp>
<https://builds.apache.org/job/HBase-0.92-security/ws/trunk/target/surefire/surefire7728833204670278868tmp>
Running org.apache.hadoop.hbase.regionserver.TestKeyValueHeap
Tests run: 3, Failures: 0, Errors: 0, Skipped: 0, Time elapsed: 0.508 sec
Forking command line: /bin/sh -c cd <https://builds.apache.org/job/HBase-0.92-security/ws/trunk>
&& /home/jenkins/tools/java/jdk1.6.0_27-32/jre/bin/java -enableassertions -Xmx1400m
-Djava.security.egd=file:/dev/./urandom -jar <https://builds.apache.org/job/HBase-0.92-security/ws/trunk/target/surefire/surefirebooter1036694806733910031.jar>
<https://builds.apache.org/job/HBase-0.92-security/ws/trunk/target/surefire/surefire4490720600359546461tmp>
<https://builds.apache.org/job/HBase-0.92-security/ws/trunk/target/surefire/surefire5380656807086499070tmp>
Running org.apache.hadoop.hbase.regionserver.TestCompactSelection
Tests run: 1, Failures: 0, Errors: 0, Skipped: 0, Time elapsed: 0.775 sec
Forking command line: /bin/sh -c cd <https://builds.apache.org/job/HBase-0.92-security/ws/trunk>
&& /home/jenkins/tools/java/jdk1.6.0_27-32/jre/bin/java -enableassertions -Xmx1400m
-Djava.security.egd=file:/dev/./urandom -jar <https://builds.apache.org/job/HBase-0.92-security/ws/trunk/target/surefire/surefirebooter1862543171140476307.jar>
<https://builds.apache.org/job/HBase-0.92-security/ws/trunk/target/surefire/surefire1829374718169384128tmp>
<https://builds.apache.org/job/HBase-0.92-security/ws/trunk/target/surefire/surefire3061463059063863019tmp>
Running org.apache.hadoop.hbase.regionserver.TestMinVersions
Tests run: 6, Failures: 0, Errors: 0, Skipped: 0, Time elapsed: 1.327 sec
Forking command line: /bin/sh -c cd <https://builds.apache.org/job/HBase-0.92-security/ws/trunk>
&& /home/jenkins/tools/java/jdk1.6.0_27-32/jre/bin/java -enableassertions -Xmx1400m
-Djava.security.egd=file:/dev/./urandom -jar <https://builds.apache.org/job/HBase-0.92-security/ws/trunk/target/surefire/surefirebooter2902473552668722646.jar>
<https://builds.apache.org/job/HBase-0.92-security/ws/trunk/target/surefire/surefire3225019859144584685tmp>
<https://builds.apache.org/job/HBase-0.92-security/ws/trunk/target/surefire/surefire7403143584468665774tmp>
Running org.apache.hadoop.hbase.regionserver.TestWideScanner
Tests run: 1, Failures: 0, Errors: 0, Skipped: 0, Time elapsed: 2.04 sec
Forking command line: /bin/sh -c cd <https://builds.apache.org/job/HBase-0.92-security/ws/trunk>
&& /home/jenkins/tools/java/jdk1.6.0_27-32/jre/bin/java -enableassertions -Xmx1400m
-Djava.security.egd=file:/dev/./urandom -jar <https://builds.apache.org/job/HBase-0.92-security/ws/trunk/target/surefire/surefirebooter667934841401096676.jar>
<https://builds.apache.org/job/HBase-0.92-security/ws/trunk/target/surefire/surefire3934800060549944714tmp>
<https://builds.apache.org/job/HBase-0.92-security/ws/trunk/target/surefire/surefire5279813595553651786tmp>
Running org.apache.hadoop.hbase.regionserver.TestColumnSeeking
Tests run: 2, Failures: 0, Errors: 0, Skipped: 0, Time elapsed: 4.673 sec
Forking command line: /bin/sh -c cd <https://builds.apache.org/job/HBase-0.92-security/ws/trunk>
&& /home/jenkins/tools/java/jdk1.6.0_27-32/jre/bin/java -enableassertions -Xmx1400m
-Djava.security.egd=file:/dev/./urandom -jar <https://builds.apache.org/job/HBase-0.92-security/ws/trunk/target/surefire/surefirebooter7305612321868095920.jar>
<https://builds.apache.org/job/HBase-0.92-security/ws/trunk/target/surefire/surefire4751250546986936176tmp>
<https://builds.apache.org/job/HBase-0.92-security/ws/trunk/target/surefire/surefire7772123113960586577tmp>
Running org.apache.hadoop.hbase.regionserver.TestGetClosestAtOrBefore
Tests run: 3, Failures: 0, Errors: 0, Skipped: 0, Time elapsed: 1.316 sec
Forking command line: /bin/sh -c cd <https://builds.apache.org/job/HBase-0.92-security/ws/trunk>
&& /home/jenkins/tools/java/jdk1.6.0_27-32/jre/bin/java -enableassertions -Xmx1400m
-Djava.security.egd=file:/dev/./urandom -jar <https://builds.apache.org/job/HBase-0.92-security/ws/trunk/target/surefire/surefirebooter3385305466514072842.jar>
<https://builds.apache.org/job/HBase-0.92-security/ws/trunk/target/surefire/surefire7358135392656468189tmp>
<https://builds.apache.org/job/HBase-0.92-security/ws/trunk/target/surefire/surefire4252539432775146380tmp>
Running org.apache.hadoop.hbase.regionserver.TestExplicitColumnTracker
Tests run: 4, Failures: 0, Errors: 0, Skipped: 0, Time elapsed: 0.898 sec
Forking command line: /bin/sh -c cd <https://builds.apache.org/job/HBase-0.92-security/ws/trunk>
&& /home/jenkins/tools/java/jdk1.6.0_27-32/jre/bin/java -enableassertions -Xmx1400m
-Djava.security.egd=file:/dev/./urandom -jar <https://builds.apache.org/job/HBase-0.92-security/ws/trunk/target/surefire/surefirebooter2618998565023350982.jar>
<https://builds.apache.org/job/HBase-0.92-security/ws/trunk/target/surefire/surefire8736289746239846339tmp>
<https://builds.apache.org/job/HBase-0.92-security/ws/trunk/target/surefire/surefire505770933144980943tmp>
Running org.apache.hadoop.hbase.regionserver.TestMemStoreLAB
Tests run: 3, Failures: 0, Errors: 0, Skipped: 0, Time elapsed: 1.474 sec
Forking command line: /bin/sh -c cd <https://builds.apache.org/job/HBase-0.92-security/ws/trunk>
&& /home/jenkins/tools/java/jdk1.6.0_27-32/jre/bin/java -enableassertions -Xmx1400m
-Djava.security.egd=file:/dev/./urandom -jar <https://builds.apache.org/job/HBase-0.92-security/ws/trunk/target/surefire/surefirebooter3240662908161252587.jar>
<https://builds.apache.org/job/HBase-0.92-security/ws/trunk/target/surefire/surefire6375688290427267626tmp>
<https://builds.apache.org/job/HBase-0.92-security/ws/trunk/target/surefire/surefire4824770588358875470tmp>
Running org.apache.hadoop.hbase.regionserver.TestKeyValueScanFixture
Tests run: 1, Failures: 0, Errors: 0, Skipped: 0, Time elapsed: 0.116 sec
Forking command line: /bin/sh -c cd <https://builds.apache.org/job/HBase-0.92-security/ws/trunk>
&& /home/jenkins/tools/java/jdk1.6.0_27-32/jre/bin/java -enableassertions -Xmx1400m
-Djava.security.egd=file:/dev/./urandom -jar <https://builds.apache.org/job/HBase-0.92-security/ws/trunk/target/surefire/surefirebooter6931006353643009576.jar>
<https://builds.apache.org/job/HBase-0.92-security/ws/trunk/target/surefire/surefire1506393879440193012tmp>
<https://builds.apache.org/job/HBase-0.92-security/ws/trunk/target/surefire/surefire471606405550975844tmp>
Running org.apache.hadoop.hbase.regionserver.TestCacheOnWriteInSchema
Tests run: 3, Failures: 0, Errors: 0, Skipped: 0, Time elapsed: 1.972 sec
Forking command line: /bin/sh -c cd <https://builds.apache.org/job/HBase-0.92-security/ws/trunk>
&& /home/jenkins/tools/java/jdk1.6.0_27-32/jre/bin/java -enableassertions -Xmx1400m
-Djava.security.egd=file:/dev/./urandom -jar <https://builds.apache.org/job/HBase-0.92-security/ws/trunk/target/surefire/surefirebooter6028779788644913741.jar>
<https://builds.apache.org/job/HBase-0.92-security/ws/trunk/target/surefire/surefire2227834630761065193tmp>
<https://builds.apache.org/job/HBase-0.92-security/ws/trunk/target/surefire/surefire3470569934131540308tmp>
Running org.apache.hadoop.hbase.regionserver.wal.TestLogRollAbort
Tests run: 1, Failures: 0, Errors: 0, Skipped: 0, Time elapsed: 28.641 sec
Forking command line: /bin/sh -c cd <https://builds.apache.org/job/HBase-0.92-security/ws/trunk>
&& /home/jenkins/tools/java/jdk1.6.0_27-32/jre/bin/java -enableassertions -Xmx1400m
-Djava.security.egd=file:/dev/./urandom -jar <https://builds.apache.org/job/HBase-0.92-security/ws/trunk/target/surefire/surefirebooter1871451706467363502.jar>
<https://builds.apache.org/job/HBase-0.92-security/ws/trunk/target/surefire/surefire703929075752001890tmp>
<https://builds.apache.org/job/HBase-0.92-security/ws/trunk/target/surefire/surefire6490585167311789348tmp>
Running org.apache.hadoop.hbase.regionserver.wal.TestWALActionsListener
Tests run: 1, Failures: 0, Errors: 0, Skipped: 0, Time elapsed: 0.739 sec
Forking command line: /bin/sh -c cd <https://builds.apache.org/job/HBase-0.92-security/ws/trunk>
&& /home/jenkins/tools/java/jdk1.6.0_27-32/jre/bin/java -enableassertions -Xmx1400m
-Djava.security.egd=file:/dev/./urandom -jar <https://builds.apache.org/job/HBase-0.92-security/ws/trunk/target/surefire/surefirebooter475060504651177769.jar>
<https://builds.apache.org/job/HBase-0.92-security/ws/trunk/target/surefire/surefire3209616525719186701tmp>
<https://builds.apache.org/job/HBase-0.92-security/ws/trunk/target/surefire/surefire5426026539882529818tmp>
Running org.apache.hadoop.hbase.regionserver.wal.TestLogRolling
Tests run: 3, Failures: 0, Errors: 0, Skipped: 0, Time elapsed: 485.214 sec
Forking command line: /bin/sh -c cd <https://builds.apache.org/job/HBase-0.92-security/ws/trunk>
&& /home/jenkins/tools/java/jdk1.6.0_27-32/jre/bin/java -enableassertions -Xmx1400m
-Djava.security.egd=file:/dev/./urandom -jar <https://builds.apache.org/job/HBase-0.92-security/ws/trunk/target/surefire/surefirebooter7696132086024994264.jar>
<https://builds.apache.org/job/HBase-0.92-security/ws/trunk/target/surefire/surefire7489002414243058378tmp>
<https://builds.apache.org/job/HBase-0.92-security/ws/trunk/target/surefire/surefire7399002311045742282tmp>
Running org.apache.hadoop.hbase.regionserver.wal.TestHLog
Tests run: 9, Failures: 0, Errors: 0, Skipped: 0, Time elapsed: 66.149 sec
Forking command line: /bin/sh -c cd <https://builds.apache.org/job/HBase-0.92-security/ws/trunk>
&& /home/jenkins/tools/java/jdk1.6.0_27-32/jre/bin/java -enableassertions -Xmx1400m
-Djava.security.egd=file:/dev/./urandom -jar <https://builds.apache.org/job/HBase-0.92-security/ws/trunk/target/surefire/surefirebooter8085776618503762422.jar>
<https://builds.apache.org/job/HBase-0.92-security/ws/trunk/target/surefire/surefire8405690699276016524tmp>
<https://builds.apache.org/job/HBase-0.92-security/ws/trunk/target/surefire/surefire3288168992445788036tmp>
Running org.apache.hadoop.hbase.regionserver.wal.TestHLogSplit
Tests run: 30, Failures: 0, Errors: 0, Skipped: 1, Time elapsed: 247.65 sec
Forking command line: /bin/sh -c cd <https://builds.apache.org/job/HBase-0.92-security/ws/trunk>
&& /home/jenkins/tools/java/jdk1.6.0_27-32/jre/bin/java -enableassertions -Xmx1400m
-Djava.security.egd=file:/dev/./urandom -jar <https://builds.apache.org/job/HBase-0.92-security/ws/trunk/target/surefire/surefirebooter9215807635010655464.jar>
<https://builds.apache.org/job/HBase-0.92-security/ws/trunk/target/surefire/surefire5231961055815684943tmp>
<https://builds.apache.org/job/HBase-0.92-security/ws/trunk/target/surefire/surefire2203851122381261367tmp>
Running org.apache.hadoop.hbase.regionserver.wal.TestWALReplay
Tests run: 5, Failures: 0, Errors: 0, Skipped: 0, Time elapsed: 31.816 sec
Forking command line: /bin/sh -c cd <https://builds.apache.org/job/HBase-0.92-security/ws/trunk>
&& /home/jenkins/tools/java/jdk1.6.0_27-32/jre/bin/java -enableassertions -Xmx1400m
-Djava.security.egd=file:/dev/./urandom -jar <https://builds.apache.org/job/HBase-0.92-security/ws/trunk/target/surefire/surefirebooter992539252480742145.jar>
<https://builds.apache.org/job/HBase-0.92-security/ws/trunk/target/surefire/surefire5004336665588729323tmp>
<https://builds.apache.org/job/HBase-0.92-security/ws/trunk/target/surefire/surefire5597093241376401240tmp>
Running org.apache.hadoop.hbase.regionserver.wal.TestHLogMethods
Tests run: 3, Failures: 0, Errors: 0, Skipped: 0, Time elapsed: 0.917 sec
Forking command line: /bin/sh -c cd <https://builds.apache.org/job/HBase-0.92-security/ws/trunk>
&& /home/jenkins/tools/java/jdk1.6.0_27-32/jre/bin/java -enableassertions -Xmx1400m
-Djava.security.egd=file:/dev/./urandom -jar <https://builds.apache.org/job/HBase-0.92-security/ws/trunk/target/surefire/surefirebooter1309484847929009984.jar>
<https://builds.apache.org/job/HBase-0.92-security/ws/trunk/target/surefire/surefire3130756387113027435tmp>
<https://builds.apache.org/job/HBase-0.92-security/ws/trunk/target/surefire/surefire7031353979417225837tmp>
Running org.apache.hadoop.hbase.regionserver.TestRSStatusServlet
Tests run: 2, Failures: 0, Errors: 0, Skipped: 0, Time elapsed: 0.757 sec
Forking command line: /bin/sh -c cd <https://builds.apache.org/job/HBase-0.92-security/ws/trunk>
&& /home/jenkins/tools/java/jdk1.6.0_27-32/jre/bin/java -enableassertions -Xmx1400m
-Djava.security.egd=file:/dev/./urandom -jar <https://builds.apache.org/job/HBase-0.92-security/ws/trunk/target/surefire/surefirebooter1495961418579111489.jar>
<https://builds.apache.org/job/HBase-0.92-security/ws/trunk/target/surefire/surefire6219296725701865642tmp>
<https://builds.apache.org/job/HBase-0.92-security/ws/trunk/target/surefire/surefire2033768919158646694tmp>
Running org.apache.hadoop.hbase.regionserver.TestStoreScanner
Tests run: 14, Failures: 0, Errors: 0, Skipped: 0, Time elapsed: 0.142 sec
Forking command line: /bin/sh -c cd <https://builds.apache.org/job/HBase-0.92-security/ws/trunk>
&& /home/jenkins/tools/java/jdk1.6.0_27-32/jre/bin/java -enableassertions -Xmx1400m
-Djava.security.egd=file:/dev/./urandom -jar <https://builds.apache.org/job/HBase-0.92-security/ws/trunk/target/surefire/surefirebooter6022959659654784225.jar>
<https://builds.apache.org/job/HBase-0.92-security/ws/trunk/target/surefire/surefire8389786400391163758tmp>
<https://builds.apache.org/job/HBase-0.92-security/ws/trunk/target/surefire/surefire6213998182766456411tmp>
Running org.apache.hadoop.hbase.regionserver.TestResettingCounters
Tests run: 1, Failures: 0, Errors: 0, Skipped: 0, Time elapsed: 0.858 sec
Forking command line: /bin/sh -c cd <https://builds.apache.org/job/HBase-0.92-security/ws/trunk>
&& /home/jenkins/tools/java/jdk1.6.0_27-32/jre/bin/java -enableassertions -Xmx1400m
-Djava.security.egd=file:/dev/./urandom -jar <https://builds.apache.org/job/HBase-0.92-security/ws/trunk/target/surefire/surefirebooter8710410184365856735.jar>
<https://builds.apache.org/job/HBase-0.92-security/ws/trunk/target/surefire/surefire1775168913889676962tmp>
<https://builds.apache.org/job/HBase-0.92-security/ws/trunk/target/surefire/surefire8037411122135232604tmp>
Running org.apache.hadoop.hbase.regionserver.TestStoreFile
Tests run: 8, Failures: 0, Errors: 0, Skipped: 0, Time elapsed: 1.749 sec
Forking command line: /bin/sh -c cd <https://builds.apache.org/job/HBase-0.92-security/ws/trunk>
&& /home/jenkins/tools/java/jdk1.6.0_27-32/jre/bin/java -enableassertions -Xmx1400m
-Djava.security.egd=file:/dev/./urandom -jar <https://builds.apache.org/job/HBase-0.92-security/ws/trunk/target/surefire/surefirebooter8113665000990533630.jar>
<https://builds.apache.org/job/HBase-0.92-security/ws/trunk/target/surefire/surefire388922102658209039tmp>
<https://builds.apache.org/job/HBase-0.92-security/ws/trunk/target/surefire/surefire7357575671857699657tmp>
Running org.apache.hadoop.hbase.regionserver.TestEndToEndSplitTransaction
Tests run: 2, Failures: 0, Errors: 0, Skipped: 0, Time elapsed: 66.161 sec
Forking command line: /bin/sh -c cd <https://builds.apache.org/job/HBase-0.92-security/ws/trunk>
&& /home/jenkins/tools/java/jdk1.6.0_27-32/jre/bin/java -enableassertions -Xmx1400m
-Djava.security.egd=file:/dev/./urandom -jar <https://builds.apache.org/job/HBase-0.92-security/ws/trunk/target/surefire/surefirebooter7863298501214927563.jar>
<https://builds.apache.org/job/HBase-0.92-security/ws/trunk/target/surefire/surefire7973510129997076620tmp>
<https://builds.apache.org/job/HBase-0.92-security/ws/trunk/target/surefire/surefire3542650723484934509tmp>
Running org.apache.hadoop.hbase.regionserver.TestScanWildcardColumnTracker
Tests run: 2, Failures: 0, Errors: 0, Skipped: 0, Time elapsed: 0.484 sec
Forking command line: /bin/sh -c cd <https://builds.apache.org/job/HBase-0.92-security/ws/trunk>
&& /home/jenkins/tools/java/jdk1.6.0_27-32/jre/bin/java -enableassertions -Xmx1400m
-Djava.security.egd=file:/dev/./urandom -jar <https://builds.apache.org/job/HBase-0.92-security/ws/trunk/target/surefire/surefirebooter1917118001756017394.jar>
<https://builds.apache.org/job/HBase-0.92-security/ws/trunk/target/surefire/surefire1397523162615043304tmp>
<https://builds.apache.org/job/HBase-0.92-security/ws/trunk/target/surefire/surefire6830439127812871566tmp>
Running org.apache.hadoop.hbase.regionserver.TestCompaction
Tests run: 12, Failures: 0, Errors: 0, Skipped: 0, Time elapsed: 19.694 sec
Forking command line: /bin/sh -c cd <https://builds.apache.org/job/HBase-0.92-security/ws/trunk>
&& /home/jenkins/tools/java/jdk1.6.0_27-32/jre/bin/java -enableassertions -Xmx1400m
-Djava.security.egd=file:/dev/./urandom -jar <https://builds.apache.org/job/HBase-0.92-security/ws/trunk/target/surefire/surefirebooter2600752015555124471.jar>
<https://builds.apache.org/job/HBase-0.92-security/ws/trunk/target/surefire/surefire5898732515291754101tmp>
<https://builds.apache.org/job/HBase-0.92-security/ws/trunk/target/surefire/surefire1310085586541362973tmp>
Running org.apache.hadoop.hbase.regionserver.TestMXBean
Tests run: 1, Failures: 0, Errors: 0, Skipped: 0, Time elapsed: 16.994 sec
Forking command line: /bin/sh -c cd <https://builds.apache.org/job/HBase-0.92-security/ws/trunk>
&& /home/jenkins/tools/java/jdk1.6.0_27-32/jre/bin/java -enableassertions -Xmx1400m
-Djava.security.egd=file:/dev/./urandom -jar <https://builds.apache.org/job/HBase-0.92-security/ws/trunk/target/surefire/surefirebooter2200008288341392767.jar>
<https://builds.apache.org/job/HBase-0.92-security/ws/trunk/target/surefire/surefire3107608566411359384tmp>
<https://builds.apache.org/job/HBase-0.92-security/ws/trunk/target/surefire/surefire803572405628516033tmp>
Running org.apache.hadoop.hbase.regionserver.TestQueryMatcher
Tests run: 4, Failures: 0, Errors: 0, Skipped: 0, Time elapsed: 0.536 sec
Forking command line: /bin/sh -c cd <https://builds.apache.org/job/HBase-0.92-security/ws/trunk>
&& /home/jenkins/tools/java/jdk1.6.0_27-32/jre/bin/java -enableassertions -Xmx1400m
-Djava.security.egd=file:/dev/./urandom -jar <https://builds.apache.org/job/HBase-0.92-security/ws/trunk/target/surefire/surefirebooter8779801297051728475.jar>
<https://builds.apache.org/job/HBase-0.92-security/ws/trunk/target/surefire/surefire653907855810414775tmp>
<https://builds.apache.org/job/HBase-0.92-security/ws/trunk/target/surefire/surefire1146837024892961488tmp>
Running org.apache.hadoop.hbase.regionserver.TestRpcMetrics
Tests run: 1, Failures: 0, Errors: 0, Skipped: 0, Time elapsed: 1.892 sec
Forking command line: /bin/sh -c cd <https://builds.apache.org/job/HBase-0.92-security/ws/trunk>
&& /home/jenkins/tools/java/jdk1.6.0_27-32/jre/bin/java -enableassertions -Xmx1400m
-Djava.security.egd=file:/dev/./urandom -jar <https://builds.apache.org/job/HBase-0.92-security/ws/trunk/target/surefire/surefirebooter5618720124927339457.jar>
<https://builds.apache.org/job/HBase-0.92-security/ws/trunk/target/surefire/surefire3647385987046559455tmp>
<https://builds.apache.org/job/HBase-0.92-security/ws/trunk/target/surefire/surefire3133263518702092678tmp>
Running org.apache.hadoop.hbase.regionserver.TestScanner
Tests run: 7, Failures: 0, Errors: 0, Skipped: 0, Time elapsed: 4.951 sec
Forking command line: /bin/sh -c cd <https://builds.apache.org/job/HBase-0.92-security/ws/trunk>
&& /home/jenkins/tools/java/jdk1.6.0_27-32/jre/bin/java -enableassertions -Xmx1400m
-Djava.security.egd=file:/dev/./urandom -jar <https://builds.apache.org/job/HBase-0.92-security/ws/trunk/target/surefire/surefirebooter8850157550833809938.jar>
<https://builds.apache.org/job/HBase-0.92-security/ws/trunk/target/surefire/surefire3430480567560388207tmp>
<https://builds.apache.org/job/HBase-0.92-security/ws/trunk/target/surefire/surefire6117531999575450930tmp>
Running org.apache.hadoop.hbase.regionserver.TestMultiColumnScanner
Tests run: 6, Failures: 0, Errors: 0, Skipped: 0, Time elapsed: 18.928 sec
Forking command line: /bin/sh -c cd <https://builds.apache.org/job/HBase-0.92-security/ws/trunk>
&& /home/jenkins/tools/java/jdk1.6.0_27-32/jre/bin/java -enableassertions -Xmx1400m
-Djava.security.egd=file:/dev/./urandom -jar <https://builds.apache.org/job/HBase-0.92-security/ws/trunk/target/surefire/surefirebooter993706599820808922.jar>
<https://builds.apache.org/job/HBase-0.92-security/ws/trunk/target/surefire/surefire8396964101969598635tmp>
<https://builds.apache.org/job/HBase-0.92-security/ws/trunk/target/surefire/surefire8978354510215305318tmp>
Running org.apache.hadoop.hbase.regionserver.TestRegionSplitPolicy
Tests run: 3, Failures: 0, Errors: 0, Skipped: 0, Time elapsed: 0.707 sec
Forking command line: /bin/sh -c cd <https://builds.apache.org/job/HBase-0.92-security/ws/trunk>
&& /home/jenkins/tools/java/jdk1.6.0_27-32/jre/bin/java -enableassertions -Xmx1400m
-Djava.security.egd=file:/dev/./urandom -jar <https://builds.apache.org/job/HBase-0.92-security/ws/trunk/target/surefire/surefirebooter3751588261929392304.jar>
<https://builds.apache.org/job/HBase-0.92-security/ws/trunk/target/surefire/surefire8026796704149414774tmp>
<https://builds.apache.org/job/HBase-0.92-security/ws/trunk/target/surefire/surefire8539642520691844132tmp>
Running org.apache.hadoop.hbase.regionserver.TestKeyValueSkipListSet
Tests run: 4, Failures: 0, Errors: 0, Skipped: 0, Time elapsed: 0.139 sec
Forking command line: /bin/sh -c cd <https://builds.apache.org/job/HBase-0.92-security/ws/trunk>
&& /home/jenkins/tools/java/jdk1.6.0_27-32/jre/bin/java -enableassertions -Xmx1400m
-Djava.security.egd=file:/dev/./urandom -jar <https://builds.apache.org/job/HBase-0.92-security/ws/trunk/target/surefire/surefirebooter2414517594048603508.jar>
<https://builds.apache.org/job/HBase-0.92-security/ws/trunk/target/surefire/surefire4298405627667907106tmp>
<https://builds.apache.org/job/HBase-0.92-security/ws/trunk/target/surefire/surefire5128792961018663938tmp>
Running org.apache.hadoop.hbase.mapred.TestTableMapReduce
Tests run: 1, Failures: 0, Errors: 0, Skipped: 0, Time elapsed: 74.133 sec
Forking command line: /bin/sh -c cd <https://builds.apache.org/job/HBase-0.92-security/ws/trunk>
&& /home/jenkins/tools/java/jdk1.6.0_27-32/jre/bin/java -enableassertions -Xmx1400m
-Djava.security.egd=file:/dev/./urandom -jar <https://builds.apache.org/job/HBase-0.92-security/ws/trunk/target/surefire/surefirebooter6997532141135549633.jar>
<https://builds.apache.org/job/HBase-0.92-security/ws/trunk/target/surefire/surefire4242583780972303335tmp>
<https://builds.apache.org/job/HBase-0.92-security/ws/trunk/target/surefire/surefire892472049333628139tmp>
Running org.apache.hadoop.hbase.mapred.TestTableInputFormat
Tests run: 10, Failures: 0, Errors: 0, Skipped: 0, Time elapsed: 37.636 sec
Forking command line: /bin/sh -c cd <https://builds.apache.org/job/HBase-0.92-security/ws/trunk>
&& /home/jenkins/tools/java/jdk1.6.0_27-32/jre/bin/java -enableassertions -Xmx1400m
-Djava.security.egd=file:/dev/./urandom -jar <https://builds.apache.org/job/HBase-0.92-security/ws/trunk/target/surefire/surefirebooter7725376142225780195.jar>
<https://builds.apache.org/job/HBase-0.92-security/ws/trunk/target/surefire/surefire1086412670691187163tmp>
<https://builds.apache.org/job/HBase-0.92-security/ws/trunk/target/surefire/surefire6075889960104234785tmp>
Running org.apache.hadoop.hbase.TestClusterBootOrder
Tests run: 2, Failures: 0, Errors: 0, Skipped: 0, Time elapsed: 34.183 sec
Forking command line: /bin/sh -c cd <https://builds.apache.org/job/HBase-0.92-security/ws/trunk>
&& /home/jenkins/tools/java/jdk1.6.0_27-32/jre/bin/java -enableassertions -Xmx1400m
-Djava.security.egd=file:/dev/./urandom -jar <https://builds.apache.org/job/HBase-0.92-security/ws/trunk/target/surefire/surefirebooter1728212339721127181.jar>
<https://builds.apache.org/job/HBase-0.92-security/ws/trunk/target/surefire/surefire4215644336484672976tmp>
<https://builds.apache.org/job/HBase-0.92-security/ws/trunk/target/surefire/surefire2190470002636790140tmp>
Running org.apache.hadoop.hbase.TestDrainingServer
Tests run: 2, Failures: 0, Errors: 0, Skipped: 0, Time elapsed: 30.61 sec
Forking command line: /bin/sh -c cd <https://builds.apache.org/job/HBase-0.92-security/ws/trunk>
&& /home/jenkins/tools/java/jdk1.6.0_27-32/jre/bin/java -enableassertions -Xmx1400m
-Djava.security.egd=file:/dev/./urandom -jar <https://builds.apache.org/job/HBase-0.92-security/ws/trunk/target/surefire/surefirebooter5898242244705798939.jar>
<https://builds.apache.org/job/HBase-0.92-security/ws/trunk/target/surefire/surefire5902157225108784315tmp>
<https://builds.apache.org/job/HBase-0.92-security/ws/trunk/target/surefire/surefire8661799240185184671tmp>
Running org.apache.hadoop.hbase.TestFSTableDescriptorForceCreation
Tests run: 3, Failures: 0, Errors: 0, Skipped: 0, Time elapsed: 0.659 sec
Forking command line: /bin/sh -c cd <https://builds.apache.org/job/HBase-0.92-security/ws/trunk>
&& /home/jenkins/tools/java/jdk1.6.0_27-32/jre/bin/java -enableassertions -Xmx1400m
-Djava.security.egd=file:/dev/./urandom -jar <https://builds.apache.org/job/HBase-0.92-security/ws/trunk/target/surefire/surefirebooter6644910000133971828.jar>
<https://builds.apache.org/job/HBase-0.92-security/ws/trunk/target/surefire/surefire4201367783808865848tmp>
<https://builds.apache.org/job/HBase-0.92-security/ws/trunk/target/surefire/surefire7098900494199738844tmp>
Running org.apache.hadoop.hbase.executor.TestExecutorService
Tests run: 1, Failures: 0, Errors: 0, Skipped: 0, Time elapsed: 2.506 sec
Forking command line: /bin/sh -c cd <https://builds.apache.org/job/HBase-0.92-security/ws/trunk>
&& /home/jenkins/tools/java/jdk1.6.0_27-32/jre/bin/java -enableassertions -Xmx1400m
-Djava.security.egd=file:/dev/./urandom -jar <https://builds.apache.org/job/HBase-0.92-security/ws/trunk/target/surefire/surefirebooter5500192320468213363.jar>
<https://builds.apache.org/job/HBase-0.92-security/ws/trunk/target/surefire/surefire6876520006892395328tmp>
<https://builds.apache.org/job/HBase-0.92-security/ws/trunk/target/surefire/surefire7919172084679112153tmp>
Running org.apache.hadoop.hbase.mapreduce.TestTimeRangeMapRed
Tests run: 1, Failures: 0, Errors: 0, Skipped: 0, Time elapsed: 46.29 sec
Forking command line: /bin/sh -c cd <https://builds.apache.org/job/HBase-0.92-security/ws/trunk>
&& /home/jenkins/tools/java/jdk1.6.0_27-32/jre/bin/java -enableassertions -Xmx1400m
-Djava.security.egd=file:/dev/./urandom -jar <https://builds.apache.org/job/HBase-0.92-security/ws/trunk/target/surefire/surefirebooter1211427283199950410.jar>
<https://builds.apache.org/job/HBase-0.92-security/ws/trunk/target/surefire/surefire502946058001409796tmp>
<https://builds.apache.org/job/HBase-0.92-security/ws/trunk/target/surefire/surefire4328352984415108796tmp>
Running org.apache.hadoop.hbase.mapreduce.TestHFileOutputFormat
Tests run: 8, Failures: 0, Errors: 0, Skipped: 0, Time elapsed: 179.661 sec
Forking command line: /bin/sh -c cd <https://builds.apache.org/job/HBase-0.92-security/ws/trunk>
&& /home/jenkins/tools/java/jdk1.6.0_27-32/jre/bin/java -enableassertions -Xmx1400m
-Djava.security.egd=file:/dev/./urandom -jar <https://builds.apache.org/job/HBase-0.92-security/ws/trunk/target/surefire/surefirebooter157248178097553726.jar>
<https://builds.apache.org/job/HBase-0.92-security/ws/trunk/target/surefire/surefire1625568496857441120tmp>
<https://builds.apache.org/job/HBase-0.92-security/ws/trunk/target/surefire/surefire4371520067615714792tmp>
Running org.apache.hadoop.hbase.mapreduce.TestImportTsv
Tests run: 8, Failures: 0, Errors: 0, Skipped: 0, Time elapsed: 100.036 sec
Forking command line: /bin/sh -c cd <https://builds.apache.org/job/HBase-0.92-security/ws/trunk>
&& /home/jenkins/tools/java/jdk1.6.0_27-32/jre/bin/java -enableassertions -Xmx1400m
-Djava.security.egd=file:/dev/./urandom -jar <https://builds.apache.org/job/HBase-0.92-security/ws/trunk/target/surefire/surefirebooter1141912370662047675.jar>
<https://builds.apache.org/job/HBase-0.92-security/ws/trunk/target/surefire/surefire6097505249440989230tmp>
<https://builds.apache.org/job/HBase-0.92-security/ws/trunk/target/surefire/surefire2995979321623148734tmp>
Running org.apache.hadoop.hbase.mapreduce.TestTableInputFormatScan
Tests run: 11, Failures: 0, Errors: 0, Skipped: 0, Time elapsed: 532.486 sec
Forking command line: /bin/sh -c cd <https://builds.apache.org/job/HBase-0.92-security/ws/trunk>
&& /home/jenkins/tools/java/jdk1.6.0_27-32/jre/bin/java -enableassertions -Xmx1400m
-Djava.security.egd=file:/dev/./urandom -jar <https://builds.apache.org/job/HBase-0.92-security/ws/trunk/target/surefire/surefirebooter2789154072824856424.jar>
<https://builds.apache.org/job/HBase-0.92-security/ws/trunk/target/surefire/surefire236340645440464960tmp>
<https://builds.apache.org/job/HBase-0.92-security/ws/trunk/target/surefire/surefire3895713986386299364tmp>
Running org.apache.hadoop.hbase.mapreduce.TestLoadIncrementalHFilesSplitRecovery
Tests run: 4, Failures: 0, Errors: 0, Skipped: 0, Time elapsed: 54.611 sec
Forking command line: /bin/sh -c cd <https://builds.apache.org/job/HBase-0.92-security/ws/trunk>
&& /home/jenkins/tools/java/jdk1.6.0_27-32/jre/bin/java -enableassertions -Xmx1400m
-Djava.security.egd=file:/dev/./urandom -jar <https://builds.apache.org/job/HBase-0.92-security/ws/trunk/target/surefire/surefirebooter9108014840693315313.jar>
<https://builds.apache.org/job/HBase-0.92-security/ws/trunk/target/surefire/surefire8436043779946809694tmp>
<https://builds.apache.org/job/HBase-0.92-security/ws/trunk/target/surefire/surefire3417984583450215130tmp>
Running org.apache.hadoop.hbase.mapreduce.TestTableSplit
Tests run: 1, Failures: 0, Errors: 0, Skipped: 0, Time elapsed: 0.137 sec
Forking command line: /bin/sh -c cd <https://builds.apache.org/job/HBase-0.92-security/ws/trunk>
&& /home/jenkins/tools/java/jdk1.6.0_27-32/jre/bin/java -enableassertions -Xmx1400m
-Djava.security.egd=file:/dev/./urandom -jar <https://builds.apache.org/job/HBase-0.92-security/ws/trunk/target/surefire/surefirebooter8784440258364096854.jar>
<https://builds.apache.org/job/HBase-0.92-security/ws/trunk/target/surefire/surefire1584092748800985879tmp>
<https://builds.apache.org/job/HBase-0.92-security/ws/trunk/target/surefire/surefire7011122649472790769tmp>
Running org.apache.hadoop.hbase.mapreduce.TestSimpleTotalOrderPartitioner
Tests run: 1, Failures: 0, Errors: 0, Skipped: 0, Time elapsed: 0.421 sec
Forking command line: /bin/sh -c cd <https://builds.apache.org/job/HBase-0.92-security/ws/trunk>
&& /home/jenkins/tools/java/jdk1.6.0_27-32/jre/bin/java -enableassertions -Xmx1400m
-Djava.security.egd=file:/dev/./urandom -jar <https://builds.apache.org/job/HBase-0.92-security/ws/trunk/target/surefire/surefirebooter5855209244628552929.jar>
<https://builds.apache.org/job/HBase-0.92-security/ws/trunk/target/surefire/surefire488692781447319622tmp>
<https://builds.apache.org/job/HBase-0.92-security/ws/trunk/target/surefire/surefire5703747832581637801tmp>
Running org.apache.hadoop.hbase.mapreduce.TestTableMapReduce
Tests run: 1, Failures: 0, Errors: 0, Skipped: 0, Time elapsed: 98.181 sec
Forking command line: /bin/sh -c cd <https://builds.apache.org/job/HBase-0.92-security/ws/trunk>
&& /home/jenkins/tools/java/jdk1.6.0_27-32/jre/bin/java -enableassertions -Xmx1400m
-Djava.security.egd=file:/dev/./urandom -jar <https://builds.apache.org/job/HBase-0.92-security/ws/trunk/target/surefire/surefirebooter5158595130658294566.jar>
<https://builds.apache.org/job/HBase-0.92-security/ws/trunk/target/surefire/surefire3274558780046052730tmp>
<https://builds.apache.org/job/HBase-0.92-security/ws/trunk/target/surefire/surefire8742468836137801897tmp>
Running org.apache.hadoop.hbase.mapreduce.TestLoadIncrementalHFiles
Tests run: 6, Failures: 0, Errors: 0, Skipped: 0, Time elapsed: 33.157 sec
Forking command line: /bin/sh -c cd <https://builds.apache.org/job/HBase-0.92-security/ws/trunk>
&& /home/jenkins/tools/java/jdk1.6.0_27-32/jre/bin/java -enableassertions -Xmx1400m
-Djava.security.egd=file:/dev/./urandom -jar <https://builds.apache.org/job/HBase-0.92-security/ws/trunk/target/surefire/surefirebooter7407787155884727255.jar>
<https://builds.apache.org/job/HBase-0.92-security/ws/trunk/target/surefire/surefire1836469857953667798tmp>
<https://builds.apache.org/job/HBase-0.92-security/ws/trunk/target/surefire/surefire6975352658201868194tmp>
Running org.apache.hadoop.hbase.TestHRegionLocation
Tests run: 3, Failures: 0, Errors: 0, Skipped: 0, Time elapsed: 0.168 sec

Results :

Tests in error: 
  testMasterFailoverWithMockedRIT(org.apache.hadoop.hbase.master.TestMasterFailover): test
timed out after 180000 milliseconds

Tests run: 1180, Failures: 0, Errors: 1, Skipped: 8

[INFO] ------------------------------------------------------------------------
[INFO] BUILD FAILURE
[INFO] ------------------------------------------------------------------------
[INFO] Total time: 2:07:26.043s
[INFO] Finished at: Thu Aug 23 08:55:17 UTC 2012
[INFO] Final Memory: 20M/474M
[INFO] ------------------------------------------------------------------------
[ERROR] Failed to execute goal org.apache.maven.plugins:maven-surefire-plugin:2.10:test (default-test)
on project hbase: There are test failures.
[ERROR] 
[ERROR] Please refer to <https://builds.apache.org/job/HBase-0.92-security/ws/trunk/target/surefire-reports>
for the individual test results.
[ERROR] -> [Help 1]
org.apache.maven.lifecycle.LifecycleExecutionException: Failed to execute goal org.apache.maven.plugins:maven-surefire-plugin:2.10:test
(default-test) on project hbase: There are test failures.

Please refer to <https://builds.apache.org/job/HBase-0.92-security/ws/trunk/target/surefire-reports>
for the individual test results.
	at org.apache.maven.lifecycle.internal.MojoExecutor.execute(MojoExecutor.java:213)
	at org.apache.maven.lifecycle.internal.MojoExecutor.execute(MojoExecutor.java:153)
	at org.apache.maven.lifecycle.internal.MojoExecutor.execute(MojoExecutor.java:145)
	at org.apache.maven.lifecycle.internal.LifecycleModuleBuilder.buildProject(LifecycleModuleBuilder.java:84)
	at org.apache.maven.lifecycle.internal.LifecycleModuleBuilder.buildProject(LifecycleModuleBuilder.java:59)
	at org.apache.maven.lifecycle.internal.LifecycleStarter.singleThreadedBuild(LifecycleStarter.java:183)
	at org.apache.maven.lifecycle.internal.LifecycleStarter.execute(LifecycleStarter.java:161)
	at org.apache.maven.DefaultMaven.doExecute(DefaultMaven.java:319)
	at org.apache.maven.DefaultMaven.execute(DefaultMaven.java:156)
	at org.apache.maven.cli.MavenCli.execute(MavenCli.java:537)
	at org.apache.maven.cli.MavenCli.doMain(MavenCli.java:196)
	at org.apache.maven.cli.MavenCli.main(MavenCli.java:141)
	at sun.reflect.NativeMethodAccessorImpl.invoke0(Native Method)
	at sun.reflect.NativeMethodAccessorImpl.invoke(NativeMethodAccessorImpl.java:39)
	at sun.reflect.DelegatingMethodAccessorImpl.invoke(DelegatingMethodAccessorImpl.java:25)
	at java.lang.reflect.Method.invoke(Method.java:597)
	at org.codehaus.plexus.classworlds.launcher.Launcher.launchEnhanced(Launcher.java:290)
	at org.codehaus.plexus.classworlds.launcher.Launcher.launch(Launcher.java:230)
	at org.codehaus.plexus.classworlds.launcher.Launcher.mainWithExitCode(Launcher.java:409)
	at org.codehaus.plexus.classworlds.launcher.Launcher.main(Launcher.java:352)
Caused by: org.apache.maven.plugin.MojoFailureException: There are test failures.

Please refer to <https://builds.apache.org/job/HBase-0.92-security/ws/trunk/target/surefire-reports>
for the individual test results.
	at org.apache.maven.plugin.surefire.SurefireHelper.reportExecution(SurefireHelper.java:87)
	at org.apache.maven.plugin.surefire.SurefirePlugin.writeSummary(SurefirePlugin.java:641)
	at org.apache.maven.plugin.surefire.SurefirePlugin.handleSummary(SurefirePlugin.java:615)
	at org.apache.maven.plugin.surefire.AbstractSurefireMojo.executeAfterPreconditionsChecked(AbstractSurefireMojo.java:137)
	at org.apache.maven.plugin.surefire.AbstractSurefireMojo.execute(AbstractSurefireMojo.java:98)
	at org.apache.maven.plugin.DefaultBuildPluginManager.executeMojo(DefaultBuildPluginManager.java:101)
	at org.apache.maven.lifecycle.internal.MojoExecutor.execute(MojoExecutor.java:209)
	... 19 more
[ERROR] 
[ERROR] 
[ERROR] For more information about the errors and possible solutions, please read the following
articles:
[ERROR] [Help 1] http://cwiki.apache.org/confluence/display/MAVEN/MojoFailureException
Build step 'Invoke top-level Maven targets' marked build as failure
Archiving artifacts
Updating HBASE-6308
Updating HBASE-6632
Updating HBASE-6631
Updating HBASE-6160
Updating HBASE-6503
Updating HBASE-6538
Updating HBASE-6512
Updating HBASE-6565
Updating HBASE-6552
Updating HBASE-5549
Updating HBASE-5714
Updating HBASE-6576
Updating HBASE-6608
Recording test results

Mime
View raw message