hbase-dev mailing list archives

Site index · List index
Message view « Date » · « Thread »
Top « Date » · « Thread »
From Apache Jenkins Server <jenk...@builds.apache.org>
Subject Build failed in Jenkins: HBase-0.94-security-on-Hadoop-23 #6
Date Sun, 05 Aug 2012 00:51:27 GMT
See <https://builds.apache.org/job/HBase-0.94-security-on-Hadoop-23/6/changes>

Changes:

[jxiang] [hbck] TestHBaseFsck ran into TableNotEnabledException

[tedyu] HBASE-6359 KeyValue may return incorrect values after readFields() (Dave Revell)

[jmhsieh] HBASE-6460 hbck "-repairHoles" usage inconsistent with "-fixHdfsOrphans" (Jie Huang)

[larsh] HBASE-6427 addendum

[larsh] HBASE-6427 Pluggable compaction and scan policies via coprocessors

[stack] HBASE-6450 HBase startup should be with MALLOC_MAX_ARENA set

[stack] HBASE-6447 Common TestZooKeeper failures on jenkins: testMasterSessionExpired and
testCreateSilentIsReallySilent

[larsh] CHANGES.txt for 0.94.1RC1

[larsh] HBASE-2214 Revert - breaks compatibility with 0.92.x and 0.94.0

[stack] HBASE-6445 rat check fails if hs_err_pid26514.log dropped in tests

[stack] HBASE-6445 rat check fails if hs_err_pid26514.log dropped in tests

[larsh] HBASE-5659 Addendum

[jmhsieh] HBASE-4470 ServerNotRunningException coming out of assignRootAndMeta kills the Master
(Gregory Chanan)

[larsh] HBASE-5659 TestAtomicOperation.testMultiRowMutationMultiThreads is still failing occasionally

[jxiang] HBASE-6440 SplitLogManager - log the exception when failed to finish split log file

[larsh] HBASE-6433 Improve HBaseServer#getRemoteAddress by utilizing HBaseServer.Connection.hostAddress
n(binlijin)

[larsh] HBASE-6406 Disable TestZooKeeper#testClientSessionExpired

[stack] HBASE-6363 HBaseConfiguration can carry a main method that dumps XML output for debug
purposes

[jxiang] HBASE-5966 MapReduce based tests broken on Hadoop 2.0.0-alpha (Gregory Chanan)

[jdcryans] HBASE-6319  ReplicationSource can call terminate on itself and deadlock
HBASE-6325  [replication] Race in ReplicationSourceManager.init can initiate a failover even
if the node is alive

[jxiang] HBASE-5985 TestMetaMigrationRemovingHTD failed with HADOOP 2.0.0

[tedyu] HBASE-4956 Control direct memory buffer consumption by HBaseClient (Bob Copeland)

[jxiang] HBASE-6420 Gracefully shutdown logsyncer

[larsh] HBASE-6406 Remove TestReplicationPeer

[larsh] HBASE-6426 Add Hadoop 2.0.x profile to 0.92+

[jxiang] HBASE-6392 UnknownRegionException blocks hbck from sideline big overlap regions

[larsh] HBASE-6389 revert

[larsh] Latest CHANGES.txt for 0.94.1

[larsh] HBASE-6382 Upgrade Jersey to 1.8 to match Hadoop 1 and 2 (David S. Wang)

[larsh] Latest CHANGES.txt for 0.94.1

[jxiang] HBASE-6397 [hbck] print out bulk load commands for sidelined regions if necessary

[larsh] updated CHANGES.txt because of another checkin

[jxiang] HBASE-6394 verifyrep MR job map tasks throws NullPointerException

[larsh] CHANGES.txt/pom.xml for 0.94.1RC0 take two

[larsh] HBASE-6389 Modify the conditions to ensure that Master waits for sufficient number
of Region Servers before starting region assignments (Aditya Kishore)

[stack] HBASE-6380 bulkload should update the store.storeSize

[jxiang] HBASE-6384 hbck should group together those sidelined regions need to be bulk loaded
later

[apurtell] HBASE-6377. HBASE-5533 metrics miss all operations submitted via MultiAction

Applied 6377-0.94-remove-get-put-delete-histograms.patch

[larsh] HBASE-6375 Master may be using a stale list of region servers for creating assignment
plan during startup (Aditya Kishore)

[larsh] CHANGES.txt for 0.94.1RC0

[stack] HBASE-6334 TestImprovement for TestHRegion.testWritesWhileGetting

[tedyu] HBASE-6369 HTable is not closed in AggregationClient (binlijin)

[stack] HBASE-2730 Expose RS work queue contents on web UI

[tedyu] HBASE-6284 Introduce HRegion#doMiniBatchMutation() (Anoop)

[larsh] HBASE-6355 Addendum

[tedyu] HBASE-6337 [MTTR] Remove renaming tmp log file in SplitLogManager (Chunhui)

[jxiang] HBASE-6357 Failed distributed log splitting stuck on master web UI

[jmhsieh] HBASE-4379 [hbck] Does not complain about tables with no end region [Z,] (Anoop
Sam John)

[larsh] HBASE-6329 Stopping META regionserver when splitting region could cause daughter region
to be assigned twice (chunhui shen)

[larsh] HBASE-6355 Allow HBase to compile against JDK7

[larsh] HBASE-6313 Client hangs because the client is not notified (binlijin)

[jmhsieh] HBASE-6283 [region_mover.rb] Add option to exclude list of hosts on unload instead
of just assuming the source node

[stack] HBASE-6341 Publicly expose HConnectionKey

[larsh] HBASE-6311 Data error after majorCompaction caused by keeping MVCC for opened scanners
(chunhui shen)

[apurtell] HBASE-6253. Do not allow user to disable or drop ACL table (Gopinathan)

[larsh] HBASE-5909 SlabStats should be a daemon thread

[jmhsieh] Revert HBASE-6330 - hadoop 2.0 was fixed but this broke hadoop 1.0 build

[apurtell] HBASE-6332. Improve POM for better integration with downstream ivy projects (Roman
Shaposhnik)

[larsh] HBASE-6293 HMaster does not go down while splitting logs even if explicit shutdown
is called.

------------------------------------------
[...truncated 9394 lines...]
Running org.apache.hadoop.hbase.coprocessor.TestMasterObserver
Tests run: 3, Failures: 0, Errors: 0, Skipped: 0, Time elapsed: 20.577 sec
Forking command line: /bin/sh -c cd <https://builds.apache.org/job/HBase-0.94-security-on-Hadoop-23/ws/trunk>
&& /home/jenkins/tools/java/jdk1.6.0_27-32/jre/bin/java -enableassertions -Xmx1900m
-Djava.security.egd=file:/dev/./urandom -jar <https://builds.apache.org/job/HBase-0.94-security-on-Hadoop-23/ws/trunk/target/surefire/surefirebooter592675675955572386.jar>
<https://builds.apache.org/job/HBase-0.94-security-on-Hadoop-23/ws/trunk/target/surefire/surefire970499097130652289tmp>
<https://builds.apache.org/job/HBase-0.94-security-on-Hadoop-23/ws/trunk/target/surefire/surefire_812981653900803240098tmp>
Running org.apache.hadoop.hbase.coprocessor.TestCoprocessorEndpoint
Tests run: 3, Failures: 0, Errors: 0, Skipped: 1, Time elapsed: 24.335 sec
Forking command line: /bin/sh -c cd <https://builds.apache.org/job/HBase-0.94-security-on-Hadoop-23/ws/trunk>
&& /home/jenkins/tools/java/jdk1.6.0_27-32/jre/bin/java -enableassertions -Xmx1900m
-Djava.security.egd=file:/dev/./urandom -jar <https://builds.apache.org/job/HBase-0.94-security-on-Hadoop-23/ws/trunk/target/surefire/surefirebooter5064882157064792964.jar>
<https://builds.apache.org/job/HBase-0.94-security-on-Hadoop-23/ws/trunk/target/surefire/surefire2761084239384812629tmp>
<https://builds.apache.org/job/HBase-0.94-security-on-Hadoop-23/ws/trunk/target/surefire/surefire_822332729783551826991tmp>
Running org.apache.hadoop.hbase.coprocessor.TestClassLoading
Tests run: 6, Failures: 0, Errors: 0, Skipped: 0, Time elapsed: 22.683 sec
Forking command line: /bin/sh -c cd <https://builds.apache.org/job/HBase-0.94-security-on-Hadoop-23/ws/trunk>
&& /home/jenkins/tools/java/jdk1.6.0_27-32/jre/bin/java -enableassertions -Xmx1900m
-Djava.security.egd=file:/dev/./urandom -jar <https://builds.apache.org/job/HBase-0.94-security-on-Hadoop-23/ws/trunk/target/surefire/surefirebooter1758707058850974900.jar>
<https://builds.apache.org/job/HBase-0.94-security-on-Hadoop-23/ws/trunk/target/surefire/surefire8410346935783227132tmp>
<https://builds.apache.org/job/HBase-0.94-security-on-Hadoop-23/ws/trunk/target/surefire/surefire_835580362062986157586tmp>
Running org.apache.hadoop.hbase.coprocessor.TestMasterCoprocessorExceptionWithRemove
Tests run: 1, Failures: 0, Errors: 0, Skipped: 0, Time elapsed: 10.828 sec
Forking command line: /bin/sh -c cd <https://builds.apache.org/job/HBase-0.94-security-on-Hadoop-23/ws/trunk>
&& /home/jenkins/tools/java/jdk1.6.0_27-32/jre/bin/java -enableassertions -Xmx1900m
-Djava.security.egd=file:/dev/./urandom -jar <https://builds.apache.org/job/HBase-0.94-security-on-Hadoop-23/ws/trunk/target/surefire/surefirebooter7483878333626175338.jar>
<https://builds.apache.org/job/HBase-0.94-security-on-Hadoop-23/ws/trunk/target/surefire/surefire278530700601141518tmp>
<https://builds.apache.org/job/HBase-0.94-security-on-Hadoop-23/ws/trunk/target/surefire/surefire_84153061922154875774tmp>
Running org.apache.hadoop.hbase.coprocessor.TestRegionObserverInterface
Tests run: 7, Failures: 0, Errors: 0, Skipped: 0, Time elapsed: 27.454 sec
Forking command line: /bin/sh -c cd <https://builds.apache.org/job/HBase-0.94-security-on-Hadoop-23/ws/trunk>
&& /home/jenkins/tools/java/jdk1.6.0_27-32/jre/bin/java -enableassertions -Xmx1900m
-Djava.security.egd=file:/dev/./urandom -jar <https://builds.apache.org/job/HBase-0.94-security-on-Hadoop-23/ws/trunk/target/surefire/surefirebooter4495365882056099902.jar>
<https://builds.apache.org/job/HBase-0.94-security-on-Hadoop-23/ws/trunk/target/surefire/surefire4390737490749567834tmp>
<https://builds.apache.org/job/HBase-0.94-security-on-Hadoop-23/ws/trunk/target/surefire/surefire_851833544379751852705tmp>
Running org.apache.hadoop.hbase.coprocessor.TestMasterCoprocessorExceptionWithAbort
Tests run: 1, Failures: 0, Errors: 0, Skipped: 0, Time elapsed: 7.484 sec
Forking command line: /bin/sh -c cd <https://builds.apache.org/job/HBase-0.94-security-on-Hadoop-23/ws/trunk>
&& /home/jenkins/tools/java/jdk1.6.0_27-32/jre/bin/java -enableassertions -Xmx1900m
-Djava.security.egd=file:/dev/./urandom -jar <https://builds.apache.org/job/HBase-0.94-security-on-Hadoop-23/ws/trunk/target/surefire/surefirebooter5335122973577019881.jar>
<https://builds.apache.org/job/HBase-0.94-security-on-Hadoop-23/ws/trunk/target/surefire/surefire7143861526503364539tmp>
<https://builds.apache.org/job/HBase-0.94-security-on-Hadoop-23/ws/trunk/target/surefire/surefire_867894872244390128508tmp>
Running org.apache.hadoop.hbase.coprocessor.TestRegionServerCoprocessorExceptionWithRemove
Tests run: 1, Failures: 0, Errors: 0, Skipped: 0, Time elapsed: 12.047 sec
Forking command line: /bin/sh -c cd <https://builds.apache.org/job/HBase-0.94-security-on-Hadoop-23/ws/trunk>
&& /home/jenkins/tools/java/jdk1.6.0_27-32/jre/bin/java -enableassertions -Xmx1900m
-Djava.security.egd=file:/dev/./urandom -jar <https://builds.apache.org/job/HBase-0.94-security-on-Hadoop-23/ws/trunk/target/surefire/surefirebooter3302993439913831758.jar>
<https://builds.apache.org/job/HBase-0.94-security-on-Hadoop-23/ws/trunk/target/surefire/surefire519872859628796001tmp>
<https://builds.apache.org/job/HBase-0.94-security-on-Hadoop-23/ws/trunk/target/surefire/surefire_875370024632417809409tmp>
Running org.apache.hadoop.hbase.coprocessor.TestWALObserver
Tests run: 3, Failures: 0, Errors: 0, Skipped: 0, Time elapsed: 10.472 sec
Forking command line: /bin/sh -c cd <https://builds.apache.org/job/HBase-0.94-security-on-Hadoop-23/ws/trunk>
&& /home/jenkins/tools/java/jdk1.6.0_27-32/jre/bin/java -enableassertions -Xmx1900m
-Djava.security.egd=file:/dev/./urandom -jar <https://builds.apache.org/job/HBase-0.94-security-on-Hadoop-23/ws/trunk/target/surefire/surefirebooter7441560121395824108.jar>
<https://builds.apache.org/job/HBase-0.94-security-on-Hadoop-23/ws/trunk/target/surefire/surefire6073170491119890185tmp>
<https://builds.apache.org/job/HBase-0.94-security-on-Hadoop-23/ws/trunk/target/surefire/surefire_883164363135520160895tmp>
Running org.apache.hadoop.hbase.coprocessor.TestRegionServerCoprocessorExceptionWithAbort
Tests run: 1, Failures: 0, Errors: 0, Skipped: 0, Time elapsed: 9.043 sec
Forking command line: /bin/sh -c cd <https://builds.apache.org/job/HBase-0.94-security-on-Hadoop-23/ws/trunk>
&& /home/jenkins/tools/java/jdk1.6.0_27-32/jre/bin/java -enableassertions -Xmx1900m
-Djava.security.egd=file:/dev/./urandom -jar <https://builds.apache.org/job/HBase-0.94-security-on-Hadoop-23/ws/trunk/target/surefire/surefirebooter4019702703325801581.jar>
<https://builds.apache.org/job/HBase-0.94-security-on-Hadoop-23/ws/trunk/target/surefire/surefire3637437433198998360tmp>
<https://builds.apache.org/job/HBase-0.94-security-on-Hadoop-23/ws/trunk/target/surefire/surefire_893809867221193085765tmp>
Running org.apache.hadoop.hbase.coprocessor.TestRegionObserverBypass
Tests run: 2, Failures: 0, Errors: 0, Skipped: 0, Time elapsed: 8.162 sec
Forking command line: /bin/sh -c cd <https://builds.apache.org/job/HBase-0.94-security-on-Hadoop-23/ws/trunk>
&& /home/jenkins/tools/java/jdk1.6.0_27-32/jre/bin/java -enableassertions -Xmx1900m
-Djava.security.egd=file:/dev/./urandom -jar <https://builds.apache.org/job/HBase-0.94-security-on-Hadoop-23/ws/trunk/target/surefire/surefirebooter8017320135156739266.jar>
<https://builds.apache.org/job/HBase-0.94-security-on-Hadoop-23/ws/trunk/target/surefire/surefire675190675181653712tmp>
<https://builds.apache.org/job/HBase-0.94-security-on-Hadoop-23/ws/trunk/target/surefire/surefire_909191486493225833042tmp>
Running org.apache.hadoop.hbase.thrift2.TestThriftHBaseServiceHandler
Tests run: 12, Failures: 0, Errors: 0, Skipped: 0, Time elapsed: 8.266 sec
Forking command line: /bin/sh -c cd <https://builds.apache.org/job/HBase-0.94-security-on-Hadoop-23/ws/trunk>
&& /home/jenkins/tools/java/jdk1.6.0_27-32/jre/bin/java -enableassertions -Xmx1900m
-Djava.security.egd=file:/dev/./urandom -jar <https://builds.apache.org/job/HBase-0.94-security-on-Hadoop-23/ws/trunk/target/surefire/surefirebooter5433099676130143837.jar>
<https://builds.apache.org/job/HBase-0.94-security-on-Hadoop-23/ws/trunk/target/surefire/surefire5257240543661650550tmp>
<https://builds.apache.org/job/HBase-0.94-security-on-Hadoop-23/ws/trunk/target/surefire/surefire_916130067232726996759tmp>
Running org.apache.hadoop.hbase.avro.TestAvroServer
Tests run: 3, Failures: 0, Errors: 0, Skipped: 0, Time elapsed: 19.182 sec
Forking command line: /bin/sh -c cd <https://builds.apache.org/job/HBase-0.94-security-on-Hadoop-23/ws/trunk>
&& /home/jenkins/tools/java/jdk1.6.0_27-32/jre/bin/java -enableassertions -Xmx1900m
-Djava.security.egd=file:/dev/./urandom -jar <https://builds.apache.org/job/HBase-0.94-security-on-Hadoop-23/ws/trunk/target/surefire/surefirebooter3747964555032214357.jar>
<https://builds.apache.org/job/HBase-0.94-security-on-Hadoop-23/ws/trunk/target/surefire/surefire4057608781731021632tmp>
<https://builds.apache.org/job/HBase-0.94-security-on-Hadoop-23/ws/trunk/target/surefire/surefire_925962913719310588221tmp>
Running org.apache.hadoop.hbase.monitoring.TestTaskMonitor
Tests run: 3, Failures: 0, Errors: 0, Skipped: 0, Time elapsed: 0.317 sec
Forking command line: /bin/sh -c cd <https://builds.apache.org/job/HBase-0.94-security-on-Hadoop-23/ws/trunk>
&& /home/jenkins/tools/java/jdk1.6.0_27-32/jre/bin/java -enableassertions -Xmx1900m
-Djava.security.egd=file:/dev/./urandom -jar <https://builds.apache.org/job/HBase-0.94-security-on-Hadoop-23/ws/trunk/target/surefire/surefirebooter6468154818288852683.jar>
<https://builds.apache.org/job/HBase-0.94-security-on-Hadoop-23/ws/trunk/target/surefire/surefire2451726399263025645tmp>
<https://builds.apache.org/job/HBase-0.94-security-on-Hadoop-23/ws/trunk/target/surefire/surefire_938178802140541629425tmp>
Running org.apache.hadoop.hbase.monitoring.TestMemoryBoundedLogMessageBuffer
Tests run: 2, Failures: 0, Errors: 0, Skipped: 0, Time elapsed: 0.236 sec
Forking command line: /bin/sh -c cd <https://builds.apache.org/job/HBase-0.94-security-on-Hadoop-23/ws/trunk>
&& /home/jenkins/tools/java/jdk1.6.0_27-32/jre/bin/java -enableassertions -Xmx1900m
-Djava.security.egd=file:/dev/./urandom -jar <https://builds.apache.org/job/HBase-0.94-security-on-Hadoop-23/ws/trunk/target/surefire/surefirebooter8956109771401536141.jar>
<https://builds.apache.org/job/HBase-0.94-security-on-Hadoop-23/ws/trunk/target/surefire/surefire258398658341670492tmp>
<https://builds.apache.org/job/HBase-0.94-security-on-Hadoop-23/ws/trunk/target/surefire/surefire_942833257366288721057tmp>
Running org.apache.hadoop.hbase.thrift.TestThriftServer
Tests run: 1, Failures: 0, Errors: 0, Skipped: 0, Time elapsed: 33.614 sec
Forking command line: /bin/sh -c cd <https://builds.apache.org/job/HBase-0.94-security-on-Hadoop-23/ws/trunk>
&& /home/jenkins/tools/java/jdk1.6.0_27-32/jre/bin/java -enableassertions -Xmx1900m
-Djava.security.egd=file:/dev/./urandom -jar <https://builds.apache.org/job/HBase-0.94-security-on-Hadoop-23/ws/trunk/target/surefire/surefirebooter1512278825360402934.jar>
<https://builds.apache.org/job/HBase-0.94-security-on-Hadoop-23/ws/trunk/target/surefire/surefire5263612161289186349tmp>
<https://builds.apache.org/job/HBase-0.94-security-on-Hadoop-23/ws/trunk/target/surefire/surefire_952352984773825586751tmp>
Running org.apache.hadoop.hbase.regionserver.TestHRegionOnCluster
Tests run: 1, Failures: 0, Errors: 0, Skipped: 0, Time elapsed: 16.739 sec
Forking command line: /bin/sh -c cd <https://builds.apache.org/job/HBase-0.94-security-on-Hadoop-23/ws/trunk>
&& /home/jenkins/tools/java/jdk1.6.0_27-32/jre/bin/java -enableassertions -Xmx1900m
-Djava.security.egd=file:/dev/./urandom -jar <https://builds.apache.org/job/HBase-0.94-security-on-Hadoop-23/ws/trunk/target/surefire/surefirebooter7082667954552060355.jar>
<https://builds.apache.org/job/HBase-0.94-security-on-Hadoop-23/ws/trunk/target/surefire/surefire6302649031935652860tmp>
<https://builds.apache.org/job/HBase-0.94-security-on-Hadoop-23/ws/trunk/target/surefire/surefire_968100428170136927653tmp>
Running org.apache.hadoop.hbase.regionserver.TestMasterAddressManager
Tests run: 1, Failures: 0, Errors: 0, Skipped: 0, Time elapsed: 0.755 sec
Forking command line: /bin/sh -c cd <https://builds.apache.org/job/HBase-0.94-security-on-Hadoop-23/ws/trunk>
&& /home/jenkins/tools/java/jdk1.6.0_27-32/jre/bin/java -enableassertions -Xmx1900m
-Djava.security.egd=file:/dev/./urandom -jar <https://builds.apache.org/job/HBase-0.94-security-on-Hadoop-23/ws/trunk/target/surefire/surefirebooter8506312355066121181.jar>
<https://builds.apache.org/job/HBase-0.94-security-on-Hadoop-23/ws/trunk/target/surefire/surefire9202422389141510407tmp>
<https://builds.apache.org/job/HBase-0.94-security-on-Hadoop-23/ws/trunk/target/surefire/surefire_972786478126524904827tmp>
Running org.apache.hadoop.hbase.regionserver.TestRegionServerMetrics
Tests run: 3, Failures: 0, Errors: 0, Skipped: 0, Time elapsed: 27.769 sec
Forking command line: /bin/sh -c cd <https://builds.apache.org/job/HBase-0.94-security-on-Hadoop-23/ws/trunk>
&& /home/jenkins/tools/java/jdk1.6.0_27-32/jre/bin/java -enableassertions -Xmx1900m
-Djava.security.egd=file:/dev/./urandom -jar <https://builds.apache.org/job/HBase-0.94-security-on-Hadoop-23/ws/trunk/target/surefire/surefirebooter8682724551865627083.jar>
<https://builds.apache.org/job/HBase-0.94-security-on-Hadoop-23/ws/trunk/target/surefire/surefire9183196402786841668tmp>
<https://builds.apache.org/job/HBase-0.94-security-on-Hadoop-23/ws/trunk/target/surefire/surefire_984242931112532663708tmp>
Running org.apache.hadoop.hbase.regionserver.TestHRegion
Tests run: 66, Failures: 0, Errors: 0, Skipped: 0, Time elapsed: 33.854 sec
Forking command line: /bin/sh -c cd <https://builds.apache.org/job/HBase-0.94-security-on-Hadoop-23/ws/trunk>
&& /home/jenkins/tools/java/jdk1.6.0_27-32/jre/bin/java -enableassertions -Xmx1900m
-Djava.security.egd=file:/dev/./urandom -jar <https://builds.apache.org/job/HBase-0.94-security-on-Hadoop-23/ws/trunk/target/surefire/surefirebooter1512965186673118657.jar>
<https://builds.apache.org/job/HBase-0.94-security-on-Hadoop-23/ws/trunk/target/surefire/surefire3398779942246907377tmp>
<https://builds.apache.org/job/HBase-0.94-security-on-Hadoop-23/ws/trunk/target/surefire/surefire_994410477259568604794tmp>
Running org.apache.hadoop.hbase.regionserver.TestSplitLogWorker
Tests run: 5, Failures: 0, Errors: 0, Skipped: 0, Time elapsed: 2.382 sec
Forking command line: /bin/sh -c cd <https://builds.apache.org/job/HBase-0.94-security-on-Hadoop-23/ws/trunk>
&& /home/jenkins/tools/java/jdk1.6.0_27-32/jre/bin/java -enableassertions -Xmx1900m
-Djava.security.egd=file:/dev/./urandom -jar <https://builds.apache.org/job/HBase-0.94-security-on-Hadoop-23/ws/trunk/target/surefire/surefirebooter1886449652783279352.jar>
<https://builds.apache.org/job/HBase-0.94-security-on-Hadoop-23/ws/trunk/target/surefire/surefire8152038765463069627tmp>
<https://builds.apache.org/job/HBase-0.94-security-on-Hadoop-23/ws/trunk/target/surefire/surefire_1001495749927312340272tmp>
Running org.apache.hadoop.hbase.regionserver.TestServerCustomProtocol
Tests run: 7, Failures: 0, Errors: 0, Skipped: 0, Time elapsed: 9.783 sec
Forking command line: /bin/sh -c cd <https://builds.apache.org/job/HBase-0.94-security-on-Hadoop-23/ws/trunk>
&& /home/jenkins/tools/java/jdk1.6.0_27-32/jre/bin/java -enableassertions -Xmx1900m
-Djava.security.egd=file:/dev/./urandom -jar <https://builds.apache.org/job/HBase-0.94-security-on-Hadoop-23/ws/trunk/target/surefire/surefirebooter5264262948337433755.jar>
<https://builds.apache.org/job/HBase-0.94-security-on-Hadoop-23/ws/trunk/target/surefire/surefire989212982035317590tmp>
<https://builds.apache.org/job/HBase-0.94-security-on-Hadoop-23/ws/trunk/target/surefire/surefire_101554304471661298785tmp>
Running org.apache.hadoop.hbase.regionserver.TestStoreFileBlockCacheSummary
Tests run: 1, Failures: 0, Errors: 0, Skipped: 0, Time elapsed: 8.647 sec
Forking command line: /bin/sh -c cd <https://builds.apache.org/job/HBase-0.94-security-on-Hadoop-23/ws/trunk>
&& /home/jenkins/tools/java/jdk1.6.0_27-32/jre/bin/java -enableassertions -Xmx1900m
-Djava.security.egd=file:/dev/./urandom -jar <https://builds.apache.org/job/HBase-0.94-security-on-Hadoop-23/ws/trunk/target/surefire/surefirebooter187388574018217252.jar>
<https://builds.apache.org/job/HBase-0.94-security-on-Hadoop-23/ws/trunk/target/surefire/surefire824059970198994734tmp>
<https://builds.apache.org/job/HBase-0.94-security-on-Hadoop-23/ws/trunk/target/surefire/surefire_1027714980307275882018tmp>
Running org.apache.hadoop.hbase.regionserver.TestCompactionWithCoprocessor
Tests run: 15, Failures: 0, Errors: 0, Skipped: 0, Time elapsed: 35.795 sec
Forking command line: /bin/sh -c cd <https://builds.apache.org/job/HBase-0.94-security-on-Hadoop-23/ws/trunk>
&& /home/jenkins/tools/java/jdk1.6.0_27-32/jre/bin/java -enableassertions -Xmx1900m
-Djava.security.egd=file:/dev/./urandom -jar <https://builds.apache.org/job/HBase-0.94-security-on-Hadoop-23/ws/trunk/target/surefire/surefirebooter1226226922098333291.jar>
<https://builds.apache.org/job/HBase-0.94-security-on-Hadoop-23/ws/trunk/target/surefire/surefire798817814203995223tmp>
<https://builds.apache.org/job/HBase-0.94-security-on-Hadoop-23/ws/trunk/target/surefire/surefire_1031526147673307936687tmp>
Running org.apache.hadoop.hbase.regionserver.TestStore
Tests run: 12, Failures: 0, Errors: 0, Skipped: 0, Time elapsed: 9.574 sec
Forking command line: /bin/sh -c cd <https://builds.apache.org/job/HBase-0.94-security-on-Hadoop-23/ws/trunk>
&& /home/jenkins/tools/java/jdk1.6.0_27-32/jre/bin/java -enableassertions -Xmx1900m
-Djava.security.egd=file:/dev/./urandom -jar <https://builds.apache.org/job/HBase-0.94-security-on-Hadoop-23/ws/trunk/target/surefire/surefirebooter4259646616543406935.jar>
<https://builds.apache.org/job/HBase-0.94-security-on-Hadoop-23/ws/trunk/target/surefire/surefire6910530656625328930tmp>
<https://builds.apache.org/job/HBase-0.94-security-on-Hadoop-23/ws/trunk/target/surefire/surefire_1048899383865668499470tmp>
Running org.apache.hadoop.hbase.regionserver.TestBlocksRead
Tests run: 4, Failures: 0, Errors: 0, Skipped: 0, Time elapsed: 1.535 sec
Forking command line: /bin/sh -c cd <https://builds.apache.org/job/HBase-0.94-security-on-Hadoop-23/ws/trunk>
&& /home/jenkins/tools/java/jdk1.6.0_27-32/jre/bin/java -enableassertions -Xmx1900m
-Djava.security.egd=file:/dev/./urandom -jar <https://builds.apache.org/job/HBase-0.94-security-on-Hadoop-23/ws/trunk/target/surefire/surefirebooter1252781703708725949.jar>
<https://builds.apache.org/job/HBase-0.94-security-on-Hadoop-23/ws/trunk/target/surefire/surefire7182407372480123580tmp>
<https://builds.apache.org/job/HBase-0.94-security-on-Hadoop-23/ws/trunk/target/surefire/surefire_1052417905325475193389tmp>
Running org.apache.hadoop.hbase.regionserver.TestAtomicOperation
Tests run: 5, Failures: 0, Errors: 0, Skipped: 0, Time elapsed: 19.001 sec
Forking command line: /bin/sh -c cd <https://builds.apache.org/job/HBase-0.94-security-on-Hadoop-23/ws/trunk>
&& /home/jenkins/tools/java/jdk1.6.0_27-32/jre/bin/java -enableassertions -Xmx1900m
-Djava.security.egd=file:/dev/./urandom -jar <https://builds.apache.org/job/HBase-0.94-security-on-Hadoop-23/ws/trunk/target/surefire/surefirebooter8614931545669004016.jar>
<https://builds.apache.org/job/HBase-0.94-security-on-Hadoop-23/ws/trunk/target/surefire/surefire5043315948058277163tmp>
<https://builds.apache.org/job/HBase-0.94-security-on-Hadoop-23/ws/trunk/target/surefire/surefire_1066872318676207669378tmp>
Running org.apache.hadoop.hbase.regionserver.TestSeekOptimizations
Tests run: 6, Failures: 0, Errors: 0, Skipped: 0, Time elapsed: 3.049 sec
Forking command line: /bin/sh -c cd <https://builds.apache.org/job/HBase-0.94-security-on-Hadoop-23/ws/trunk>
&& /home/jenkins/tools/java/jdk1.6.0_27-32/jre/bin/java -enableassertions -Xmx1900m
-Djava.security.egd=file:/dev/./urandom -jar <https://builds.apache.org/job/HBase-0.94-security-on-Hadoop-23/ws/trunk/target/surefire/surefirebooter8817607540531347094.jar>
<https://builds.apache.org/job/HBase-0.94-security-on-Hadoop-23/ws/trunk/target/surefire/surefire5633777950819412926tmp>
<https://builds.apache.org/job/HBase-0.94-security-on-Hadoop-23/ws/trunk/target/surefire/surefire_107568564349127091531tmp>
Running org.apache.hadoop.hbase.regionserver.TestFSErrorsExposed
Tests run: 3, Failures: 0, Errors: 0, Skipped: 0, Time elapsed: 31.593 sec
Forking command line: /bin/sh -c cd <https://builds.apache.org/job/HBase-0.94-security-on-Hadoop-23/ws/trunk>
&& /home/jenkins/tools/java/jdk1.6.0_27-32/jre/bin/java -enableassertions -Xmx1900m
-Djava.security.egd=file:/dev/./urandom -jar <https://builds.apache.org/job/HBase-0.94-security-on-Hadoop-23/ws/trunk/target/surefire/surefirebooter4676541092625533901.jar>
<https://builds.apache.org/job/HBase-0.94-security-on-Hadoop-23/ws/trunk/target/surefire/surefire2690230165907456tmp>
<https://builds.apache.org/job/HBase-0.94-security-on-Hadoop-23/ws/trunk/target/surefire/surefire_1086770847736072125633tmp>
Running org.apache.hadoop.hbase.regionserver.handler.TestCloseRegionHandler
Tests run: 3, Failures: 0, Errors: 0, Skipped: 0, Time elapsed: 1.375 sec
Forking command line: /bin/sh -c cd <https://builds.apache.org/job/HBase-0.94-security-on-Hadoop-23/ws/trunk>
&& /home/jenkins/tools/java/jdk1.6.0_27-32/jre/bin/java -enableassertions -Xmx1900m
-Djava.security.egd=file:/dev/./urandom -jar <https://builds.apache.org/job/HBase-0.94-security-on-Hadoop-23/ws/trunk/target/surefire/surefirebooter708438818664191475.jar>
<https://builds.apache.org/job/HBase-0.94-security-on-Hadoop-23/ws/trunk/target/surefire/surefire6577681624461996777tmp>
<https://builds.apache.org/job/HBase-0.94-security-on-Hadoop-23/ws/trunk/target/surefire/surefire_1091355446815945340838tmp>
Running org.apache.hadoop.hbase.regionserver.handler.TestOpenRegionHandler
Tests run: 3, Failures: 0, Errors: 0, Skipped: 0, Time elapsed: 1.168 sec
Forking command line: /bin/sh -c cd <https://builds.apache.org/job/HBase-0.94-security-on-Hadoop-23/ws/trunk>
&& /home/jenkins/tools/java/jdk1.6.0_27-32/jre/bin/java -enableassertions -Xmx1900m
-Djava.security.egd=file:/dev/./urandom -jar <https://builds.apache.org/job/HBase-0.94-security-on-Hadoop-23/ws/trunk/target/surefire/surefirebooter2288864269173819887.jar>
<https://builds.apache.org/job/HBase-0.94-security-on-Hadoop-23/ws/trunk/target/surefire/surefire3885891296146620199tmp>
<https://builds.apache.org/job/HBase-0.94-security-on-Hadoop-23/ws/trunk/target/surefire/surefire_1108364868719210171013tmp>
Running org.apache.hadoop.hbase.regionserver.metrics.TestSchemaMetrics
Tests run: 6, Failures: 0, Errors: 0, Skipped: 0, Time elapsed: 14.823 sec
Forking command line: /bin/sh -c cd <https://builds.apache.org/job/HBase-0.94-security-on-Hadoop-23/ws/trunk>
&& /home/jenkins/tools/java/jdk1.6.0_27-32/jre/bin/java -enableassertions -Xmx1900m
-Djava.security.egd=file:/dev/./urandom -jar <https://builds.apache.org/job/HBase-0.94-security-on-Hadoop-23/ws/trunk/target/surefire/surefirebooter1653769831307585792.jar>
<https://builds.apache.org/job/HBase-0.94-security-on-Hadoop-23/ws/trunk/target/surefire/surefire5906683623127014515tmp>
<https://builds.apache.org/job/HBase-0.94-security-on-Hadoop-23/ws/trunk/target/surefire/surefire_1118755790504443172387tmp>
Running org.apache.hadoop.hbase.regionserver.TestCacheOnWriteInSchema
Tests run: 3, Failures: 0, Errors: 0, Skipped: 0, Time elapsed: 2.007 sec
Forking command line: /bin/sh -c cd <https://builds.apache.org/job/HBase-0.94-security-on-Hadoop-23/ws/trunk>
&& /home/jenkins/tools/java/jdk1.6.0_27-32/jre/bin/java -enableassertions -Xmx1900m
-Djava.security.egd=file:/dev/./urandom -jar <https://builds.apache.org/job/HBase-0.94-security-on-Hadoop-23/ws/trunk/target/surefire/surefirebooter2363098105367235907.jar>
<https://builds.apache.org/job/HBase-0.94-security-on-Hadoop-23/ws/trunk/target/surefire/surefire4512104818661771286tmp>
<https://builds.apache.org/job/HBase-0.94-security-on-Hadoop-23/ws/trunk/target/surefire/surefire_1125151435458873868813tmp>
Running org.apache.hadoop.hbase.regionserver.TestParallelPut
Tests run: 2, Failures: 0, Errors: 0, Skipped: 0, Time elapsed: 5.059 sec
Forking command line: /bin/sh -c cd <https://builds.apache.org/job/HBase-0.94-security-on-Hadoop-23/ws/trunk>
&& /home/jenkins/tools/java/jdk1.6.0_27-32/jre/bin/java -enableassertions -Xmx1900m
-Djava.security.egd=file:/dev/./urandom -jar <https://builds.apache.org/job/HBase-0.94-security-on-Hadoop-23/ws/trunk/target/surefire/surefirebooter2961288010509979618.jar>
<https://builds.apache.org/job/HBase-0.94-security-on-Hadoop-23/ws/trunk/target/surefire/surefire8693897293226918012tmp>
<https://builds.apache.org/job/HBase-0.94-security-on-Hadoop-23/ws/trunk/target/surefire/surefire_113132948969056366398tmp>
Running org.apache.hadoop.hbase.regionserver.wal.TestHLogBench
Tests run: 1, Failures: 0, Errors: 0, Skipped: 0, Time elapsed: 1.492 sec
Forking command line: /bin/sh -c cd <https://builds.apache.org/job/HBase-0.94-security-on-Hadoop-23/ws/trunk>
&& /home/jenkins/tools/java/jdk1.6.0_27-32/jre/bin/java -enableassertions -Xmx1900m
-Djava.security.egd=file:/dev/./urandom -jar <https://builds.apache.org/job/HBase-0.94-security-on-Hadoop-23/ws/trunk/target/surefire/surefirebooter3000182637205502929.jar>
<https://builds.apache.org/job/HBase-0.94-security-on-Hadoop-23/ws/trunk/target/surefire/surefire677686882579343869tmp>
<https://builds.apache.org/job/HBase-0.94-security-on-Hadoop-23/ws/trunk/target/surefire/surefire_1147192765499713137898tmp>
Running org.apache.hadoop.hbase.regionserver.wal.TestLogRollingNoCluster
Tests run: 1, Failures: 0, Errors: 0, Skipped: 0, Time elapsed: 6.167 sec
Forking command line: /bin/sh -c cd <https://builds.apache.org/job/HBase-0.94-security-on-Hadoop-23/ws/trunk>
&& /home/jenkins/tools/java/jdk1.6.0_27-32/jre/bin/java -enableassertions -Xmx1900m
-Djava.security.egd=file:/dev/./urandom -jar <https://builds.apache.org/job/HBase-0.94-security-on-Hadoop-23/ws/trunk/target/surefire/surefirebooter1010170855216000654.jar>
<https://builds.apache.org/job/HBase-0.94-security-on-Hadoop-23/ws/trunk/target/surefire/surefire3660534318296634869tmp>
<https://builds.apache.org/job/HBase-0.94-security-on-Hadoop-23/ws/trunk/target/surefire/surefire_1152867201315720487297tmp>
Running org.apache.hadoop.hbase.regionserver.wal.TestLogRollAbort
Tests run: 1, Failures: 0, Errors: 0, Skipped: 0, Time elapsed: 12.847 sec
Forking command line: /bin/sh -c cd <https://builds.apache.org/job/HBase-0.94-security-on-Hadoop-23/ws/trunk>
&& /home/jenkins/tools/java/jdk1.6.0_27-32/jre/bin/java -enableassertions -Xmx1900m
-Djava.security.egd=file:/dev/./urandom -jar <https://builds.apache.org/job/HBase-0.94-security-on-Hadoop-23/ws/trunk/target/surefire/surefirebooter8190127527636520819.jar>
<https://builds.apache.org/job/HBase-0.94-security-on-Hadoop-23/ws/trunk/target/surefire/surefire6957222380510713896tmp>
<https://builds.apache.org/job/HBase-0.94-security-on-Hadoop-23/ws/trunk/target/surefire/surefire_1164910915436566743058tmp>
Running org.apache.hadoop.hbase.regionserver.wal.TestWALReplay
Tests run: 6, Failures: 0, Errors: 0, Skipped: 0, Time elapsed: 20.013 sec
Forking command line: /bin/sh -c cd <https://builds.apache.org/job/HBase-0.94-security-on-Hadoop-23/ws/trunk>
&& /home/jenkins/tools/java/jdk1.6.0_27-32/jre/bin/java -enableassertions -Xmx1900m
-Djava.security.egd=file:/dev/./urandom -jar <https://builds.apache.org/job/HBase-0.94-security-on-Hadoop-23/ws/trunk/target/surefire/surefirebooter3081314857125713796.jar>
<https://builds.apache.org/job/HBase-0.94-security-on-Hadoop-23/ws/trunk/target/surefire/surefire5699761041949944998tmp>
<https://builds.apache.org/job/HBase-0.94-security-on-Hadoop-23/ws/trunk/target/surefire/surefire_1173137714625769698026tmp>
Running org.apache.hadoop.hbase.regionserver.TestStoreScanner
Tests run: 16, Failures: 0, Errors: 0, Skipped: 0, Time elapsed: 0.053 sec
Forking command line: /bin/sh -c cd <https://builds.apache.org/job/HBase-0.94-security-on-Hadoop-23/ws/trunk>
&& /home/jenkins/tools/java/jdk1.6.0_27-32/jre/bin/java -enableassertions -Xmx1900m
-Djava.security.egd=file:/dev/./urandom -jar <https://builds.apache.org/job/HBase-0.94-security-on-Hadoop-23/ws/trunk/target/surefire/surefirebooter1349638430441516590.jar>
<https://builds.apache.org/job/HBase-0.94-security-on-Hadoop-23/ws/trunk/target/surefire/surefire5488447306230022445tmp>
<https://builds.apache.org/job/HBase-0.94-security-on-Hadoop-23/ws/trunk/target/surefire/surefire_1183626273253796029141tmp>
Running org.apache.hadoop.hbase.regionserver.TestRpcMetrics
Tests run: 1, Failures: 0, Errors: 0, Skipped: 0, Time elapsed: 2.058 sec
Forking command line: /bin/sh -c cd <https://builds.apache.org/job/HBase-0.94-security-on-Hadoop-23/ws/trunk>
&& /home/jenkins/tools/java/jdk1.6.0_27-32/jre/bin/java -enableassertions -Xmx1900m
-Djava.security.egd=file:/dev/./urandom -jar <https://builds.apache.org/job/HBase-0.94-security-on-Hadoop-23/ws/trunk/target/surefire/surefirebooter2574782448790205380.jar>
<https://builds.apache.org/job/HBase-0.94-security-on-Hadoop-23/ws/trunk/target/surefire/surefire8766215425932456525tmp>
<https://builds.apache.org/job/HBase-0.94-security-on-Hadoop-23/ws/trunk/target/surefire/surefire_1195443110576973334701tmp>
Running org.apache.hadoop.hbase.regionserver.wal.TestWALReplayCompressed
Tests run: 6, Failures: 0, Errors: 0, Skipped: 0, Time elapsed: 20.749 sec
Forking command line: /bin/sh -c cd <https://builds.apache.org/job/HBase-0.94-security-on-Hadoop-23/ws/trunk>
&& /home/jenkins/tools/java/jdk1.6.0_27-32/jre/bin/java -enableassertions -Xmx1900m
-Djava.security.egd=file:/dev/./urandom -jar <https://builds.apache.org/job/HBase-0.94-security-on-Hadoop-23/ws/trunk/target/surefire/surefirebooter6553583293455030610.jar>
<https://builds.apache.org/job/HBase-0.94-security-on-Hadoop-23/ws/trunk/target/surefire/surefire6462139622964000919tmp>
<https://builds.apache.org/job/HBase-0.94-security-on-Hadoop-23/ws/trunk/target/surefire/surefire_1207893974807719449554tmp>
Running org.apache.hadoop.hbase.TestClusterBootOrder
Tests run: 2, Failures: 0, Errors: 0, Skipped: 0, Time elapsed: 21.404 sec
Forking command line: /bin/sh -c cd <https://builds.apache.org/job/HBase-0.94-security-on-Hadoop-23/ws/trunk>
&& /home/jenkins/tools/java/jdk1.6.0_27-32/jre/bin/java -enableassertions -Xmx1900m
-Djava.security.egd=file:/dev/./urandom -jar <https://builds.apache.org/job/HBase-0.94-security-on-Hadoop-23/ws/trunk/target/surefire/surefirebooter6291522955218740337.jar>
<https://builds.apache.org/job/HBase-0.94-security-on-Hadoop-23/ws/trunk/target/surefire/surefire2252143102850697986tmp>
<https://builds.apache.org/job/HBase-0.94-security-on-Hadoop-23/ws/trunk/target/surefire/surefire_1217103882956822642609tmp>
Running org.apache.hadoop.hbase.TestDrainingServer
Tests run: 2, Failures: 0, Errors: 0, Skipped: 0, Time elapsed: 13.083 sec
Forking command line: /bin/sh -c cd <https://builds.apache.org/job/HBase-0.94-security-on-Hadoop-23/ws/trunk>
&& /home/jenkins/tools/java/jdk1.6.0_27-32/jre/bin/java -enableassertions -Xmx1900m
-Djava.security.egd=file:/dev/./urandom -jar <https://builds.apache.org/job/HBase-0.94-security-on-Hadoop-23/ws/trunk/target/surefire/surefirebooter6329059666976215613.jar>
<https://builds.apache.org/job/HBase-0.94-security-on-Hadoop-23/ws/trunk/target/surefire/surefire1039251138773445457tmp>
<https://builds.apache.org/job/HBase-0.94-security-on-Hadoop-23/ws/trunk/target/surefire/surefire_12211257048874983920tmp>
Running org.apache.hadoop.hbase.regionserver.TestMultiColumnScanner
Tests run: 12, Failures: 0, Errors: 0, Skipped: 0, Time elapsed: 41.797 sec
Forking command line: /bin/sh -c cd <https://builds.apache.org/job/HBase-0.94-security-on-Hadoop-23/ws/trunk>
&& /home/jenkins/tools/java/jdk1.6.0_27-32/jre/bin/java -enableassertions -Xmx1900m
-Djava.security.egd=file:/dev/./urandom -jar <https://builds.apache.org/job/HBase-0.94-security-on-Hadoop-23/ws/trunk/target/surefire/surefirebooter898771630740546586.jar>
<https://builds.apache.org/job/HBase-0.94-security-on-Hadoop-23/ws/trunk/target/surefire/surefire9038459609119279573tmp>
<https://builds.apache.org/job/HBase-0.94-security-on-Hadoop-23/ws/trunk/target/surefire/surefire_1239072244890443735323tmp>
Running org.apache.hadoop.hbase.mapreduce.TestImportExport
Tests run: 1, Failures: 0, Errors: 1, Skipped: 0, Time elapsed: 96.946 sec <<< FAILURE!
Forking command line: /bin/sh -c cd <https://builds.apache.org/job/HBase-0.94-security-on-Hadoop-23/ws/trunk>
&& /home/jenkins/tools/java/jdk1.6.0_27-32/jre/bin/java -enableassertions -Xmx1900m
-Djava.security.egd=file:/dev/./urandom -jar <https://builds.apache.org/job/HBase-0.94-security-on-Hadoop-23/ws/trunk/target/surefire/surefirebooter2570934009384480596.jar>
<https://builds.apache.org/job/HBase-0.94-security-on-Hadoop-23/ws/trunk/target/surefire/surefire5056763710281495761tmp>
<https://builds.apache.org/job/HBase-0.94-security-on-Hadoop-23/ws/trunk/target/surefire/surefire_1241458417680825530338tmp>
Running org.apache.hadoop.hbase.mapreduce.TestImportTsv
Tests run: 9, Failures: 0, Errors: 0, Skipped: 0, Time elapsed: 102.054 sec
Running org.apache.hadoop.hbase.mapreduce.TestHLogRecordReader
Tests run: 2, Failures: 0, Errors: 0, Skipped: 0, Time elapsed: 3.011 sec

Results :

Tests in error: 
  testLocalHBaseCluster(org.apache.hadoop.hbase.TestLocalHBaseCluster): Master not initialized
after 200 seconds
  org.apache.hadoop.hbase.mapreduce.TestImportExport: Failed to Start org.apache.hadoop.mapred.MiniMRCluster

Tests run: 665, Failures: 0, Errors: 2, Skipped: 2

[INFO] ------------------------------------------------------------------------
[INFO] BUILD FAILURE
[INFO] ------------------------------------------------------------------------
[INFO] Total time: 22:29.985s
[INFO] Finished at: Sun Aug 05 00:51:00 UTC 2012
[INFO] Final Memory: 50M/477M
[INFO] ------------------------------------------------------------------------
[ERROR] Failed to execute goal org.apache.maven.plugins:maven-surefire-plugin:2.12-TRUNK-HBASE-2:test
(secondPartTestsExecution) on project hbase: There are test failures.
[ERROR] 
[ERROR] Please refer to <https://builds.apache.org/job/HBase-0.94-security-on-Hadoop-23/ws/trunk/target/surefire-reports>
for the individual test results.
[ERROR] -> [Help 1]
org.apache.maven.lifecycle.LifecycleExecutionException: Failed to execute goal org.apache.maven.plugins:maven-surefire-plugin:2.12-TRUNK-HBASE-2:test
(secondPartTestsExecution) on project hbase: There are test failures.

Please refer to <https://builds.apache.org/job/HBase-0.94-security-on-Hadoop-23/ws/trunk/target/surefire-reports>
for the individual test results.
	at org.apache.maven.lifecycle.internal.MojoExecutor.execute(MojoExecutor.java:213)
	at org.apache.maven.lifecycle.internal.MojoExecutor.execute(MojoExecutor.java:153)
	at org.apache.maven.lifecycle.internal.MojoExecutor.execute(MojoExecutor.java:145)
	at org.apache.maven.lifecycle.internal.MojoExecutor.executeForkedExecutions(MojoExecutor.java:365)
	at org.apache.maven.lifecycle.internal.MojoExecutor.execute(MojoExecutor.java:199)
	at org.apache.maven.lifecycle.internal.MojoExecutor.execute(MojoExecutor.java:153)
	at org.apache.maven.lifecycle.internal.MojoExecutor.execute(MojoExecutor.java:145)
	at org.apache.maven.lifecycle.internal.LifecycleModuleBuilder.buildProject(LifecycleModuleBuilder.java:84)
	at org.apache.maven.lifecycle.internal.LifecycleModuleBuilder.buildProject(LifecycleModuleBuilder.java:59)
	at org.apache.maven.lifecycle.internal.LifecycleStarter.singleThreadedBuild(LifecycleStarter.java:183)
	at org.apache.maven.lifecycle.internal.LifecycleStarter.execute(LifecycleStarter.java:161)
	at org.apache.maven.DefaultMaven.doExecute(DefaultMaven.java:319)
	at org.apache.maven.DefaultMaven.execute(DefaultMaven.java:156)
	at org.apache.maven.cli.MavenCli.execute(MavenCli.java:537)
	at org.apache.maven.cli.MavenCli.doMain(MavenCli.java:196)
	at org.apache.maven.cli.MavenCli.main(MavenCli.java:141)
	at sun.reflect.NativeMethodAccessorImpl.invoke0(Native Method)
	at sun.reflect.NativeMethodAccessorImpl.invoke(NativeMethodAccessorImpl.java:39)
	at sun.reflect.DelegatingMethodAccessorImpl.invoke(DelegatingMethodAccessorImpl.java:25)
	at java.lang.reflect.Method.invoke(Method.java:597)
	at org.codehaus.plexus.classworlds.launcher.Launcher.launchEnhanced(Launcher.java:290)
	at org.codehaus.plexus.classworlds.launcher.Launcher.launch(Launcher.java:230)
	at org.codehaus.plexus.classworlds.launcher.Launcher.mainWithExitCode(Launcher.java:409)
	at org.codehaus.plexus.classworlds.launcher.Launcher.main(Launcher.java:352)
Caused by: org.apache.maven.plugin.MojoFailureException: There are test failures.

Please refer to <https://builds.apache.org/job/HBase-0.94-security-on-Hadoop-23/ws/trunk/target/surefire-reports>
for the individual test results.
	at org.apache.maven.plugin.surefire.SurefireHelper.reportExecution(SurefireHelper.java:87)
	at org.apache.maven.plugin.surefire.SurefirePlugin.writeSummary(SurefirePlugin.java:651)
	at org.apache.maven.plugin.surefire.SurefirePlugin.handleSummary(SurefirePlugin.java:625)
	at org.apache.maven.plugin.surefire.AbstractSurefireMojo.executeAfterPreconditionsChecked(AbstractSurefireMojo.java:137)
	at org.apache.maven.plugin.surefire.AbstractSurefireMojo.execute(AbstractSurefireMojo.java:98)
	at org.apache.maven.plugin.DefaultBuildPluginManager.executeMojo(DefaultBuildPluginManager.java:101)
	at org.apache.maven.lifecycle.internal.MojoExecutor.execute(MojoExecutor.java:209)
	... 23 more
[ERROR] 
[ERROR] 
[ERROR] For more information about the errors and possible solutions, please read the following
articles:
[ERROR] [Help 1] http://cwiki.apache.org/confluence/display/MAVEN/MojoFailureException
Build step 'Invoke top-level Maven targets' marked build as failure
Archiving artifacts
Updating HBASE-6284
Updating HBASE-6319
Updating HBASE-6377
Updating HBASE-6283
Updating HBASE-6313
Updating HBASE-4470
Updating HBASE-6334
Updating HBASE-6311
Updating HBASE-6359
Updating HBASE-6332
Updating HBASE-6357
Updating HBASE-4379
Updating HBASE-6440
Updating HBASE-6337
Updating HBASE-6355
Updating HBASE-6426
Updating HBASE-6445
Updating HBASE-6427
Updating HBASE-6406
Updating HBASE-6330
Updating HBASE-6420
Updating HBASE-6447
Updating HBASE-6397
Updating HBASE-6394
Updating HBASE-6375
Updating HBASE-6392
Updating HBASE-6450
Updating HBASE-5909
Updating HBASE-6329
Updating HBASE-5985
Updating HBASE-6389
Updating HBASE-6253
Updating HBASE-5966
Updating HBASE-6369
Updating HBASE-6325
Updating HBASE-2214
Updating HBASE-2730
Updating HBASE-5533
Updating HBASE-6363
Updating HBASE-6433
Updating HBASE-4956
Updating HBASE-6341
Updating HBASE-5659
Updating HBASE-6380
Updating HBASE-6293
Updating HBASE-6382
Updating HBASE-6384
Updating HBASE-6460
Recording test results

Mime
View raw message