hbase-dev mailing list archives

Site index · List index
Message view « Date » · « Thread »
Top « Date » · « Thread »
From Apache Jenkins Server <jenk...@builds.apache.org>
Subject Build failed in Jenkins: HBase-0.94 #385
Date Tue, 07 Aug 2012 22:19:51 GMT
See <https://builds.apache.org/job/HBase-0.94/385/changes>

Changes:

[larsh] HBASE-6523 HConnectionImplementation still does not recover from all ZK issues.

------------------------------------------
[...truncated 594 lines...]
Running org.apache.hadoop.hbase.regionserver.TestSplitTransactionOnCluster
Tests run: 7, Failures: 0, Errors: 0, Skipped: 0, Time elapsed: 56.856 sec
Running org.apache.hadoop.hbase.regionserver.TestEndToEndSplitTransaction
Running org.apache.hadoop.hbase.regionserver.TestRegionServerMetrics
Tests run: 3, Failures: 0, Errors: 0, Skipped: 0, Time elapsed: 60.729 sec
Tests run: 2, Failures: 0, Errors: 0, Skipped: 0, Time elapsed: 58.771 sec
Running org.apache.hadoop.hbase.regionserver.metrics.TestSchemaMetrics
Tests run: 6, Failures: 0, Errors: 0, Skipped: 0, Time elapsed: 15.555 sec
Running org.apache.hadoop.hbase.regionserver.TestBlocksRead
Tests run: 4, Failures: 0, Errors: 0, Skipped: 0, Time elapsed: 1.222 sec
Running org.apache.hadoop.hbase.regionserver.TestStoreFileBlockCacheSummary
Tests run: 1, Failures: 0, Errors: 0, Skipped: 0, Time elapsed: 17.684 sec
Running org.apache.hadoop.hbase.regionserver.wal.TestLogRollingNoCluster
Tests run: 1, Failures: 0, Errors: 0, Skipped: 0, Time elapsed: 2.398 sec
Running org.apache.hadoop.hbase.regionserver.TestFSErrorsExposed
Tests run: 3, Failures: 0, Errors: 0, Skipped: 0, Time elapsed: 28.442 sec
Running org.apache.hadoop.hbase.regionserver.TestHRegion
Tests run: 66, Failures: 0, Errors: 0, Skipped: 0, Time elapsed: 47.017 sec
Running org.apache.hadoop.hbase.regionserver.TestCompactionWithCoprocessor
Tests run: 15, Failures: 0, Errors: 0, Skipped: 0, Time elapsed: 38.169 sec
Running org.apache.hadoop.hbase.regionserver.wal.TestWALReplay
Tests run: 6, Failures: 0, Errors: 0, Skipped: 0, Time elapsed: 34.209 sec
Running org.apache.hadoop.hbase.regionserver.wal.TestWALReplayCompressed
Tests run: 6, Failures: 0, Errors: 0, Skipped: 0, Time elapsed: 32.441 sec
Running org.apache.hadoop.hbase.regionserver.wal.TestHLog
Tests run: 10, Failures: 0, Errors: 0, Skipped: 0, Time elapsed: 61.436 sec
Running org.apache.hadoop.hbase.regionserver.wal.TestHLogBench
Tests run: 1, Failures: 0, Errors: 0, Skipped: 0, Time elapsed: 1.351 sec
Running org.apache.hadoop.hbase.regionserver.handler.TestCloseRegionHandler
Tests run: 3, Failures: 0, Errors: 0, Skipped: 0, Time elapsed: 1.23 sec
Running org.apache.hadoop.hbase.regionserver.handler.TestOpenRegionHandler
Tests run: 3, Failures: 0, Errors: 0, Skipped: 0, Time elapsed: 0.951 sec
Running org.apache.hadoop.hbase.regionserver.wal.TestLogRollAbort
Tests run: 1, Failures: 0, Errors: 0, Skipped: 0, Time elapsed: 151.624 sec
Running org.apache.hadoop.hbase.filter.TestColumnRangeFilter
Tests run: 1, Failures: 0, Errors: 0, Skipped: 0, Time elapsed: 16.808 sec
Running org.apache.hadoop.hbase.regionserver.TestHRegionServerBulkLoad
Tests run: 1, Failures: 0, Errors: 0, Skipped: 0, Time elapsed: 47.844 sec
Running org.apache.hadoop.hbase.coprocessor.TestClassLoading
Tests run: 6, Failures: 0, Errors: 0, Skipped: 0, Time elapsed: 30.936 sec
Running org.apache.hadoop.hbase.coprocessor.TestAggregateProtocol
Tests run: 45, Failures: 0, Errors: 0, Skipped: 0, Time elapsed: 16.692 sec
Running org.apache.hadoop.hbase.coprocessor.TestRegionServerCoprocessorExceptionWithRemove
Tests run: 1, Failures: 0, Errors: 0, Skipped: 0, Time elapsed: 16.426 sec
Running org.apache.hadoop.hbase.coprocessor.TestRegionServerCoprocessorExceptionWithAbort
Tests run: 1, Failures: 0, Errors: 0, Skipped: 0, Time elapsed: 15.208 sec
Running org.apache.hadoop.hbase.coprocessor.TestMasterObserver
Tests run: 3, Failures: 0, Errors: 0, Skipped: 0, Time elapsed: 25.754 sec
Running org.apache.hadoop.hbase.coprocessor.TestCoprocessorEndpoint
Tests run: 3, Failures: 0, Errors: 0, Skipped: 1, Time elapsed: 28.215 sec
Running org.apache.hadoop.hbase.coprocessor.TestWALObserver
Tests run: 3, Failures: 0, Errors: 0, Skipped: 0, Time elapsed: 15.111 sec
Running org.apache.hadoop.hbase.coprocessor.TestMasterCoprocessorExceptionWithAbort
Tests run: 1, Failures: 0, Errors: 0, Skipped: 0, Time elapsed: 11.852 sec
Running org.apache.hadoop.hbase.coprocessor.TestMasterCoprocessorExceptionWithRemove
Tests run: 1, Failures: 0, Errors: 0, Skipped: 0, Time elapsed: 16.106 sec
Running org.apache.hadoop.hbase.coprocessor.TestRegionObserverInterface
Tests run: 7, Failures: 0, Errors: 0, Skipped: 0, Time elapsed: 36.601 sec
Running org.apache.hadoop.hbase.coprocessor.TestRegionObserverBypass
Tests run: 2, Failures: 0, Errors: 0, Skipped: 0, Time elapsed: 12.855 sec
Running org.apache.hadoop.hbase.regionserver.wal.TestHLogSplit
Tests run: 30, Failures: 0, Errors: 0, Skipped: 1, Time elapsed: 250.935 sec
Running org.apache.hadoop.hbase.mapred.TestTableInputFormat
Tests run: 10, Failures: 0, Errors: 0, Skipped: 0, Time elapsed: 29.625 sec
Running org.apache.hadoop.hbase.TestGlobalMemStoreSize
Tests run: 1, Failures: 0, Errors: 0, Skipped: 0, Time elapsed: 15.403 sec
Running org.apache.hadoop.hbase.mapreduce.TestHLogRecordReader
Tests run: 2, Failures: 0, Errors: 0, Skipped: 0, Time elapsed: 4.222 sec
Running org.apache.hadoop.hbase.mapred.TestTableMapReduce
Tests run: 1, Failures: 0, Errors: 0, Skipped: 0, Time elapsed: 92.112 sec
Running org.apache.hadoop.hbase.regionserver.wal.TestLogRolling
Tests run: 3, Failures: 0, Errors: 0, Skipped: 0, Time elapsed: 293.032 sec
Running org.apache.hadoop.hbase.mapreduce.TestTableMapReduce
Tests run: 1, Failures: 0, Errors: 0, Skipped: 0, Time elapsed: 112.741 sec
Running org.apache.hadoop.hbase.mapreduce.TestLoadIncrementalHFilesSplitRecovery
Tests run: 4, Failures: 0, Errors: 0, Skipped: 0, Time elapsed: 100.978 sec
Running org.apache.hadoop.hbase.mapreduce.TestWALPlayer
Tests run: 1, Failures: 0, Errors: 0, Skipped: 0, Time elapsed: 45.562 sec
Running org.apache.hadoop.hbase.mapreduce.TestMultithreadedTableMapper
Tests run: 1, Failures: 0, Errors: 0, Skipped: 0, Time elapsed: 140.193 sec
Running org.apache.hadoop.hbase.mapreduce.TestImportTsv
Tests run: 9, Failures: 0, Errors: 0, Skipped: 0, Time elapsed: 170.029 sec
Running org.apache.hadoop.hbase.mapreduce.TestTimeRangeMapRed
Tests run: 1, Failures: 0, Errors: 0, Skipped: 0, Time elapsed: 38.543 sec
Running org.apache.hadoop.hbase.mapreduce.TestLoadIncrementalHFiles
Tests run: 6, Failures: 0, Errors: 0, Skipped: 0, Time elapsed: 39.469 sec
Running org.apache.hadoop.hbase.mapreduce.TestHFileOutputFormat
Tests run: 9, Failures: 0, Errors: 0, Skipped: 0, Time elapsed: 331.391 sec
Running org.apache.hadoop.hbase.thrift2.TestThriftHBaseServiceHandler
Tests run: 12, Failures: 0, Errors: 0, Skipped: 0, Time elapsed: 14.246 sec
Running org.apache.hadoop.hbase.catalog.TestMetaReaderEditorNoCluster
Tests run: 1, Failures: 0, Errors: 0, Skipped: 0, Time elapsed: 4.165 sec
Running org.apache.hadoop.hbase.mapreduce.TestImportExport
Tests run: 2, Failures: 0, Errors: 0, Skipped: 0, Time elapsed: 110.411 sec
Running org.apache.hadoop.hbase.TestAcidGuarantees
Tests run: 3, Failures: 0, Errors: 0, Skipped: 0, Time elapsed: 100.343 sec
Running org.apache.hadoop.hbase.catalog.TestCatalogTracker
Tests run: 10, Failures: 0, Errors: 0, Skipped: 1, Time elapsed: 8.917 sec
Running org.apache.hadoop.hbase.catalog.TestMetaReaderEditor
Tests run: 5, Failures: 0, Errors: 0, Skipped: 0, Time elapsed: 26.336 sec
Running org.apache.hadoop.hbase.client.TestTimestampsFilter
Tests run: 3, Failures: 0, Errors: 0, Skipped: 0, Time elapsed: 23.394 sec
Running org.apache.hadoop.hbase.catalog.TestCatalogTrackerOnCluster
Tests run: 1, Failures: 0, Errors: 0, Skipped: 0, Time elapsed: 83.339 sec
Running org.apache.hadoop.hbase.client.TestHCM
Tests run: 6, Failures: 0, Errors: 0, Skipped: 0, Time elapsed: 18.805 sec
Running org.apache.hadoop.hbase.client.TestShell
Tests run: 1, Failures: 0, Errors: 0, Skipped: 0, Time elapsed: 91.005 sec
Running org.apache.hadoop.hbase.client.TestScannerTimeout
Tests run: 4, Failures: 0, Errors: 0, Skipped: 0, Time elapsed: 45.007 sec
Running org.apache.hadoop.hbase.client.TestMetaScanner
Tests run: 1, Failures: 0, Errors: 0, Skipped: 0, Time elapsed: 16.596 sec
Running org.apache.hadoop.hbase.client.TestHTableUtil
Tests run: 2, Failures: 0, Errors: 0, Skipped: 0, Time elapsed: 20.635 sec
Running org.apache.hadoop.hbase.client.TestMetaMigrationRemovingHTD
Tests run: 3, Failures: 0, Errors: 0, Skipped: 0, Time elapsed: 23.58 sec
Running org.apache.hadoop.hbase.client.TestFromClientSide
Tests run: 55, Failures: 0, Errors: 0, Skipped: 3, Time elapsed: 173.809 sec
Running org.apache.hadoop.hbase.client.TestHTablePool$TestHTableReusablePool
Tests run: 9, Failures: 0, Errors: 0, Skipped: 0, Time elapsed: 6.144 sec
Running org.apache.hadoop.hbase.client.TestHTablePool$TestHTableThreadLocalPool
Tests run: 9, Failures: 0, Errors: 0, Skipped: 0, Time elapsed: 24.066 sec
Running org.apache.hadoop.hbase.client.replication.TestReplicationAdmin
Tests run: 1, Failures: 0, Errors: 0, Skipped: 0, Time elapsed: 0.916 sec
Running org.apache.hadoop.hbase.client.TestMultipleTimestamps
Tests run: 8, Failures: 0, Errors: 0, Skipped: 0, Time elapsed: 31.99 sec
Running org.apache.hadoop.hbase.client.TestMultiParallel
Tests run: 11, Failures: 0, Errors: 0, Skipped: 0, Time elapsed: 39.732 sec
Running org.apache.hadoop.hbase.metrics.TestMetricsMBeanBase
Tests run: 2, Failures: 0, Errors: 0, Skipped: 0, Time elapsed: 1.123 sec
Running org.apache.hadoop.hbase.client.TestFromClientSideWithCoprocessor
Tests run: 55, Failures: 0, Errors: 0, Skipped: 3, Time elapsed: 167.63 sec
Running org.apache.hadoop.hbase.rest.TestGzipFilter
Tests run: 3, Failures: 0, Errors: 0, Skipped: 0, Time elapsed: 14.432 sec
Running org.apache.hadoop.hbase.constraint.TestConstraint
Tests run: 5, Failures: 0, Errors: 0, Skipped: 0, Time elapsed: 27.132 sec
Running org.apache.hadoop.hbase.mapreduce.TestTableInputFormatScan
Tests run: 12, Failures: 0, Errors: 0, Skipped: 0, Time elapsed: 602.496 sec
Running org.apache.hadoop.hbase.rest.TestMultiRowResource
Tests run: 3, Failures: 0, Errors: 0, Skipped: 0, Time elapsed: 15.54 sec
Running org.apache.hadoop.hbase.rest.TestRowResource
Tests run: 11, Failures: 0, Errors: 0, Skipped: 0, Time elapsed: 16.242 sec
Running org.apache.hadoop.hbase.rest.TestScannersWithFilters
Tests run: 10, Failures: 0, Errors: 0, Skipped: 0, Time elapsed: 18.379 sec
Running org.apache.hadoop.hbase.rest.client.TestRemoteAdmin
Tests run: 1, Failures: 0, Errors: 0, Skipped: 0, Time elapsed: 15.939 sec
Running org.apache.hadoop.hbase.rest.TestVersionResource
Tests run: 7, Failures: 0, Errors: 0, Skipped: 0, Time elapsed: 12.804 sec
Running org.apache.hadoop.hbase.rest.client.TestRemoteTable
Tests run: 3, Failures: 0, Errors: 0, Skipped: 0, Time elapsed: 15.78 sec
Running org.apache.hadoop.hbase.rest.TestStatusResource
Tests run: 2, Failures: 0, Errors: 0, Skipped: 0, Time elapsed: 12.094 sec
Running org.apache.hadoop.hbase.rest.TestTableResource
Tests run: 8, Failures: 0, Errors: 0, Skipped: 0, Time elapsed: 23.033 sec
Running org.apache.hadoop.hbase.rest.TestScannerResource
Tests run: 5, Failures: 0, Errors: 0, Skipped: 0, Time elapsed: 31.24 sec
Running org.apache.hadoop.hbase.rest.TestSchemaResource
Tests run: 2, Failures: 0, Errors: 0, Skipped: 0, Time elapsed: 19.553 sec
Running org.apache.hadoop.hbase.io.encoding.TestLoadAndSwitchEncodeOnDisk
Tests run: 1, Failures: 0, Errors: 0, Skipped: 0, Time elapsed: 26.726 sec
Running org.apache.hadoop.hbase.thrift.TestThriftServer
Tests run: 1, Failures: 0, Errors: 0, Skipped: 0, Time elapsed: 38.256 sec
Running org.apache.hadoop.hbase.client.TestAdmin
Tests run: 38, Failures: 0, Errors: 0, Skipped: 0, Time elapsed: 179.954 sec
Running org.apache.hadoop.hbase.io.encoding.TestUpgradeFromHFileV1ToEncoding
Tests run: 1, Failures: 0, Errors: 0, Skipped: 0, Time elapsed: 85.785 sec
Running org.apache.hadoop.hbase.io.hfile.TestHFileSeek
Tests run: 1, Failures: 0, Errors: 0, Skipped: 0, Time elapsed: 8.571 sec
Running org.apache.hadoop.hbase.io.encoding.TestDataBlockEncoders
Tests run: 12, Failures: 0, Errors: 0, Skipped: 0, Time elapsed: 139.871 sec
Running org.apache.hadoop.hbase.io.hfile.slab.TestSlabCache
Tests run: 7, Failures: 0, Errors: 0, Skipped: 0, Time elapsed: 18.498 sec
Running org.apache.hadoop.hbase.io.hfile.TestChecksum
Tests run: 3, Failures: 0, Errors: 0, Skipped: 0, Time elapsed: 1.853 sec
Running org.apache.hadoop.hbase.io.hfile.TestHFileBlockIndex
Tests run: 10, Failures: 0, Errors: 0, Skipped: 0, Time elapsed: 10.656 sec
Running org.apache.hadoop.hbase.io.hfile.TestLruBlockCache
Tests run: 16, Failures: 0, Errors: 0, Skipped: 0, Time elapsed: 0.787 sec
Running org.apache.hadoop.hbase.io.hfile.slab.TestSingleSizeCache
Tests run: 5, Failures: 0, Errors: 0, Skipped: 0, Time elapsed: 27.633 sec
Running org.apache.hadoop.hbase.io.hfile.TestHFilePerformance
Tests run: 1, Failures: 0, Errors: 0, Skipped: 0, Time elapsed: 7.009 sec
Running org.apache.hadoop.hbase.io.hfile.TestFixedFileTrailer
Tests run: 2, Failures: 0, Errors: 0, Skipped: 0, Time elapsed: 0.727 sec
Running org.apache.hadoop.hbase.io.hfile.TestHFileBlockCompatibility
Tests run: 10, Failures: 0, Errors: 0, Skipped: 0, Time elapsed: 1.293 sec
Running org.apache.hadoop.hbase.io.hfile.TestHFileBlock
Tests run: 16, Failures: 0, Errors: 0, Skipped: 0, Time elapsed: 48.832 sec
Running org.apache.hadoop.hbase.io.hfile.TestForceCacheImportantBlocks
Tests run: 4, Failures: 0, Errors: 0, Skipped: 0, Time elapsed: 66.456 sec
Running org.apache.hadoop.hbase.io.encoding.TestChangingEncoding
Tests run: 4, Failures: 0, Errors: 0, Skipped: 0, Time elapsed: 257.009 sec
Running org.apache.hadoop.hbase.io.hfile.TestCacheOnWrite
Tests run: 36, Failures: 0, Errors: 0, Skipped: 0, Time elapsed: 38.071 sec
Running org.apache.hadoop.hbase.TestClusterBootOrder
Tests run: 2, Failures: 0, Errors: 0, Skipped: 0, Time elapsed: 28.971 sec
Running org.apache.hadoop.hbase.replication.regionserver.TestReplicationSourceManager
Tests run: 1, Failures: 0, Errors: 0, Skipped: 0, Time elapsed: 1.24 sec
Running org.apache.hadoop.hbase.replication.regionserver.TestReplicationSink
Tests run: 5, Failures: 0, Errors: 0, Skipped: 0, Time elapsed: 14.284 sec
Running org.apache.hadoop.hbase.avro.TestAvroServer
Tests run: 3, Failures: 0, Errors: 0, Skipped: 0, Time elapsed: 29.178 sec
Running org.apache.hadoop.hbase.replication.TestReplicationSource
Tests run: 1, Failures: 0, Errors: 0, Skipped: 0, Time elapsed: 2.683 sec
Running org.apache.hadoop.hbase.replication.TestReplicationZookeeper
Tests run: 1, Failures: 0, Errors: 0, Skipped: 0, Time elapsed: 0.661 sec
Running org.apache.hadoop.hbase.replication.TestMultiSlaveReplication
Tests run: 1, Failures: 0, Errors: 0, Skipped: 0, Time elapsed: 40.197 sec
Running org.apache.hadoop.hbase.ipc.TestDelayedRpc
Tests run: 4, Failures: 0, Errors: 0, Skipped: 0, Time elapsed: 2.732 sec
Running org.apache.hadoop.hbase.replication.TestMasterReplication
Tests run: 2, Failures: 0, Errors: 0, Skipped: 0, Time elapsed: 63.077 sec
Running org.apache.hadoop.hbase.thrift.TestThriftServerCmdLine
Tests run: 20, Failures: 0, Errors: 0, Skipped: 0, Time elapsed: 388.677 sec
Running org.apache.hadoop.hbase.TestZooKeeper
Tests run: 7, Failures: 0, Errors: 0, Skipped: 0, Time elapsed: 52.462 sec
Running org.apache.hadoop.hbase.TestHBaseTestingUtility
Tests run: 7, Failures: 0, Errors: 0, Skipped: 0, Time elapsed: 61.802 sec
Running org.apache.hadoop.hbase.replication.TestReplication
Tests run: 10, Failures: 0, Errors: 0, Skipped: 0, Time elapsed: 146.338 sec

Results :

Tests in error: 
  testMergeTool(org.apache.hadoop.hbase.util.TestMergeTool)

Tests run: 1024, Failures: 0, Errors: 1, Skipped: 12

[INFO] ------------------------------------------------------------------------
[INFO] BUILD FAILURE
[INFO] ------------------------------------------------------------------------
[INFO] Total time: 39:57.561s
[INFO] Finished at: Tue Aug 07 22:19:13 UTC 2012
[INFO] Final Memory: 40M/435M
[INFO] ------------------------------------------------------------------------
[ERROR] Failed to execute goal org.apache.maven.plugins:maven-surefire-plugin:2.12-TRUNK-HBASE-2:test
(secondPartTestsExecution) on project hbase: There are test failures.
[ERROR] 
[ERROR] Please refer to <https://builds.apache.org/job/HBase-0.94/ws/trunk/target/surefire-reports>
for the individual test results.
[ERROR] -> [Help 1]
[ERROR] 
[ERROR] To see the full stack trace of the errors, re-run Maven with the -e switch.
[ERROR] Re-run Maven using the -X switch to enable full debug logging.
[ERROR] 
[ERROR] For more information about the errors and possible solutions, please read the following
articles:
[ERROR] [Help 1] http://cwiki.apache.org/confluence/display/MAVEN/MojoFailureException
Build step 'Invoke top-level Maven targets' marked build as failure
Archiving artifacts
Updating HBASE-6523
Recording test results

Mime
View raw message