hbase-dev mailing list archives

Site index · List index
Message view « Date » · « Thread »
Top « Date » · « Thread »
From Apache Jenkins Server <jenk...@builds.apache.org>
Subject Build failed in Jenkins: HBase-TRUNK #3272
Date Fri, 24 Aug 2012 23:00:28 GMT
See <https://builds.apache.org/job/HBase-TRUNK/3272/changes>

Changes:

[stack] HBASE-5449 Support for wire-compatible security functionality; REVERT OVERCOMMIT

[stack] HBASE-5449 Support for wire-compatible security functionality

[stack] HBASE-6641 more message with DoNotRetryIOException in client

------------------------------------------
[...truncated 2018 lines...]
Tests run: 6, Failures: 0, Errors: 0, Skipped: 0, Time elapsed: 0.001 sec
Running org.apache.hadoop.hbase.replication.regionserver.metrics.ReplicationMetricsSourceImplTest
Tests run: 1, Failures: 0, Errors: 0, Skipped: 0, Time elapsed: 0.005 sec
Running org.apache.hadoop.hbase.master.metrics.MasterMetricsSourceImplTest
Tests run: 1, Failures: 0, Errors: 0, Skipped: 0, Time elapsed: 0.265 sec

Results :

Tests run: 8, Failures: 0, Errors: 0, Skipped: 0

[INFO] 
[INFO] --- maven-surefire-plugin:2.12-TRUNK-HBASE-2:test (secondPartTestsExecution) @ hbase-hadoop1-compat
---
[INFO] Tests are skipped.
[INFO] 
[INFO] --- maven-jar-plugin:2.3:test-jar (default) @ hbase-hadoop1-compat ---
[INFO] Building jar: <https://builds.apache.org/job/HBase-TRUNK/ws/trunk/hbase-hadoop1-compat/target/hbase-hadoop1-compat-0.95-SNAPSHOT-tests.jar>
[INFO] 
[INFO] --- maven-jar-plugin:2.3:jar (default-jar) @ hbase-hadoop1-compat ---
[INFO] Building jar: <https://builds.apache.org/job/HBase-TRUNK/ws/trunk/hbase-hadoop1-compat/target/hbase-hadoop1-compat-0.95-SNAPSHOT.jar>
[INFO] 
[INFO] --- apache-rat-plugin:0.8:check (default) @ hbase-hadoop1-compat ---
[INFO] Exclude: **/*.log
[INFO] Exclude: **/.*
[INFO] Exclude: **/*.tgz
[INFO] Exclude: **/*.orig
[INFO] Exclude: **/test/**
[INFO] Exclude: **/8e8ab58dcf39412da19833fcd8f687ac
[INFO] Exclude: **/.git/**
[INFO] Exclude: **/.idea/**
[INFO] Exclude: **/target/**
[INFO] Exclude: **/CHANGES.txt
[INFO] Exclude: **/generated/**
[INFO] Exclude: **/conf/*
[INFO] Exclude: **/*.avpr
[INFO] Exclude: **/*.svg
[INFO] Exclude: **/META-INF/services/**
[INFO] Exclude: **/html5shiv.js
[INFO] Exclude: **/jquery.min.js
[INFO] Exclude: **/*.vm
[INFO] Exclude: **/control
[INFO] Exclude: **/conffile
[INFO] Exclude: docs/*
[INFO] Exclude: **/src/site/resources/css/freebsd_docbook.css
[INFO]                                                                         
[INFO] ------------------------------------------------------------------------
[INFO] Building HBase - Server 0.95-SNAPSHOT
[INFO] ------------------------------------------------------------------------
Downloading: http://download.java.net/maven/2/org/hbase/asynchbase/maven-metadata.xml
Downloading: http://people.apache.org/~stack/m2/repository/org/hbase/asynchbase/maven-metadata.xml
Downloading: http://repository-netty.forge.cloudbees.com/snapshot/org/hbase/asynchbase/maven-metadata.xml
Downloading: https://repository.apache.org/content/repositories/releases/org/hbase/asynchbase/maven-metadata.xml

Downloading: http://repository.codehaus.org/org/hbase/asynchbase/maven-metadata.xml

Downloading: http://repository.jboss.org/nexus/content/groups/public-jboss/org/hbase/asynchbase/maven-metadata.xml

Downloading: http://people.apache.org/~garyh/mvn/org/hbase/asynchbase/maven-metadata.xml

Downloading: http://repository.apache.org/snapshots/org/hbase/asynchbase/maven-metadata.xml

Downloading: http://repo1.maven.org/maven2/org/hbase/asynchbase/maven-metadata.xml

450 B   
        
        
Downloaded: http://repo1.maven.org/maven2/org/hbase/asynchbase/maven-metadata.xml (450 B at
1.5 KB/sec)
        
Downloading: http://repository-netty.forge.cloudbees.com/snapshot/com/stumbleupon/async/maven-metadata.xml
Downloading: https://repository.apache.org/content/repositories/releases/com/stumbleupon/async/maven-metadata.xml
Downloading: http://people.apache.org/~stack/m2/repository/com/stumbleupon/async/maven-metadata.xml
Downloading: http://download.java.net/maven/2/com/stumbleupon/async/maven-metadata.xml
        
        
Downloading: http://repository.codehaus.org/com/stumbleupon/async/maven-metadata.xml
Downloading: http://repository.jboss.org/nexus/content/groups/public-jboss/com/stumbleupon/async/maven-metadata.xml
        
Downloading: http://people.apache.org/~garyh/mvn/com/stumbleupon/async/maven-metadata.xml
        
Downloading: http://repository.apache.org/snapshots/com/stumbleupon/async/maven-metadata.xml
        
Downloading: http://repo1.maven.org/maven2/com/stumbleupon/async/maven-metadata.xml
358 B   
        
Downloaded: http://repo1.maven.org/maven2/com/stumbleupon/async/maven-metadata.xml (358 B
at 43.7 KB/sec)
Downloading: https://oss.sonatype.org/content/repositories/snapshots/com/stumbleupon/async/maven-metadata.xml
        
        
361 B   
        
Downloaded: https://oss.sonatype.org/content/repositories/snapshots/com/stumbleupon/async/maven-metadata.xml
(361 B at 0.5 KB/sec)
        
[INFO] 
[INFO] --- maven-antrun-plugin:1.6:run (generate) @ hbase-server ---
[INFO] Executing tasks

main:
    [mkdir] Created dir: <https://builds.apache.org/job/HBase-TRUNK/ws/trunk/hbase-server/target/hbase-webapps>
     [copy] Copying 14 files to <https://builds.apache.org/job/HBase-TRUNK/ws/trunk/hbase-server/target/hbase-webapps>
12/08/24 23:00:09 INFO mortbay.log: Logging to org.slf4j.impl.Log4jLoggerAdapter(org.mortbay.log)
via org.mortbay.log.Slf4jLog
    [mkdir] Created dir: <https://builds.apache.org/job/HBase-TRUNK/ws/trunk/hbase-server/target/hbase-webapps/master/WEB-INF>
    [mkdir] Created dir: <https://builds.apache.org/job/HBase-TRUNK/ws/trunk/hbase-server/target/hbase-webapps/regionserver/WEB-INF>
[INFO] Executed tasks
[INFO] 
[INFO] --- build-helper-maven-plugin:1.5:add-source (jspcSource-packageInfo-Avro-source) @
hbase-server ---
[INFO] Source directory: <https://builds.apache.org/job/HBase-TRUNK/ws/trunk/hbase-server/target/generated-jamon>
added.
[INFO] Source directory: <https://builds.apache.org/job/HBase-TRUNK/ws/trunk/hbase-server/target/generated-sources/java>
added.
[INFO] 
[INFO] --- jamon-maven-plugin:2.3.4:translate (default) @ hbase-server ---
[INFO] Translating 7 templates from <https://builds.apache.org/job/HBase-TRUNK/ws/trunk/hbase-server/src/main/jamon>
to <https://builds.apache.org/job/HBase-TRUNK/ws/trunk/hbase-server/target/generated-jamon>
[INFO] 
[INFO] --- maven-remote-resources-plugin:1.1:process (default) @ hbase-server ---
[INFO] 
[INFO] --- maven-resources-plugin:2.5:resources (default-resources) @ hbase-server ---
[debug] execute contextualize
[INFO] Using 'UTF-8' encoding to copy filtered resources.
[INFO] Copying 16 resources
[INFO] Copying 1 resource
[INFO] Copying 3 resources
[INFO] 
[INFO] --- maven-compiler-plugin:2.0.2:compile (default-compile) @ hbase-server ---
[INFO] Compiling 762 source files to <https://builds.apache.org/job/HBase-TRUNK/ws/trunk/hbase-server/target/classes>
[INFO]                                                                         
[INFO] ------------------------------------------------------------------------
[INFO] Skipping HBase
[INFO] This project has been banned from the build due to previous failures.
[INFO] ------------------------------------------------------------------------
[INFO]                                                                         
[INFO] ------------------------------------------------------------------------
[INFO] Skipping HBase
[INFO] This project has been banned from the build due to previous failures.
[INFO] ------------------------------------------------------------------------
[INFO] ------------------------------------------------------------------------
[INFO] Reactor Summary:
[INFO] 
[INFO] HBase ............................................. SUCCESS [6.649s]
[INFO] HBase - Common .................................... SUCCESS [6.170s]
[INFO] HBase - Hadoop Compatibility ...................... SUCCESS [1.400s]
[INFO] HBase - Hadoop One Compatibility .................. SUCCESS [1.872s]
[INFO] HBase - Server .................................... FAILURE [22.248s]
[INFO] HBase - Hadoop Two Compatibility .................. SKIPPED
[INFO] HBase - Integration Tests ......................... SKIPPED
[INFO] ------------------------------------------------------------------------
[INFO] BUILD FAILURE
[INFO] ------------------------------------------------------------------------
[INFO] Total time: 39.085s
[INFO] Finished at: Fri Aug 24 23:00:25 UTC 2012
[INFO] Final Memory: 51M/385M
[INFO] ------------------------------------------------------------------------
[ERROR] Failed to execute goal org.apache.maven.plugins:maven-compiler-plugin:2.0.2:compile
(default-compile) on project hbase-server: Compilation failure: Compilation failure:
[ERROR] <https://builds.apache.org/job/HBase-TRUNK/ws/trunk/hbase-server/src/main/java/org/apache/hadoop/hbase/security/access/AccessControlLists.java>:[50,49]
cannot find symbol
[ERROR] symbol  : class AccessControlProtos
[ERROR] location: package org.apache.hadoop.hbase.protobuf.generated
[ERROR] 
[ERROR] <https://builds.apache.org/job/HBase-TRUNK/ws/trunk/hbase-server/src/main/java/org/apache/hadoop/hbase/protobuf/ProtobufUtil.java>:[111,49]
cannot find symbol
[ERROR] symbol  : class AccessControlProtos
[ERROR] location: package org.apache.hadoop.hbase.protobuf.generated
[ERROR] 
[ERROR] <https://builds.apache.org/job/HBase-TRUNK/ws/trunk/hbase-server/src/main/java/org/apache/hadoop/hbase/protobuf/ProtobufUtil.java>:[1500,59]
package AccessControlProtos does not exist
[ERROR] 
[ERROR] <https://builds.apache.org/job/HBase-TRUNK/ws/trunk/hbase-server/src/main/java/org/apache/hadoop/hbase/protobuf/ProtobufUtil.java>:[1515,69]
package AccessControlProtos does not exist
[ERROR] 
[ERROR] <https://builds.apache.org/job/HBase-TRUNK/ws/trunk/hbase-server/src/main/java/org/apache/hadoop/hbase/protobuf/ProtobufUtil.java>:[1536,35]
package AccessControlProtos does not exist
[ERROR] 
[ERROR] <https://builds.apache.org/job/HBase-TRUNK/ws/trunk/hbase-server/src/main/java/org/apache/hadoop/hbase/protobuf/ProtobufUtil.java>:[1563,41]
package AccessControlProtos.Permission does not exist
[ERROR] 
[ERROR] <https://builds.apache.org/job/HBase-TRUNK/ws/trunk/hbase-server/src/main/java/org/apache/hadoop/hbase/protobuf/ProtobufUtil.java>:[1578,36]
package AccessControlProtos.Permission does not exist
[ERROR] 
[ERROR] <https://builds.apache.org/job/HBase-TRUNK/ws/trunk/hbase-server/src/main/java/org/apache/hadoop/hbase/protobuf/ProtobufUtil.java>:[1600,46]
package AccessControlProtos.Permission does not exist
[ERROR] 
[ERROR] <https://builds.apache.org/job/HBase-TRUNK/ws/trunk/hbase-server/src/main/java/org/apache/hadoop/hbase/protobuf/ProtobufUtil.java>:[1623,35]
package AccessControlProtos does not exist
[ERROR] 
[ERROR] <https://builds.apache.org/job/HBase-TRUNK/ws/trunk/hbase-server/src/main/java/org/apache/hadoop/hbase/protobuf/ProtobufUtil.java>:[1651,67]
package AccessControlProtos does not exist
[ERROR] 
[ERROR] <https://builds.apache.org/job/HBase-TRUNK/ws/trunk/hbase-server/src/main/java/org/apache/hadoop/hbase/protobuf/ProtobufUtil.java>:[1675,35]
package AccessControlProtos does not exist
[ERROR] 
[ERROR] <https://builds.apache.org/job/HBase-TRUNK/ws/trunk/hbase-server/src/main/java/org/apache/hadoop/hbase/protobuf/ProtobufUtil.java>:[1699,25]
package AccessControlProtos does not exist
[ERROR] 
[ERROR] <https://builds.apache.org/job/HBase-TRUNK/ws/trunk/hbase-server/src/main/java/org/apache/hadoop/hbase/security/access/AccessControlLists.java>:[526,27]
package AccessControlProtos does not exist
[ERROR] 
[ERROR] <https://builds.apache.org/job/HBase-TRUNK/ws/trunk/hbase-server/src/main/java/org/apache/hadoop/hbase/security/access/AccessControlLists.java>:[527,29]
package AccessControlProtos does not exist
[ERROR] 
[ERROR] <https://builds.apache.org/job/HBase-TRUNK/ws/trunk/hbase-server/src/main/java/org/apache/hadoop/hbase/protobuf/ProtobufUtil.java>:[1537,34]
package AccessControlProtos.Permission does not exist
[ERROR] 
[ERROR] <https://builds.apache.org/job/HBase-TRUNK/ws/trunk/hbase-server/src/main/java/org/apache/hadoop/hbase/protobuf/ProtobufUtil.java>:[1537,72]
package AccessControlProtos does not exist
[ERROR] 
[ERROR] <https://builds.apache.org/job/HBase-TRUNK/ws/trunk/hbase-server/src/main/java/org/apache/hadoop/hbase/protobuf/ProtobufUtil.java>:[1565,39]
package AccessControlProtos.Permission does not exist
[ERROR] 
[ERROR] <https://builds.apache.org/job/HBase-TRUNK/ws/trunk/hbase-server/src/main/java/org/apache/hadoop/hbase/protobuf/ProtobufUtil.java>:[1580,11]
cannot find symbol
[ERROR] symbol  : variable READ
[ERROR] location: class org.apache.hadoop.hbase.protobuf.ProtobufUtil
[ERROR] 
[ERROR] <https://builds.apache.org/job/HBase-TRUNK/ws/trunk/hbase-server/src/main/java/org/apache/hadoop/hbase/protobuf/ProtobufUtil.java>:[1582,11]
cannot find symbol
[ERROR] symbol  : variable WRITE
[ERROR] location: class org.apache.hadoop.hbase.protobuf.ProtobufUtil
[ERROR] 
[ERROR] <https://builds.apache.org/job/HBase-TRUNK/ws/trunk/hbase-server/src/main/java/org/apache/hadoop/hbase/protobuf/ProtobufUtil.java>:[1584,11]
cannot find symbol
[ERROR] symbol  : variable EXEC
[ERROR] location: class org.apache.hadoop.hbase.protobuf.ProtobufUtil
[ERROR] 
[ERROR] <https://builds.apache.org/job/HBase-TRUNK/ws/trunk/hbase-server/src/main/java/org/apache/hadoop/hbase/protobuf/ProtobufUtil.java>:[1586,11]
cannot find symbol
[ERROR] symbol  : variable CREATE
[ERROR] location: class org.apache.hadoop.hbase.protobuf.ProtobufUtil
[ERROR] 
[ERROR] <https://builds.apache.org/job/HBase-TRUNK/ws/trunk/hbase-server/src/main/java/org/apache/hadoop/hbase/protobuf/ProtobufUtil.java>:[1588,11]
cannot find symbol
[ERROR] symbol  : variable ADMIN
[ERROR] location: class org.apache.hadoop.hbase.protobuf.ProtobufUtil
[ERROR] 
[ERROR] <https://builds.apache.org/job/HBase-TRUNK/ws/trunk/hbase-server/src/main/java/org/apache/hadoop/hbase/protobuf/ProtobufUtil.java>:[1604,45]
package AccessControlProtos.Permission does not exist
[ERROR] 
[ERROR] <https://builds.apache.org/job/HBase-TRUNK/ws/trunk/hbase-server/src/main/java/org/apache/hadoop/hbase/protobuf/ProtobufUtil.java>:[1606,45]
package AccessControlProtos.Permission does not exist
[ERROR] 
[ERROR] <https://builds.apache.org/job/HBase-TRUNK/ws/trunk/hbase-server/src/main/java/org/apache/hadoop/hbase/protobuf/ProtobufUtil.java>:[1608,45]
package AccessControlProtos.Permission does not exist
[ERROR] 
[ERROR] <https://builds.apache.org/job/HBase-TRUNK/ws/trunk/hbase-server/src/main/java/org/apache/hadoop/hbase/protobuf/ProtobufUtil.java>:[1610,45]
package AccessControlProtos.Permission does not exist
[ERROR] 
[ERROR] <https://builds.apache.org/job/HBase-TRUNK/ws/trunk/hbase-server/src/main/java/org/apache/hadoop/hbase/protobuf/ProtobufUtil.java>:[1612,45]
package AccessControlProtos.Permission does not exist
[ERROR] 
[ERROR] <https://builds.apache.org/job/HBase-TRUNK/ws/trunk/hbase-server/src/main/java/org/apache/hadoop/hbase/protobuf/ProtobufUtil.java>:[1624,34]
package AccessControlProtos.Permission does not exist
[ERROR] 
[ERROR] <https://builds.apache.org/job/HBase-TRUNK/ws/trunk/hbase-server/src/main/java/org/apache/hadoop/hbase/protobuf/ProtobufUtil.java>:[1625,27]
package AccessControlProtos does not exist
[ERROR] 
[ERROR] <https://builds.apache.org/job/HBase-TRUNK/ws/trunk/hbase-server/src/main/java/org/apache/hadoop/hbase/protobuf/ProtobufUtil.java>:[1639,30]
package AccessControlProtos does not exist
[ERROR] 
[ERROR] <https://builds.apache.org/job/HBase-TRUNK/ws/trunk/hbase-server/src/main/java/org/apache/hadoop/hbase/protobuf/ProtobufUtil.java>:[1652,23]
package AccessControlProtos does not exist
[ERROR] 
[ERROR] <https://builds.apache.org/job/HBase-TRUNK/ws/trunk/hbase-server/src/main/java/org/apache/hadoop/hbase/protobuf/ProtobufUtil.java>:[1677,44]
package AccessControlProtos.UserTablePermissions does not exist
[ERROR] 
[ERROR] <https://builds.apache.org/job/HBase-TRUNK/ws/trunk/hbase-server/src/main/java/org/apache/hadoop/hbase/protobuf/ProtobufUtil.java>:[1678,37]
package AccessControlProtos does not exist
[ERROR] 
[ERROR] <https://builds.apache.org/job/HBase-TRUNK/ws/trunk/hbase-server/src/main/java/org/apache/hadoop/hbase/protobuf/ProtobufUtil.java>:[1680,62]
package AccessControlProtos.UserTablePermissions.UserPermissions does not exist
[ERROR] 
[ERROR] <https://builds.apache.org/job/HBase-TRUNK/ws/trunk/hbase-server/src/main/java/org/apache/hadoop/hbase/protobuf/ProtobufUtil.java>:[1681,58]
package AccessControlProtos.UserTablePermissions does not exist
[ERROR] 
[ERROR] <https://builds.apache.org/job/HBase-TRUNK/ws/trunk/hbase-server/src/main/java/org/apache/hadoop/hbase/protobuf/ProtobufUtil.java>:[1701,44]
package AccessControlProtos.UserTablePermissions does not exist
[ERROR] -> [Help 1]
[ERROR] 
[ERROR] To see the full stack trace of the errors, re-run Maven with the -e switch.
[ERROR] Re-run Maven using the -X switch to enable full debug logging.
[ERROR] 
[ERROR] For more information about the errors and possible solutions, please read the following
articles:
[ERROR] [Help 1] http://cwiki.apache.org/confluence/display/MAVEN/MojoFailureException
[ERROR] 
[ERROR] After correcting the problems, you can resume the build with the command
[ERROR]   mvn <goals> -rf :hbase-server
Build step 'Invoke top-level Maven targets' marked build as failure
Archiving artifacts
Recording test results
Updating HBASE-6641
Updating HBASE-5449

Mime
View raw message