hbase-dev mailing list archives

Site index · List index
Message view « Date » · « Thread »
Top « Date » · « Thread »
From Apache Jenkins Server <jenk...@builds.apache.org>
Subject Build failed in Jenkins: HBase-0.92 #538
Date Mon, 27 Aug 2012 23:16:09 GMT
See <https://builds.apache.org/job/HBase-0.92/538/>

------------------------------------------
[...truncated 1354 lines...]
[WARNING] The POM for javax.jms:jms:jar:1.1 is invalid, transitive dependencies (if any) will
not be available, enable debug logging for more details
[WARNING] The POM for com.sun.jdmk:jmxtools:jar:1.2.1 is invalid, transitive dependencies
(if any) will not be available, enable debug logging for more details
[WARNING] The POM for com.sun.jmx:jmxri:jar:1.2.1 is invalid, transitive dependencies (if
any) will not be available, enable debug logging for more details
[INFO] 
[INFO] --- maven-clean-plugin:2.4.1:clean (default-clean) @ hbase ---
[INFO] 
[INFO] --- xml-maven-plugin:1.0-beta-3:transform (default) @ hbase ---
[INFO] Transforming file: /zonestorage/hudson_solaris/home/hudson/hudson-slave/workspace/HBase-0.92/trunk/src/main/resources/hbase-default.xml
[INFO] Transformed 1 file(s).
[INFO] 
[INFO] --- docbkx-maven-plugin:2.0.13:generate-html (multipage) @ hbase ---
[INFO] Processing input file: developer.xml
[INFO] Chunking output.
[INFO] See /zonestorage/hudson_solaris/home/hudson/hudson-slave/workspace/HBase-0.92/trunk/target/site/book/developer
for generated file(s)
[INFO] Processing input file: build.xml
[INFO] Chunking output.
[INFO] See /zonestorage/hudson_solaris/home/hudson/hudson-slave/workspace/HBase-0.92/trunk/target/site/book/build
for generated file(s)
[INFO] Processing input file: getting_started.xml
[INFO] Chunking output.
[INFO] See /zonestorage/hudson_solaris/home/hudson/hudson-slave/workspace/HBase-0.92/trunk/target/site/book/getting_started
for generated file(s)
[INFO] Processing input file: configuration.xml
[INFO] Chunking output.
[INFO] See /zonestorage/hudson_solaris/home/hudson/hudson-slave/workspace/HBase-0.92/trunk/target/site/book/configuration
for generated file(s)
[INFO] Processing input file: book.xml
[INFO] Chunking output.
[INFO] See /zonestorage/hudson_solaris/home/hudson/hudson-slave/workspace/HBase-0.92/trunk/target/site/book/book
for generated file(s)
[INFO] Processing input file: external_apis.xml
[INFO] Chunking output.
[INFO] See /zonestorage/hudson_solaris/home/hudson/hudson-slave/workspace/HBase-0.92/trunk/target/site/book/external_apis
for generated file(s)
[INFO] Processing input file: preface.xml
[INFO] Chunking output.
[INFO] See /zonestorage/hudson_solaris/home/hudson/hudson-slave/workspace/HBase-0.92/trunk/target/site/book/preface
for generated file(s)
[INFO] Processing input file: shell.xml
[INFO] Chunking output.
[INFO] See /zonestorage/hudson_solaris/home/hudson/hudson-slave/workspace/HBase-0.92/trunk/target/site/book/shell
for generated file(s)
[INFO] Processing input file: ops_mgt.xml
[INFO] Chunking output.
[INFO] See /zonestorage/hudson_solaris/home/hudson/hudson-slave/workspace/HBase-0.92/trunk/target/site/book/ops_mgt
for generated file(s)
[INFO] Processing input file: performance.xml
[INFO] Chunking output.
[INFO] See /zonestorage/hudson_solaris/home/hudson/hudson-slave/workspace/HBase-0.92/trunk/target/site/book/performance
for generated file(s)
[INFO] Processing input file: upgrading.xml
[INFO] Chunking output.
[INFO] See /zonestorage/hudson_solaris/home/hudson/hudson-slave/workspace/HBase-0.92/trunk/target/site/book/upgrading
for generated file(s)
[INFO] Processing input file: troubleshooting.xml
[INFO] Chunking output.
[INFO] See /zonestorage/hudson_solaris/home/hudson/hudson-slave/workspace/HBase-0.92/trunk/target/site/book/troubleshooting
for generated file(s)
[INFO] 
[INFO] --- docbkx-maven-plugin:2.0.13:generate-html (onepage) @ hbase ---
[INFO] Processing input file: developer.xml
[INFO] /zonestorage/hudson_solaris/home/hudson/hudson-slave/workspace/HBase-0.92/trunk/target/site/developer.html
has been generated.
[INFO] Processing input file: build.xml
[INFO] /zonestorage/hudson_solaris/home/hudson/hudson-slave/workspace/HBase-0.92/trunk/target/site/build.html
has been generated.
[INFO] Processing input file: getting_started.xml
[INFO] /zonestorage/hudson_solaris/home/hudson/hudson-slave/workspace/HBase-0.92/trunk/target/site/getting_started.html
has been generated.
[INFO] Processing input file: configuration.xml
[INFO] /zonestorage/hudson_solaris/home/hudson/hudson-slave/workspace/HBase-0.92/trunk/target/site/configuration.html
has been generated.
[INFO] Processing input file: book.xml
[INFO] /zonestorage/hudson_solaris/home/hudson/hudson-slave/workspace/HBase-0.92/trunk/target/site/book.html
has been generated.
[INFO] Processing input file: external_apis.xml
[INFO] /zonestorage/hudson_solaris/home/hudson/hudson-slave/workspace/HBase-0.92/trunk/target/site/external_apis.html
has been generated.
[INFO] Processing input file: preface.xml
[INFO] /zonestorage/hudson_solaris/home/hudson/hudson-slave/workspace/HBase-0.92/trunk/target/site/preface.html
has been generated.
[INFO] Processing input file: shell.xml
[INFO] /zonestorage/hudson_solaris/home/hudson/hudson-slave/workspace/HBase-0.92/trunk/target/site/shell.html
has been generated.
[INFO] Processing input file: ops_mgt.xml
[INFO] /zonestorage/hudson_solaris/home/hudson/hudson-slave/workspace/HBase-0.92/trunk/target/site/ops_mgt.html
has been generated.
[INFO] Processing input file: performance.xml
[INFO] /zonestorage/hudson_solaris/home/hudson/hudson-slave/workspace/HBase-0.92/trunk/target/site/performance.html
has been generated.
[INFO] Processing input file: upgrading.xml
[INFO] /zonestorage/hudson_solaris/home/hudson/hudson-slave/workspace/HBase-0.92/trunk/target/site/upgrading.html
has been generated.
[INFO] Processing input file: troubleshooting.xml
[INFO] /zonestorage/hudson_solaris/home/hudson/hudson-slave/workspace/HBase-0.92/trunk/target/site/troubleshooting.html
has been generated.
[INFO] 
[INFO] --- maven-site-plugin:2.0.1:site (default-site) @ hbase ---
[INFO] Unable to load parent project from a relative path: 1 problem was encountered while
building the effective model
[FATAL] Non-readable POM /zonestorage/hudson_solaris/home/hudson/hudson-slave/workspace/HBase-0.92/pom.xml:
/zonestorage/hudson_solaris/home/hudson/hudson-slave/workspace/HBase-0.92/pom.xml (No such
file or directory) @ 
 for project  at /zonestorage/hudson_solaris/home/hudson/hudson-slave/workspace/HBase-0.92/pom.xml
for project  at /zonestorage/hudson_solaris/home/hudson/hudson-slave/workspace/HBase-0.92/pom.xml
[INFO] Parent project loaded from repository.
[INFO] Unable to load parent project from a relative path: 1 problem was encountered while
building the effective model
[FATAL] Non-readable POM /zonestorage/hudson_solaris/home/hudson/hudson-slave/workspace/HBase-0.92/pom.xml:
/zonestorage/hudson_solaris/home/hudson/hudson-slave/workspace/HBase-0.92/pom.xml (No such
file or directory) @ 
 for project  at /zonestorage/hudson_solaris/home/hudson/hudson-slave/workspace/HBase-0.92/pom.xml
for project  at /zonestorage/hudson_solaris/home/hudson/hudson-slave/workspace/HBase-0.92/pom.xml
[INFO] Parent project loaded from repository.
[INFO] 
[INFO] --- maven-antrun-plugin:1.6:run (arc-setup) @ hbase ---
[WARNING] Parameter tasks is deprecated, use target instead
[INFO] Executing tasks

main:
[INFO] Executed tasks
[INFO] 
[INFO] --- avro-maven-plugin:1.5.3:schema (generate-avro-sources) @ hbase ---
[INFO] 
[INFO] --- avro-maven-plugin:1.5.3:protocol (generate-avro-sources) @ hbase ---
[INFO] 
[INFO] --- maven-antrun-plugin:1.6:run (generate) @ hbase ---
[INFO] Executing tasks

main:
    [mkdir] Created dir: /zonestorage/hudson_solaris/home/hudson/hudson-slave/workspace/HBase-0.92/trunk/target/hbase-webapps
     [copy] Copying 5 files to /zonestorage/hudson_solaris/home/hudson/hudson-slave/workspace/HBase-0.92/trunk/target/hbase-webapps
12/08/27 22:45:43 INFO mortbay.log: Logging to org.slf4j.impl.Log4jLoggerAdapter(org.mortbay.log)
via org.mortbay.log.Slf4jLog
    [mkdir] Created dir: /zonestorage/hudson_solaris/home/hudson/hudson-slave/workspace/HBase-0.92/trunk/target/hbase-webapps/master/WEB-INF
    [mkdir] Created dir: /zonestorage/hudson_solaris/home/hudson/hudson-slave/workspace/HBase-0.92/trunk/target/hbase-webapps/regionserver/WEB-INF
     [exec] /zonestorage/hudson_solaris/home/hudson/hudson-slave/workspace/HBase-0.92/trunk/src/saveVersion.sh:
whoami: not found
[INFO] Executed tasks
[INFO] 
[INFO] --- build-helper-maven-plugin:1.5:add-source (jspcSource-packageInfo-Avro-source) @
hbase ---
[INFO] Source directory: /zonestorage/hudson_solaris/home/hudson/hudson-slave/workspace/HBase-0.92/trunk/target/generated-jamon
added.
[INFO] Source directory: /zonestorage/hudson_solaris/home/hudson/hudson-slave/workspace/HBase-0.92/trunk/target/generated-sources/java
added.
[INFO] 
[INFO] --- jamon-maven-plugin:2.3.4:translate (default) @ hbase ---
[INFO] Translating 4 templates from /zonestorage/hudson_solaris/home/hudson/hudson-slave/workspace/HBase-0.92/trunk/src/main/jamon
to /zonestorage/hudson_solaris/home/hudson/hudson-slave/workspace/HBase-0.92/trunk/target/generated-jamon
[INFO] 
[INFO] --- maven-remote-resources-plugin:1.1:process (default) @ hbase ---
[INFO] Setting property: classpath.resource.loader.class => 'org.codehaus.plexus.velocity.ContextClassLoaderResourceLoader'.
[INFO] Setting property: velocimacro.messages.on => 'false'.
[INFO] Setting property: resource.loader => 'classpath'.
[INFO] Setting property: resource.manager.logwhenfound => 'false'.
[INFO] 
[INFO] --- maven-resources-plugin:2.4:resources (default-resources) @ hbase ---
[INFO] Using 'UTF-8' encoding to copy filtered resources.
[INFO] Copying 1 resource
[INFO] Copying 7 resources
[INFO] Copying 3 resources
[INFO] 
[INFO] --- maven-antrun-plugin:1.6:run (default) @ hbase ---
[INFO] Executing tasks

main:
    [mkdir] Created dir: /zonestorage/hudson_solaris/home/hudson/hudson-slave/workspace/HBase-0.92/trunk/target/nativelib
     [exec] tar: hadoop-snappy-nativelibs.tar: No such file or directory
     [exec] Result: 1
[INFO] Executed tasks
[INFO] 
[INFO] --- maven-compiler-plugin:2.0.2:compile (default-compile) @ hbase ---
[INFO] Compiling 621 source files to /zonestorage/hudson_solaris/home/hudson/hudson-slave/workspace/HBase-0.92/trunk/target/classes
[WARNING] /zonestorage/hudson_solaris/home/hudson/hudson-slave/workspace/HBase-0.92/trunk/src/main/java/org/apache/hadoop/hbase/util/Bytes.java:[44,15]
sun.misc.Unsafe is Sun proprietary API and may be removed in a future release

[WARNING] /zonestorage/hudson_solaris/home/hudson/hudson-slave/workspace/HBase-0.92/trunk/src/main/java/org/apache/hadoop/hbase/util/Bytes.java:[1035,19]
sun.misc.Unsafe is Sun proprietary API and may be removed in a future release

[WARNING] /zonestorage/hudson_solaris/home/hudson/hudson-slave/workspace/HBase-0.92/trunk/src/main/java/org/apache/hadoop/hbase/util/Bytes.java:[1041,21]
sun.misc.Unsafe is Sun proprietary API and may be removed in a future release

[WARNING] /zonestorage/hudson_solaris/home/hudson/hudson-slave/workspace/HBase-0.92/trunk/src/main/java/org/apache/hadoop/hbase/util/Bytes.java:[1046,28]
sun.misc.Unsafe is Sun proprietary API and may be removed in a future release

[INFO] 
[INFO] --- build-helper-maven-plugin:1.5:add-test-resource (add-test-resource) @ hbase ---
[INFO] 
[INFO] --- maven-resources-plugin:2.4:testResources (default-testResources) @ hbase ---
[INFO] Using 'UTF-8' encoding to copy filtered resources.
[INFO] Copying 4 resources
[INFO] Copying 3 resources
[INFO] Copying 1 resource
[INFO] 
[INFO] --- maven-compiler-plugin:2.0.2:testCompile (default-testCompile) @ hbase ---
[INFO] Compiling 296 source files to /zonestorage/hudson_solaris/home/hudson/hudson-slave/workspace/HBase-0.92/trunk/target/test-classes
[INFO] 
[INFO] --- maven-surefire-plugin:2.10:test (default-test) @ hbase ---
[INFO] Surefire report directory: /zonestorage/hudson_solaris/home/hudson/hudson-slave/workspace/HBase-0.92/trunk/target/surefire-reports

-------------------------------------------------------
 T E S T S
-------------------------------------------------------

-------------------------------------------------------
 T E S T S
-------------------------------------------------------
Running org.apache.hadoop.hbase.TestFullLogReconstruction
Tests run: 1, Failures: 0, Errors: 0, Skipped: 0, Time elapsed: 61.178 sec
Running org.apache.hadoop.hbase.zookeeper.TestZooKeeperMainServerArg
Tests run: 1, Failures: 0, Errors: 0, Skipped: 0, Time elapsed: 1.105 sec
Running org.apache.hadoop.hbase.zookeeper.TestHQuorumPeer
Tests run: 3, Failures: 0, Errors: 0, Skipped: 0, Time elapsed: 2.269 sec
Running org.apache.hadoop.hbase.zookeeper.TestZKTable
Tests run: 1, Failures: 0, Errors: 0, Skipped: 0, Time elapsed: 9.304 sec
Running org.apache.hadoop.hbase.zookeeper.TestZooKeeperNodeTracker
Tests run: 2, Failures: 0, Errors: 0, Skipped: 0, Time elapsed: 9.526 sec
Running org.apache.hadoop.hbase.zookeeper.TestZKLeaderManager
Tests run: 1, Failures: 0, Errors: 0, Skipped: 0, Time elapsed: 8.25 sec
Running org.apache.hadoop.hbase.zookeeper.TestZooKeeperACL
Tests run: 5, Failures: 0, Errors: 0, Skipped: 0, Time elapsed: 92.18 sec
Running org.apache.hadoop.hbase.mapred.TestTableInputFormat
Tests run: 10, Failures: 0, Errors: 0, Skipped: 0, Time elapsed: 46.335 sec
Running org.apache.hadoop.hbase.mapred.TestTableMapReduce
Tests run: 1, Failures: 0, Errors: 0, Skipped: 0, Time elapsed: 82.32 sec
Running org.apache.hadoop.hbase.migration.TestMigrationFrom090To092
Tests run: 1, Failures: 0, Errors: 0, Skipped: 0, Time elapsed: 0.482 sec
Running org.apache.hadoop.hbase.ipc.TestDelayedRpc
Tests run: 4, Failures: 0, Errors: 0, Skipped: 0, Time elapsed: 2.517 sec
Running org.apache.hadoop.hbase.TestMultiVersions
Tests run: 3, Failures: 0, Errors: 0, Skipped: 0, Time elapsed: 41.2 sec
Running org.apache.hadoop.hbase.TestKeyValue
Tests run: 15, Failures: 0, Errors: 0, Skipped: 0, Time elapsed: 0.18 sec
Running org.apache.hadoop.hbase.util.TestPoolMap
Tests run: 9, Failures: 0, Errors: 0, Skipped: 0, Time elapsed: 0.126 sec
Running org.apache.hadoop.hbase.util.TestRegionSplitCalculator
Tests run: 15, Failures: 0, Errors: 0, Skipped: 0, Time elapsed: 0.276 sec
Running org.apache.hadoop.hbase.util.TestRootPath
Tests run: 1, Failures: 0, Errors: 0, Skipped: 0, Time elapsed: 0.142 sec
Running org.apache.hadoop.hbase.util.TestByteBloomFilter
Tests run: 5, Failures: 0, Errors: 0, Skipped: 0, Time elapsed: 1.384 sec
Running org.apache.hadoop.hbase.util.TestKeying
Tests run: 1, Failures: 0, Errors: 0, Skipped: 0, Time elapsed: 0.075 sec
Running org.apache.hadoop.hbase.util.TestHBaseFsck
Tests run: 22, Failures: 0, Errors: 0, Skipped: 0, Time elapsed: 280.173 sec
Running org.apache.hadoop.hbase.util.TestCompressionTest
Tests run: 1, Failures: 0, Errors: 0, Skipped: 0, Time elapsed: 2.235 sec
Running org.apache.hadoop.hbase.util.TestFSUtils
Tests run: 2, Failures: 0, Errors: 0, Skipped: 0, Time elapsed: 63.983 sec
Running org.apache.hadoop.hbase.util.TestFSTableDescriptors
Tests run: 10, Failures: 0, Errors: 0, Skipped: 0, Time elapsed: 4.319 sec
Running org.apache.hadoop.hbase.util.TestDefaultEnvironmentEdge
Tests run: 1, Failures: 0, Errors: 0, Skipped: 0, Time elapsed: 0.222 sec
Running org.apache.hadoop.hbase.util.TestMergeTable
Tests run: 1, Failures: 0, Errors: 0, Skipped: 0, Time elapsed: 129.148 sec
Running org.apache.hadoop.hbase.util.TestMiniClusterLoadSequential
Tests run: 2, Failures: 0, Errors: 0, Skipped: 0, Time elapsed: 121.395 sec
Running org.apache.hadoop.hbase.util.TestBytes
Tests run: 13, Failures: 0, Errors: 0, Skipped: 0, Time elapsed: 0.566 sec
Running org.apache.hadoop.hbase.util.TestMiniClusterLoadParallel
Tests run: 2, Failures: 0, Errors: 0, Skipped: 0, Time elapsed: 97.079 sec
Running org.apache.hadoop.hbase.util.TestMergeTool
Tests run: 1, Failures: 0, Errors: 0, Skipped: 0, Time elapsed: 488.894 sec
Running org.apache.hadoop.hbase.util.TestEnvironmentEdgeManager
Tests run: 2, Failures: 0, Errors: 0, Skipped: 0, Time elapsed: 0.953 sec
Running org.apache.hadoop.hbase.util.hbck.TestOfflineMetaRebuildOverlap
Tests run: 1, Failures: 0, Errors: 0, Skipped: 0, Time elapsed: 65.552 sec

Results :

Tests run: 137, Failures: 0, Errors: 0, Skipped: 0

[INFO] ------------------------------------------------------------------------
[INFO] BUILD FAILURE
[INFO] ------------------------------------------------------------------------
[INFO] Total time: 30:33.961s
[INFO] Finished at: Mon Aug 27 23:15:26 GMT+00:00 2012
[INFO] Final Memory: 55M/1071M
[INFO] ------------------------------------------------------------------------
[ERROR] Failed to execute goal org.apache.maven.plugins:maven-surefire-plugin:2.10:test (default-test)
on project hbase: Error while executing forked tests.; nested exception is java.io.IOException:
Cannot run program "/bin/sh" (in directory "/zonestorage/hudson_solaris/home/hudson/hudson-slave/workspace/HBase-0.92/trunk"):
error=12, Not enough space -> [Help 1]
[ERROR] 
[ERROR] To see the full stack trace of the errors, re-run Maven with the -e switch.
[ERROR] Re-run Maven using the -X switch to enable full debug logging.
[ERROR] 
[ERROR] For more information about the errors and possible solutions, please read the following
articles:
[ERROR] [Help 1] http://cwiki.apache.org/confluence/display/MAVEN/MojoExecutionException
Build step 'Invoke top-level Maven targets' marked build as failure
Archiving artifacts
Recording test results

Mime
View raw message