hbase-dev mailing list archives

Site index · List index
Message view « Date » · « Thread »
Top « Date » · « Thread »
From Apache Jenkins Server <jenk...@builds.apache.org>
Subject Build failed in Jenkins: HBase-TRUNK #3228
Date Thu, 16 Aug 2012 21:37:43 GMT
See <https://builds.apache.org/job/HBase-TRUNK/3228/changes>

Changes:

[stack] HBASE-6596 Revert HBASE-5022; it undoes HBC.create -- ADDENDUM

[apurtell] HBASE-6245. Upon page refresh new UI should return to the previously selected tab
(Jie Huang)

------------------------------------------
[...truncated 2653 lines...]
Tests run: 10, Failures: 0, Errors: 0, Skipped: 0, Time elapsed: 0.979 sec
Running org.apache.hadoop.hbase.util.TestEnvironmentEdgeManager
Tests run: 2, Failures: 0, Errors: 0, Skipped: 0, Time elapsed: 5.899 sec
Running org.apache.hadoop.hbase.util.TestMergeTool
Tests run: 1, Failures: 0, Errors: 0, Skipped: 0, Time elapsed: 135.571 sec
Running org.apache.hadoop.hbase.util.TestProcessBasedCluster
Tests run: 1, Failures: 0, Errors: 0, Skipped: 0, Time elapsed: 0.327 sec
Running org.apache.hadoop.hbase.util.TestRegionSplitter
Tests run: 5, Failures: 0, Errors: 0, Skipped: 0, Time elapsed: 92.117 sec
Running org.apache.hadoop.hbase.util.TestMiniClusterLoadSequential
Tests run: 4, Failures: 0, Errors: 0, Skipped: 0, Time elapsed: 351.502 sec
Running org.apache.hadoop.hbase.mapred.TestTableInputFormat
Tests run: 10, Failures: 0, Errors: 0, Skipped: 0, Time elapsed: 95.903 sec
Running org.apache.hadoop.hbase.util.TestMiniClusterLoadParallel
Tests run: 4, Failures: 0, Errors: 0, Skipped: 0, Time elapsed: 324.696 sec
Running org.apache.hadoop.hbase.regionserver.TestStore
Tests run: 12, Failures: 1, Errors: 0, Skipped: 0, Time elapsed: 8.326 sec <<< FAILURE!
Running org.apache.hadoop.hbase.regionserver.TestStoreFileBlockCacheSummary
Tests run: 1, Failures: 0, Errors: 0, Skipped: 0, Time elapsed: 45.163 sec
Running org.apache.hadoop.hbase.regionserver.TestCompaction
Tests run: 15, Failures: 0, Errors: 0, Skipped: 0, Time elapsed: 41.454 sec
Running org.apache.hadoop.hbase.regionserver.TestMemStore
Tests run: 21, Failures: 0, Errors: 0, Skipped: 0, Time elapsed: 30.164 sec
Running org.apache.hadoop.hbase.mapred.TestTableMapReduce
Tests run: 1, Failures: 0, Errors: 0, Skipped: 0, Time elapsed: 142.221 sec
Running org.apache.hadoop.hbase.regionserver.TestCompactionWithCoprocessor
Tests run: 15, Failures: 0, Errors: 0, Skipped: 0, Time elapsed: 42.326 sec
Running org.apache.hadoop.hbase.regionserver.handler.TestOpenRegionHandler
Tests run: 3, Failures: 0, Errors: 0, Skipped: 0, Time elapsed: 1.599 sec
Running org.apache.hadoop.hbase.regionserver.handler.TestCloseRegionHandler
Tests run: 3, Failures: 0, Errors: 0, Skipped: 0, Time elapsed: 1.652 sec
Running org.apache.hadoop.hbase.regionserver.TestParallelPut
Tests run: 2, Failures: 0, Errors: 0, Skipped: 0, Time elapsed: 5.771 sec
Running org.apache.hadoop.hbase.regionserver.TestRegionServerMetrics
Tests run: 4, Failures: 0, Errors: 0, Skipped: 0, Time elapsed: 127.03 sec
Running org.apache.hadoop.hbase.regionserver.TestServerCustomProtocol
Tests run: 7, Failures: 0, Errors: 0, Skipped: 0, Time elapsed: 23.651 sec
Running org.apache.hadoop.hbase.util.TestHBaseFsck
Tests run: 22, Failures: 0, Errors: 0, Skipped: 0, Time elapsed: 528.232 sec
Running org.apache.hadoop.hbase.regionserver.TestHRegionOnCluster
Tests run: 1, Failures: 0, Errors: 0, Skipped: 0, Time elapsed: 27.756 sec
Running org.apache.hadoop.hbase.regionserver.TestBlocksRead
Tests run: 4, Failures: 0, Errors: 0, Skipped: 0, Time elapsed: 1.371 sec
Running org.apache.hadoop.hbase.regionserver.TestMasterAddressManager
Tests run: 1, Failures: 0, Errors: 0, Skipped: 0, Time elapsed: 1.797 sec
Running org.apache.hadoop.hbase.regionserver.TestAtomicOperation
Tests run: 5, Failures: 0, Errors: 0, Skipped: 0, Time elapsed: 15.887 sec
Running org.apache.hadoop.hbase.regionserver.TestRSKilledWhenMasterInitializing
Tests run: 1, Failures: 0, Errors: 0, Skipped: 0, Time elapsed: 52.292 sec
Running org.apache.hadoop.hbase.regionserver.TestSplitTransactionOnCluster
Tests run: 7, Failures: 0, Errors: 0, Skipped: 0, Time elapsed: 118.396 sec
Running org.apache.hadoop.hbase.regionserver.wal.TestWALReplayCompressed
Tests run: 7, Failures: 0, Errors: 0, Skipped: 0, Time elapsed: 66.537 sec
Running org.apache.hadoop.hbase.regionserver.wal.TestHLog
Tests run: 10, Failures: 0, Errors: 0, Skipped: 0, Time elapsed: 75.869 sec
Running org.apache.hadoop.hbase.regionserver.wal.TestWALReplay
Tests run: 7, Failures: 0, Errors: 0, Skipped: 0, Time elapsed: 56.488 sec
Running org.apache.hadoop.hbase.regionserver.wal.TestLogRollAbort
Tests run: 1, Failures: 0, Errors: 0, Skipped: 0, Time elapsed: 22.35 sec
Running org.apache.hadoop.hbase.regionserver.TestMXBean
Tests run: 1, Failures: 0, Errors: 0, Skipped: 0, Time elapsed: 13.687 sec
Running org.apache.hadoop.hbase.regionserver.metrics.TestSchemaMetrics
Tests run: 6, Failures: 0, Errors: 0, Skipped: 0, Time elapsed: 15.075 sec
Running org.apache.hadoop.hbase.regionserver.TestRpcMetrics
Tests run: 1, Failures: 0, Errors: 0, Skipped: 0, Time elapsed: 1.868 sec
Running org.apache.hadoop.hbase.regionserver.TestGetClosestAtOrBefore
Tests run: 3, Failures: 0, Errors: 0, Skipped: 0, Time elapsed: 0.974 sec
Running org.apache.hadoop.hbase.regionserver.TestStoreScanner
Tests run: 16, Failures: 0, Errors: 0, Skipped: 0, Time elapsed: 0.054 sec
Running org.apache.hadoop.hbase.regionserver.TestCacheOnWriteInSchema
Tests run: 3, Failures: 0, Errors: 0, Skipped: 0, Time elapsed: 1.685 sec
Running org.apache.hadoop.hbase.regionserver.TestSeekOptimizations
Tests run: 6, Failures: 0, Errors: 0, Skipped: 0, Time elapsed: 2.853 sec
Running org.apache.hadoop.hbase.regionserver.TestFSErrorsExposed
Tests run: 3, Failures: 0, Errors: 0, Skipped: 0, Time elapsed: 32.345 sec
Running org.apache.hadoop.hbase.regionserver.TestSplitLogWorker
Tests run: 5, Failures: 0, Errors: 0, Skipped: 0, Time elapsed: 3.034 sec
Running org.apache.hadoop.hbase.regionserver.TestHRegionServerBulkLoad
Tests run: 1, Failures: 0, Errors: 0, Skipped: 0, Time elapsed: 47.108 sec
Running org.apache.hadoop.hbase.regionserver.TestCompoundBloomFilter
Tests run: 3, Failures: 0, Errors: 0, Skipped: 0, Time elapsed: 25.143 sec
Running org.apache.hadoop.hbase.regionserver.TestMultiColumnScanner
Tests run: 12, Failures: 0, Errors: 0, Skipped: 0, Time elapsed: 42.052 sec
Running org.apache.hadoop.hbase.regionserver.wal.TestLogRolling
Tests run: 2, Failures: 0, Errors: 0, Skipped: 0, Time elapsed: 272.253 sec
Running org.apache.hadoop.hbase.regionserver.TestHRegion
Tests run: 67, Failures: 0, Errors: 0, Skipped: 0, Time elapsed: 49.827 sec
Running org.apache.hadoop.hbase.regionserver.TestEndToEndSplitTransaction
Tests run: 2, Failures: 0, Errors: 0, Skipped: 0, Time elapsed: 70.975 sec
Running org.apache.hadoop.hbase.client.replication.TestReplicationAdmin
Tests run: 1, Failures: 0, Errors: 0, Skipped: 0, Time elapsed: 1.292 sec
Running org.apache.hadoop.hbase.regionserver.TestCompactionState
Tests run: 2, Failures: 0, Errors: 0, Skipped: 0, Time elapsed: 40.336 sec
Running org.apache.hadoop.hbase.client.TestTimestampsFilter
Tests run: 3, Failures: 0, Errors: 0, Skipped: 0, Time elapsed: 25.611 sec
Running org.apache.hadoop.hbase.regionserver.wal.TestHLogSplit
Tests run: 30, Failures: 0, Errors: 0, Skipped: 1, Time elapsed: 277.421 sec
Running org.apache.hadoop.hbase.client.TestMultipleTimestamps
Tests run: 8, Failures: 0, Errors: 0, Skipped: 0, Time elapsed: 37.222 sec
Running org.apache.hadoop.hbase.client.TestHCM
Tests run: 7, Failures: 0, Errors: 0, Skipped: 0, Time elapsed: 27.345 sec
Running org.apache.hadoop.hbase.client.TestHTablePool$TestHTableReusablePool
Tests run: 8, Failures: 0, Errors: 0, Skipped: 0, Time elapsed: 4.349 sec
Running org.apache.hadoop.hbase.client.TestHTablePool$TestHTableThreadLocalPool
Tests run: 8, Failures: 0, Errors: 0, Skipped: 0, Time elapsed: 26.834 sec
Running org.apache.hadoop.hbase.client.TestHTableUtil
Tests run: 2, Failures: 0, Errors: 0, Skipped: 0, Time elapsed: 17.808 sec
Running org.apache.hadoop.hbase.client.TestFromClientSide3
Tests run: 1, Failures: 0, Errors: 0, Skipped: 0, Time elapsed: 31.597 sec
Running org.apache.hadoop.hbase.client.TestMetaScanner
Tests run: 1, Failures: 0, Errors: 0, Skipped: 0, Time elapsed: 17.99 sec
Running org.apache.hadoop.hbase.client.TestFromClientSideWithCoprocessor
Tests run: 56, Failures: 0, Errors: 0, Skipped: 3, Time elapsed: 199.896 sec
Running org.apache.hadoop.hbase.client.TestFromClientSide
Tests run: 56, Failures: 0, Errors: 0, Skipped: 3, Time elapsed: 200.464 sec
Running org.apache.hadoop.hbase.client.TestScannerTimeout
Tests run: 4, Failures: 0, Errors: 0, Skipped: 0, Time elapsed: 49.554 sec
Running org.apache.hadoop.hbase.client.TestShell
Tests run: 1, Failures: 0, Errors: 0, Skipped: 0, Time elapsed: 125.309 sec
Running org.apache.hadoop.hbase.client.TestScannersFromClientSide
Tests run: 4, Failures: 0, Errors: 0, Skipped: 0, Time elapsed: 24.566 sec
Running org.apache.hadoop.hbase.client.TestMetaMigrationRemovingHTD
Tests run: 3, Failures: 0, Errors: 0, Skipped: 0, Time elapsed: 33.707 sec
Running org.apache.hadoop.hbase.TestMultiVersions
Tests run: 3, Failures: 0, Errors: 0, Skipped: 0, Time elapsed: 29.507 sec
Running org.apache.hadoop.hbase.client.TestAdmin
Tests run: 40, Failures: 0, Errors: 0, Skipped: 0, Time elapsed: 195.448 sec
Running org.apache.hadoop.hbase.client.TestMultiParallel
Tests run: 11, Failures: 0, Errors: 0, Skipped: 0, Time elapsed: 50.409 sec
Running org.apache.hadoop.hbase.master.TestActiveMasterManager
Tests run: 2, Failures: 0, Errors: 0, Skipped: 0, Time elapsed: 1.208 sec
Running org.apache.hadoop.hbase.master.TestMasterNoCluster
Tests run: 3, Failures: 0, Errors: 0, Skipped: 0, Time elapsed: 7.137 sec
Running org.apache.hadoop.hbase.master.TestRollingRestart
Tests run: 1, Failures: 0, Errors: 0, Skipped: 0, Time elapsed: 51.484 sec
Running org.apache.hadoop.hbase.master.balancer.TestDefaultLoadBalancer
Tests run: 1, Failures: 0, Errors: 0, Skipped: 0, Time elapsed: 1.522 sec
Running org.apache.hadoop.hbase.master.balancer.TestBaseLoadBalancer
Tests run: 3, Failures: 0, Errors: 0, Skipped: 0, Time elapsed: 0.36 sec
Running org.apache.hadoop.hbase.thrift.TestThriftServer
Tests run: 1, Failures: 0, Errors: 0, Skipped: 0, Time elapsed: 89.57 sec
Running org.apache.hadoop.hbase.master.TestZKBasedOpenCloseRegion
Tests run: 4, Failures: 0, Errors: 0, Skipped: 0, Time elapsed: 27.195 sec
Running org.apache.hadoop.hbase.master.TestMasterFileSystem
Tests run: 1, Failures: 0, Errors: 0, Skipped: 0, Time elapsed: 12.589 sec
Running org.apache.hadoop.hbase.master.TestMaster
Tests run: 1, Failures: 0, Errors: 0, Skipped: 0, Time elapsed: 19.534 sec
Running org.apache.hadoop.hbase.master.balancer.TestStochasticLoadBalancer
Tests run: 4, Failures: 0, Errors: 0, Skipped: 0, Time elapsed: 99.118 sec
Running org.apache.hadoop.hbase.master.TestMasterTransitions
Tests run: 3, Failures: 0, Errors: 0, Skipped: 3, Time elapsed: 27.434 sec
Running org.apache.hadoop.hbase.master.TestOpenedRegionHandler
Tests run: 2, Failures: 0, Errors: 0, Skipped: 0, Time elapsed: 21.234 sec
Running org.apache.hadoop.hbase.master.TestMXBean
Tests run: 1, Failures: 0, Errors: 0, Skipped: 0, Time elapsed: 19.105 sec
Running org.apache.hadoop.hbase.master.TestSplitLogManager
Tests run: 12, Failures: 0, Errors: 0, Skipped: 0, Time elapsed: 17.646 sec
Running org.apache.hadoop.hbase.master.TestAssignmentManager
Tests run: 12, Failures: 0, Errors: 0, Skipped: 0, Time elapsed: 3.334 sec
Running org.apache.hadoop.hbase.master.TestAssignmentManagerOnCluster
Tests run: 3, Failures: 0, Errors: 0, Skipped: 0, Time elapsed: 26.965 sec
Running org.apache.hadoop.hbase.master.TestMasterRestartAfterDisablingTable
Tests run: 1, Failures: 0, Errors: 0, Skipped: 0, Time elapsed: 20.518 sec
Running org.apache.hadoop.hbase.master.TestMasterStatusServlet
Tests run: 5, Failures: 0, Errors: 0, Skipped: 0, Time elapsed: 1.35 sec
Running org.apache.hadoop.hbase.master.TestHMasterRPCException
Tests run: 1, Failures: 0, Errors: 0, Skipped: 0, Time elapsed: 1.423 sec
Running org.apache.hadoop.hbase.master.TestMasterShutdown
Tests run: 1, Failures: 0, Errors: 0, Skipped: 0, Time elapsed: 19.284 sec
Running org.apache.hadoop.hbase.master.cleaner.TestLogsCleaner
Tests run: 1, Failures: 0, Errors: 0, Skipped: 0, Time elapsed: 3.359 sec
Running org.apache.hadoop.hbase.master.TestRestartCluster
Tests run: 2, Failures: 0, Errors: 0, Skipped: 0, Time elapsed: 41.919 sec
Running org.apache.hadoop.hbase.master.TestMasterFailover
Tests run: 4, Failures: 0, Errors: 0, Skipped: 0, Time elapsed: 100.335 sec
Running org.apache.hadoop.hbase.master.TestDistributedLogSplitting
Tests run: 4, Failures: 0, Errors: 0, Skipped: 0, Time elapsed: 136.245 sec
Running org.apache.hadoop.hbase.avro.TestAvroServer
Tests run: 3, Failures: 0, Errors: 0, Skipped: 0, Time elapsed: 33.542 sec
Running org.apache.hadoop.hbase.TestZooKeeper
Tests run: 9, Failures: 0, Errors: 0, Skipped: 0, Time elapsed: 71.841 sec
Running org.apache.hadoop.hbase.ipc.TestProtoBufRpc
Tests run: 1, Failures: 0, Errors: 0, Skipped: 0, Time elapsed: 0.759 sec
Running org.apache.hadoop.hbase.TestRegionRebalancing
Running org.apache.hadoop.hbase.ipc.TestDelayedRpc
Tests run: 4, Failures: 0, Errors: 0, Skipped: 0, Time elapsed: 2.363 sec
Tests run: 2, Failures: 0, Errors: 0, Skipped: 0, Time elapsed: 143.811 sec
Running org.apache.hadoop.hbase.TestInfoServers
Tests run: 2, Failures: 0, Errors: 0, Skipped: 0, Time elapsed: 17.374 sec
Running org.apache.hadoop.hbase.thrift2.TestThriftHBaseServiceHandler
Tests run: 12, Failures: 0, Errors: 0, Skipped: 0, Time elapsed: 18.91 sec
Running org.apache.hadoop.hbase.TestAcidGuarantees
Tests run: 3, Failures: 0, Errors: 0, Skipped: 0, Time elapsed: 108.119 sec
Running org.apache.hadoop.hbase.thrift.TestThriftServerCmdLine
Tests run: 20, Failures: 0, Errors: 0, Skipped: 0, Time elapsed: 506.519 sec

Results :

Failed tests:   testMultipleTables(org.apache.hadoop.hbase.backup.example.TestZooKeeperTableArchiveClient):
Archived HFiles (hdfs://localhost:37474/user/hudson/hbase/.archive/otherTable/cc0f3f7bbb80c60f770dff66ddf4a112/fam)
should have gotten deleted, but didn't, remaining files:[hdfs://localhost:37474/user/hudson/hbase/.archive/otherTable/cc0f3f7bbb80c60f770dff66ddf4a112/fam/829558c369614ba883e099c0784f1d85,
hdfs://localhost:37474/user/hudson/hbase/.archive/otherTable/cc0f3f7bbb80c60f770dff66ddf4a112/fam/846db17c55774f799418742e6af63ccd,
hdfs://localhost:37474/user/hudson/hbase/.archive/otherTable/cc0f3f7bbb80c60f770dff66ddf4a112/fam/84707c1ecaa04fafbea05b05daf670cf,
hdfs://localhost:37474/user/hudson/hbase/.archive/otherTable/cc0f3f7bbb80c60f770dff66ddf4a112/fam/909cb0d4c1c2471e80ebf6f13672b483,
hdfs://localhost:37474/user/hudson/hbase/.archive/otherTable/cc0f3f7bbb80c60f770dff66ddf4a112/fam/9262343d2d394b10ab0ffd610d4e3e92,
hdfs://localhost:37474/user/hudson/hbase/.archive/otherTable/cc0f3f7bbb80c60f770dff66ddf4a112/fam/9540bdb8ba314816970e96800ae9710e,
hdfs://localhost:37474/user/hudson/hbase/.archive/otherTable/cc0f3f7bbb80c60f770dff66ddf4a112/fam/97cf8e06648641c6adef69e4e288df5f,
hdfs://localhost:37474/user/hudson/hbase/.archive/otherTable/cc0f3f7bbb80c60f770dff66ddf4a112/fam/9877bc17ba304e7bb48adc539bd18adc,
hdfs://localhost:37474/user/hudson/hbase/.archive/otherTable/cc0f3f7bbb80c60f770dff66ddf4a112/fam/9b22c3727ef044caa6525fea43d3260f,
hdfs://localhost:37474/user/hudson/hbase/.archive/otherTable/cc0f3f7bbb80c60f770dff66ddf4a112/fam/9b40d28c62bc4ccc94919b857da72a1f,
hdfs://localhost:37474/user/hudson/hbase/.archive/otherTable/cc0f3f7bbb80c60f770dff66ddf4a112/fam/9bef481b92bd4da5b7ec7e4582b6374b,
hdfs://localhost:37474/user/hudson/hbase/.archive/otherTable/cc0f3f7bbb80c60f770dff66ddf4a112/fam/a42527b0dfaf4198b3bceca51c3e7a52,
hdfs://localhost:37474/user/hudson/hbase/.archive/otherTable/cc0f3f7bbb80c60f770dff66ddf4a112/fam/a7ee9b22bbfd413daf3f0d9a0cc4a655,
hdfs://localhost:37474/user/hudson/hbase/.archive/otherTable/cc0f3f7bbb80c60f770dff66ddf4a112/fam/ab4e287b22e546789975d7f215c86d33,
hdfs://localhost:37474/user/hudson/hbase/.archive/otherTable/cc0f3f7bbb80c60f770dff66ddf4a112/fam/b66199ae9740466985eeb6f2a4c23d1f,
hdfs://localhost:37474/user/hudson/hbase/.archive/otherTable/cc0f3f7bbb80c60f770dff66ddf4a112/fam/ba2a0e2c19d841029db614600b7b3bf1,
hdfs://localhost:37474/user/hudson/hbase/.archive/otherTable/cc0f3f7bbb80c60f770dff66ddf4a112/fam/be9f2473a1264c05934b61172979af9c,
hdfs://localhost:37474/user/hudson/hbase/.archive/otherTable/cc0f3f7bbb80c60f770dff66ddf4a112/fam/c04f3b5e50a445ce82ea3d2836aaca8e,
hdfs://localhost:37474/user/hudson/hbase/.archive/otherTable/cc0f3f7bbb80c60f770dff66ddf4a112/fam/c1b91aec43644a92a21b5002bfe5bc39,
hdfs://localhost:37474/user/hudson/hbase/.archive/otherTable/cc0f3f7bbb80c60f770dff66ddf4a112/fam/c8a1a1ff22bd460ca681c4f14c691488,
hdfs://localhost:37474/user/hudson/hbase/.archive/otherTable/cc0f3f7bbb80c60f770dff66ddf4a112/fam/d85e8ebc5e0847fd950e0e528a976f07,
hdfs://localhost:37474/user/hudson/hbase/.archive/otherTable/cc0f3f7bbb80c60f770dff66ddf4a112/fam/dc494f8054f045a78878401d3518bdbd,
hdfs://localhost:37474/user/hudson/hbase/.archive/otherTable/cc0f3f7bbb80c60f770dff66ddf4a112/fam/dc5c4788e2e94088a1437d7641554794,
hdfs://localhost:37474/user/hudson/hbase/.archive/otherTable/cc0f3f7bbb80c60f770dff66ddf4a112/fam/dd84defce546462aa557623d1e0b5ab5,
hdfs://localhost:37474/user/hudson/hbase/.archive/otherTable/cc0f3f7bbb80c60f770dff66ddf4a112/fam/e3c96bd1ccaf484dbea49819f2490728,
hdfs://localhost:37474/user/hudson/hbase/.archive/otherTable/cc0f3f7bbb80c60f770dff66ddf4a112/fam/e4bd5ec5eff64639993dd6222cdd67fe,
hdfs://localhost:37474/user/hudson/hbase/.archive/otherTable/cc0f3f7bbb80c60f770dff66ddf4a112/fam/e62814cf459e4322a7b2af441b1caf23,
hdfs://localhost:37474/user/hudson/hbase/.archive/otherTable/cc0f3f7bbb80c60f770dff66ddf4a112/fam/e938473aae6b41ac8942e3450b4c1170,
hdfs://localhost:37474/user/hudson/hbase/.archive/otherTable/cc0f3f7bbb80c60f770dff66ddf4a112/fam/e975de30c3b34077a98f848d6f191766,
hdfs://localhost:37474/user/hudson/hbase/.archive/otherTable/cc0f3f7bbb80c60f770dff66ddf4a112/fam/ea39bc31de9d4357a50d00e0f959d9cc,
hdfs://localhost:37474/user/hudson/hbase/.archive/otherTable/cc0f3f7bbb80c60f770dff66ddf4a112/fam/ea5990f26a3a46cb90468001f6313832,
hdfs://localhost:37474/user/hudson/hbase/.archive/otherTable/cc0f3f7bbb80c60f770dff66ddf4a112/fam/eb27febdc8dc49c18760fa4c98d3bfc1,
hdfs://localhost:37474/user/hudson/hbase/.archive/otherTable/cc0f3f7bbb80c60f770dff66ddf4a112/fam/ec25c82898e64640a79c9f83d0b32ec2,
hdfs://localhost:37474/user/hudson/hbase/.archive/otherTable/cc0f3f7bbb80c60f770dff66ddf4a112/fam/f039ee26960c43d8b96126b10a4d105f,
hdfs://localhost:37474/user/hudson/hbase/.archive/otherTable/cc0f3f7bbb80c60f770dff66ddf4a112/fam/f0ab755f2d2e449588b33531f8047113,
hdfs://localhost:37474/user/hudson/hbase/.archive/otherTable/cc0f3f7bbb80c60f770dff66ddf4a112/fam/f46f14c095a24c6991fd215be79cb8b6,
hdfs://localhost:37474/user/hudson/hbase/.archive/otherTable/cc0f3f7bbb80c60f770dff66ddf4a112/fam/f53dab6586f04dfaa1b17160f60aaf04,
hdfs://localhost:37474/user/hudson/hbase/.archive/otherTable/cc0f3f7bbb80c60f770dff66ddf4a112/fam/f76f7751440740c38f7b5a1d72dd4df7,
hdfs://localhost:37474/user/hudson/hbase/.archive/otherTable/cc0f3f7bbb80c60f770dff66ddf4a112/fam/fa6e811bfc73486e9e60fa7e8eaf56e7]
  testDeleteExpiredStoreFiles(org.apache.hadoop.hbase.regionserver.TestStore): expected:<2>
but was:<3>

Tests run: 1130, Failures: 2, Errors: 0, Skipped: 12

[INFO]                                                                         
[INFO] ------------------------------------------------------------------------
[INFO] Skipping HBase
[INFO] This project has been banned from the build due to previous failures.
[INFO] ------------------------------------------------------------------------
[INFO]                                                                         
[INFO] ------------------------------------------------------------------------
[INFO] Skipping HBase
[INFO] This project has been banned from the build due to previous failures.
[INFO] ------------------------------------------------------------------------
[INFO] ------------------------------------------------------------------------
[INFO] Reactor Summary:
[INFO] 
[INFO] HBase ............................................. SUCCESS [6.994s]
[INFO] HBase - Common .................................... SUCCESS [13.426s]
[INFO] HBase - Hadoop Compatibility ...................... SUCCESS [1.517s]
[INFO] HBase - Hadoop One Compatibility .................. SUCCESS [2.138s]
[INFO] HBase - Server .................................... FAILURE [53:34.717s]
[INFO] HBase - Hadoop Two Compatibility .................. SKIPPED
[INFO] HBase - Integration Tests ......................... SKIPPED
[INFO] ------------------------------------------------------------------------
[INFO] BUILD FAILURE
[INFO] ------------------------------------------------------------------------
[INFO] Total time: 53:59.547s
[INFO] Finished at: Thu Aug 16 21:36:46 UTC 2012
[INFO] Final Memory: 67M/418M
[INFO] ------------------------------------------------------------------------
[ERROR] Failed to execute goal org.apache.maven.plugins:maven-surefire-plugin:2.12-TRUNK-HBASE-2:test
(secondPartTestsExecution) on project hbase-server: There are test failures.
[ERROR] 
[ERROR] Please refer to <https://builds.apache.org/job/HBase-TRUNK/ws/trunk/hbase-server/target/surefire-reports>
for the individual test results.
[ERROR] -> [Help 1]
[ERROR] 
[ERROR] To see the full stack trace of the errors, re-run Maven with the -e switch.
[ERROR] Re-run Maven using the -X switch to enable full debug logging.
[ERROR] 
[ERROR] For more information about the errors and possible solutions, please read the following
articles:
[ERROR] [Help 1] http://cwiki.apache.org/confluence/display/MAVEN/MojoFailureException
[ERROR] 
[ERROR] After correcting the problems, you can resume the build with the command
[ERROR]   mvn <goals> -rf :hbase-server
Build step 'Invoke top-level Maven targets' marked build as failure
Archiving artifacts
Recording test results
Updating HBASE-6245
Updating HBASE-5022
Updating HBASE-6596

Mime
View raw message