hbase-dev mailing list archives

Site index · List index
Message view « Date » · « Thread »
Top « Date » · « Thread »
From Apache Jenkins Server <jenk...@builds.apache.org>
Subject Build failed in Jenkins: HBase-TRUNK #3141
Date Tue, 17 Jul 2012 22:12:50 GMT
See <https://builds.apache.org/job/HBase-TRUNK/3141/changes>

Changes:

[tedyu] HBASE-6405 Create Hadoop compatibilty modules and Metrics2 implementation of replication
metrics (Elliot Clark)

------------------------------------------
[...truncated 1746 lines...]
[INFO] 
[INFO] --- maven-resources-plugin:2.5:resources (default-resources) @ hbase-common ---
[debug] execute contextualize
[INFO] Using 'UTF-8' encoding to copy filtered resources.
[INFO] skip non existing resourceDirectory /x1/jenkins/jenkins-slave/workspace/HBase-TRUNK/trunk/hbase-common/src/main/resources
[INFO] Copying 3 resources
[INFO] 
[INFO] --- maven-compiler-plugin:2.0.2:compile (default-compile) @ hbase-common ---
[INFO] Compiling 16 source files to /x1/jenkins/jenkins-slave/workspace/HBase-TRUNK/trunk/hbase-common/target/classes
[WARNING] /x1/jenkins/jenkins-slave/workspace/HBase-TRUNK/trunk/hbase-common/src/main/java/org/apache/hadoop/hbase/util/Bytes.java:[44,15]
sun.misc.Unsafe is Sun proprietary API and may be removed in a future release

[WARNING] /x1/jenkins/jenkins-slave/workspace/HBase-TRUNK/trunk/hbase-common/src/main/java/org/apache/hadoop/hbase/util/Bytes.java:[1040,19]
sun.misc.Unsafe is Sun proprietary API and may be removed in a future release

[WARNING] /x1/jenkins/jenkins-slave/workspace/HBase-TRUNK/trunk/hbase-common/src/main/java/org/apache/hadoop/hbase/util/Bytes.java:[1046,21]
sun.misc.Unsafe is Sun proprietary API and may be removed in a future release

[WARNING] /x1/jenkins/jenkins-slave/workspace/HBase-TRUNK/trunk/hbase-common/src/main/java/org/apache/hadoop/hbase/util/Bytes.java:[1051,28]
sun.misc.Unsafe is Sun proprietary API and may be removed in a future release

[INFO] 
[INFO] --- maven-resources-plugin:2.5:testResources (default-testResources) @ hbase-common
---
[debug] execute contextualize
[INFO] Using 'UTF-8' encoding to copy filtered resources.
[INFO] skip non existing resourceDirectory /x1/jenkins/jenkins-slave/workspace/HBase-TRUNK/trunk/hbase-common/src/test/resources
[INFO] Copying 3 resources
[INFO] 
[INFO] --- maven-compiler-plugin:2.0.2:testCompile (default-testCompile) @ hbase-common ---
[INFO] Compiling 1 source file to /x1/jenkins/jenkins-slave/workspace/HBase-TRUNK/trunk/hbase-common/target/test-classes
[INFO] 
[INFO] --- maven-surefire-plugin:2.12-TRUNK-HBASE-2:test (default-test) @ hbase-common ---
[INFO] Surefire report directory: /x1/jenkins/jenkins-slave/workspace/HBase-TRUNK/trunk/hbase-common/target/surefire-reports
[INFO] Using configured provider org.apache.maven.surefire.junitcore.JUnitCoreProvider

-------------------------------------------------------
 T E S T S
-------------------------------------------------------
Running org.apache.hadoop.hbase.util.TestBytes
Tests run: 13, Failures: 0, Errors: 0, Skipped: 0, Time elapsed: 0.05 sec

Results :

Tests run: 13, Failures: 0, Errors: 0, Skipped: 0

[INFO] 
[INFO] --- maven-surefire-plugin:2.12-TRUNK-HBASE-2:test (secondPartTestsExecution) @ hbase-common
---
[INFO] Tests are skipped.
[INFO] 
[INFO] --- maven-jar-plugin:2.3:test-jar (default) @ hbase-common ---
[INFO] Building jar: /x1/jenkins/jenkins-slave/workspace/HBase-TRUNK/trunk/hbase-common/target/hbase-common-0.95-SNAPSHOT-tests.jar
[INFO] 
[INFO] --- maven-jar-plugin:2.3:jar (default-jar) @ hbase-common ---
[INFO] Building jar: /x1/jenkins/jenkins-slave/workspace/HBase-TRUNK/trunk/hbase-common/target/hbase-common-0.95-SNAPSHOT.jar
[INFO] 
[INFO] --- apache-rat-plugin:0.8:check (default) @ hbase-common ---
[INFO] Exclude: **/.*
[INFO] Exclude: **/*.tgz
[INFO] Exclude: **/*.orig
[INFO] Exclude: **/test/**
[INFO] Exclude: **/8e8ab58dcf39412da19833fcd8f687ac
[INFO] Exclude: **/.git/**
[INFO] Exclude: **/.idea/**
[INFO] Exclude: **/target/**
[INFO] Exclude: **/CHANGES.txt
[INFO] Exclude: **/generated/**
[INFO] Exclude: **/conf/*
[INFO] Exclude: **/*.avpr
[INFO] Exclude: **/*.svg
[INFO] Exclude: **/*.vm
[INFO] Exclude: **/control
[INFO] Exclude: **/conffile
[INFO] Exclude: docs/*
[INFO] Exclude: **/src/site/resources/css/freebsd_docbook.css
[INFO]                                                                         
[INFO] ------------------------------------------------------------------------
[INFO] Building HBase - Hadoop Compatibility 0.95-SNAPSHOT
[INFO] ------------------------------------------------------------------------
[INFO] 
[INFO] --- maven-remote-resources-plugin:1.1:process (default) @ hbase-hadoop-compat ---
[INFO] 
[INFO] --- maven-resources-plugin:2.5:resources (default-resources) @ hbase-hadoop-compat
---
[debug] execute contextualize
[INFO] Using 'UTF-8' encoding to copy filtered resources.
[INFO] skip non existing resourceDirectory /x1/jenkins/jenkins-slave/workspace/HBase-TRUNK/trunk/hbase-hadoop-compat/src/main/resources
[INFO] Copying 3 resources
[INFO] 
[INFO] --- maven-compiler-plugin:2.0.2:compile (default-compile) @ hbase-hadoop-compat ---
[INFO] Compiling 3 source files to /x1/jenkins/jenkins-slave/workspace/HBase-TRUNK/trunk/hbase-hadoop-compat/target/classes
[INFO] 
[INFO] --- maven-resources-plugin:2.5:testResources (default-testResources) @ hbase-hadoop-compat
---
[debug] execute contextualize
[INFO] Using 'UTF-8' encoding to copy filtered resources.
[INFO] skip non existing resourceDirectory /x1/jenkins/jenkins-slave/workspace/HBase-TRUNK/trunk/hbase-hadoop-compat/src/test/resources
[INFO] Copying 3 resources
[INFO] 
[INFO] --- maven-compiler-plugin:2.0.2:testCompile (default-testCompile) @ hbase-hadoop-compat
---
[INFO] Compiling 1 source file to /x1/jenkins/jenkins-slave/workspace/HBase-TRUNK/trunk/hbase-hadoop-compat/target/test-classes
[INFO] 
[INFO] --- maven-surefire-plugin:2.12-TRUNK-HBASE-2:test (default-test) @ hbase-hadoop-compat
---
[INFO] Surefire report directory: /x1/jenkins/jenkins-slave/workspace/HBase-TRUNK/trunk/hbase-hadoop-compat/target/surefire-reports
[INFO] Using configured provider org.apache.maven.surefire.junitcore.JUnitCoreProvider

-------------------------------------------------------
 T E S T S
-------------------------------------------------------
Running org.apache.hadoop.hbase.replication.regionserver.metrics.ReplicationMetricsSourceFactoryTest
Tests run: 1, Failures: 0, Errors: 0, Skipped: 0, Time elapsed: 0.023 sec

Results :

Tests run: 1, Failures: 0, Errors: 0, Skipped: 0

[INFO] 
[INFO] --- maven-surefire-plugin:2.12-TRUNK-HBASE-2:test (secondPartTestsExecution) @ hbase-hadoop-compat
---
[INFO] Tests are skipped.
[INFO] 
[INFO] --- maven-jar-plugin:2.3:test-jar (default) @ hbase-hadoop-compat ---
[INFO] Building jar: /x1/jenkins/jenkins-slave/workspace/HBase-TRUNK/trunk/hbase-hadoop-compat/target/hbase-hadoop-compat-0.95-SNAPSHOT-tests.jar
[INFO] 
[INFO] --- maven-jar-plugin:2.3:jar (default-jar) @ hbase-hadoop-compat ---
[INFO] Building jar: /x1/jenkins/jenkins-slave/workspace/HBase-TRUNK/trunk/hbase-hadoop-compat/target/hbase-hadoop-compat-0.95-SNAPSHOT.jar
[INFO] 
[INFO] --- apache-rat-plugin:0.8:check (default) @ hbase-hadoop-compat ---
[INFO] Exclude: **/.*
[INFO] Exclude: **/*.tgz
[INFO] Exclude: **/*.orig
[INFO] Exclude: **/test/**
[INFO] Exclude: **/8e8ab58dcf39412da19833fcd8f687ac
[INFO] Exclude: **/.git/**
[INFO] Exclude: **/.idea/**
[INFO] Exclude: **/target/**
[INFO] Exclude: **/CHANGES.txt
[INFO] Exclude: **/generated/**
[INFO] Exclude: **/conf/*
[INFO] Exclude: **/*.avpr
[INFO] Exclude: **/*.svg
[INFO] Exclude: **/*.vm
[INFO] Exclude: **/control
[INFO] Exclude: **/conffile
[INFO] Exclude: docs/*
[INFO] Exclude: **/src/site/resources/css/freebsd_docbook.css
[INFO]                                                                         
[INFO] ------------------------------------------------------------------------
[INFO] Building HBase - Hadoop One Compatibility 0.95-SNAPSHOT
[INFO] ------------------------------------------------------------------------
[INFO] 
[INFO] --- maven-remote-resources-plugin:1.1:process (default) @ hbase-hadoop1-compat ---
[INFO] 
[INFO] --- maven-resources-plugin:2.5:resources (default-resources) @ hbase-hadoop1-compat
---
[debug] execute contextualize
[INFO] Using 'UTF-8' encoding to copy filtered resources.
[INFO] Copying 1 resource
[INFO] Copying 3 resources
[INFO] 
[INFO] --- maven-compiler-plugin:2.0.2:compile (default-compile) @ hbase-hadoop1-compat ---
[INFO] Compiling 2 source files to /x1/jenkins/jenkins-slave/workspace/HBase-TRUNK/trunk/hbase-hadoop1-compat/target/classes
[INFO] 
[INFO] --- maven-resources-plugin:2.5:testResources (default-testResources) @ hbase-hadoop1-compat
---
[debug] execute contextualize
[INFO] Using 'UTF-8' encoding to copy filtered resources.
[INFO] skip non existing resourceDirectory /x1/jenkins/jenkins-slave/workspace/HBase-TRUNK/trunk/hbase-hadoop1-compat/src/test/resources
[INFO] Copying 3 resources
[INFO] 
[INFO] --- maven-compiler-plugin:2.0.2:testCompile (default-testCompile) @ hbase-hadoop1-compat
---
[INFO] Compiling 2 source files to /x1/jenkins/jenkins-slave/workspace/HBase-TRUNK/trunk/hbase-hadoop1-compat/target/test-classes
[INFO] 
[INFO] --- maven-surefire-plugin:2.12-TRUNK-HBASE-2:test (default-test) @ hbase-hadoop1-compat
---
[INFO] Surefire report directory: /x1/jenkins/jenkins-slave/workspace/HBase-TRUNK/trunk/hbase-hadoop1-compat/target/surefire-reports
[INFO] Using configured provider org.apache.maven.surefire.junitcore.JUnitCoreProvider

-------------------------------------------------------
 T E S T S
-------------------------------------------------------
Running org.apache.hadoop.hbase.metrics.BaseMetricsSourceImplTest
Tests run: 6, Failures: 0, Errors: 0, Skipped: 0, Time elapsed: 0.003 sec
Running org.apache.hadoop.hbase.replication.regionserver.metrics.ReplicationMetricsSourceImplTest
Tests run: 1, Failures: 0, Errors: 0, Skipped: 0, Time elapsed: 0.266 sec

Results :

Tests run: 7, Failures: 0, Errors: 0, Skipped: 0

[INFO] 
[INFO] --- maven-surefire-plugin:2.12-TRUNK-HBASE-2:test (secondPartTestsExecution) @ hbase-hadoop1-compat
---
[INFO] Tests are skipped.
[INFO] 
[INFO] --- maven-jar-plugin:2.3:test-jar (default) @ hbase-hadoop1-compat ---
[INFO] Building jar: /x1/jenkins/jenkins-slave/workspace/HBase-TRUNK/trunk/hbase-hadoop1-compat/target/hbase-hadoop1-compat-0.95-SNAPSHOT-tests.jar
[INFO] 
[INFO] --- maven-jar-plugin:2.3:jar (default-jar) @ hbase-hadoop1-compat ---
[INFO] Building jar: /x1/jenkins/jenkins-slave/workspace/HBase-TRUNK/trunk/hbase-hadoop1-compat/target/hbase-hadoop1-compat-0.95-SNAPSHOT.jar
[INFO] 
[INFO] --- apache-rat-plugin:0.8:check (default) @ hbase-hadoop1-compat ---
[INFO] Exclude: **/.*
[INFO] Exclude: **/*.tgz
[INFO] Exclude: **/*.orig
[INFO] Exclude: **/test/**
[INFO] Exclude: **/8e8ab58dcf39412da19833fcd8f687ac
[INFO] Exclude: **/.git/**
[INFO] Exclude: **/.idea/**
[INFO] Exclude: **/target/**
[INFO] Exclude: **/CHANGES.txt
[INFO] Exclude: **/generated/**
[INFO] Exclude: **/conf/*
[INFO] Exclude: **/*.avpr
[INFO] Exclude: **/*.svg
[INFO] Exclude: **/*.vm
[INFO] Exclude: **/control
[INFO] Exclude: **/conffile
[INFO] Exclude: docs/*
[INFO] Exclude: **/src/site/resources/css/freebsd_docbook.css
[INFO]                                                                         
[INFO] ------------------------------------------------------------------------
[INFO] Skipping HBase
[INFO] This project has been banned from the build due to previous failures.
[INFO] ------------------------------------------------------------------------
[INFO]                                                                         
[INFO] ------------------------------------------------------------------------
[INFO] Skipping HBase
[INFO] This project has been banned from the build due to previous failures.
[INFO] ------------------------------------------------------------------------
[INFO] ------------------------------------------------------------------------
[INFO] Reactor Summary:
[INFO] 
[INFO] HBase ............................................. SUCCESS [5.485s]
[INFO] HBase - Common .................................... SUCCESS [4.925s]
[INFO] HBase - Hadoop Compatibility ...................... SUCCESS [0.995s]
[INFO] HBase - Hadoop One Compatibility .................. FAILURE [1.634s]
[INFO] HBase - Server .................................... SKIPPED
[INFO] HBase - Hadoop Two Compatibility .................. SKIPPED
[INFO] HBase - Integration Tests ......................... SKIPPED
[INFO] ------------------------------------------------------------------------
[INFO] BUILD FAILURE
[INFO] ------------------------------------------------------------------------
[INFO] Total time: 13.601s
[INFO] Finished at: Tue Jul 17 22:12:48 UTC 2012
[INFO] Final Memory: 40M/159M
[INFO] ------------------------------------------------------------------------
[ERROR] Failed to execute goal org.apache.rat:apache-rat-plugin:0.8:check (default) on project
hbase-hadoop1-compat: Too many unapproved licenses: 1 -> [Help 1]
[ERROR] 
[ERROR] To see the full stack trace of the errors, re-run Maven with the -e switch.
[ERROR] Re-run Maven using the -X switch to enable full debug logging.
[ERROR] 
[ERROR] For more information about the errors and possible solutions, please read the following
articles:
[ERROR] [Help 1] http://cwiki.apache.org/confluence/display/MAVEN/MojoFailureException
[ERROR] 
[ERROR] After correcting the problems, you can resume the build with the command
[ERROR]   mvn <goals> -rf :hbase-hadoop1-compat
Build step 'Invoke top-level Maven targets' marked build as failure
Archiving artifacts
Recording test results
Updating HBASE-6405

Mime
View raw message