hbase-dev mailing list archives

Site index · List index
Message view « Date » · « Thread »
Top « Date » · « Thread »
From Apache Jenkins Server <jenk...@builds.apache.org>
Subject Build failed in Jenkins: HBase-0.94-security #44
Date Fri, 20 Jul 2012 22:53:35 GMT
See <https://builds.apache.org/job/HBase-0.94-security/44/changes>

Changes:

[jxiang] HBASE-5966 MapReduce based tests broken on Hadoop 2.0.0-alpha (Gregory Chanan)

[jdcryans] HBASE-6319  ReplicationSource can call terminate on itself and deadlock
HBASE-6325  [replication] Race in ReplicationSourceManager.init can initiate a failover even
if the node is alive

[jxiang] HBASE-5985 TestMetaMigrationRemovingHTD failed with HADOOP 2.0.0

[tedyu] HBASE-4956 Control direct memory buffer consumption by HBaseClient (Bob Copeland)

[jxiang] HBASE-6420 Gracefully shutdown logsyncer

[larsh] HBASE-6406 Remove TestReplicationPeer

[larsh] HBASE-6426 Add Hadoop 2.0.x profile to 0.92+

[jxiang] HBASE-6392 UnknownRegionException blocks hbck from sideline big overlap regions

[larsh] HBASE-6389 revert

[larsh] Latest CHANGES.txt for 0.94.1

[larsh] HBASE-6382 Upgrade Jersey to 1.8 to match Hadoop 1 and 2 (David S. Wang)

[larsh] Latest CHANGES.txt for 0.94.1

[jxiang] HBASE-6397 [hbck] print out bulk load commands for sidelined regions if necessary

------------------------------------------
[...truncated 7305 lines...]
Running org.apache.hadoop.hbase.util.TestIdLock
Tests run: 1, Failures: 0, Errors: 0, Skipped: 0, Time elapsed: 15.292 sec
Forking command line: /bin/sh -c cd <https://builds.apache.org/job/HBase-0.94-security/ws/trunk>
&& /home/hudson/tools/java/jdk1.6.0_27-32/jre/bin/java -enableassertions -Xmx1900m
-Djava.security.egd=file:/dev/./urandom -jar <https://builds.apache.org/job/HBase-0.94-security/ws/trunk/target/surefire/surefirebooter5204009218920758472.jar>
<https://builds.apache.org/job/HBase-0.94-security/ws/trunk/target/surefire/surefire684362074640868749tmp>
<https://builds.apache.org/job/HBase-0.94-security/ws/trunk/target/surefire/surefire_671114966057919864823tmp>
Running org.apache.hadoop.hbase.util.TestDefaultEnvironmentEdge
Tests run: 1, Failures: 0, Errors: 0, Skipped: 0, Time elapsed: 0.199 sec
Forking command line: /bin/sh -c cd <https://builds.apache.org/job/HBase-0.94-security/ws/trunk>
&& /home/hudson/tools/java/jdk1.6.0_27-32/jre/bin/java -enableassertions -Xmx1900m
-Djava.security.egd=file:/dev/./urandom -jar <https://builds.apache.org/job/HBase-0.94-security/ws/trunk/target/surefire/surefirebooter6297317764215550886.jar>
<https://builds.apache.org/job/HBase-0.94-security/ws/trunk/target/surefire/surefire1038751482864820866tmp>
<https://builds.apache.org/job/HBase-0.94-security/ws/trunk/target/surefire/surefire_682404021919103607107tmp>
Running org.apache.hadoop.hbase.util.TestFSTableDescriptors
Tests run: 10, Failures: 0, Errors: 0, Skipped: 0, Time elapsed: 0.925 sec
Forking command line: /bin/sh -c cd <https://builds.apache.org/job/HBase-0.94-security/ws/trunk>
&& /home/hudson/tools/java/jdk1.6.0_27-32/jre/bin/java -enableassertions -Xmx1900m
-Djava.security.egd=file:/dev/./urandom -jar <https://builds.apache.org/job/HBase-0.94-security/ws/trunk/target/surefire/surefirebooter3267809000884377194.jar>
<https://builds.apache.org/job/HBase-0.94-security/ws/trunk/target/surefire/surefire9148514976473406069tmp>
<https://builds.apache.org/job/HBase-0.94-security/ws/trunk/target/surefire/surefire_698439805819435048628tmp>
Running org.apache.hadoop.hbase.util.TestEnvironmentEdgeManager
Tests run: 2, Failures: 0, Errors: 0, Skipped: 0, Time elapsed: 0.356 sec
Forking command line: /bin/sh -c cd <https://builds.apache.org/job/HBase-0.94-security/ws/trunk>
&& /home/hudson/tools/java/jdk1.6.0_27-32/jre/bin/java -enableassertions -Xmx1900m
-Djava.security.egd=file:/dev/./urandom -jar <https://builds.apache.org/job/HBase-0.94-security/ws/trunk/target/surefire/surefirebooter886722795536154187.jar>
<https://builds.apache.org/job/HBase-0.94-security/ws/trunk/target/surefire/surefire6081030346266596948tmp>
<https://builds.apache.org/job/HBase-0.94-security/ws/trunk/target/surefire/surefire_70348853874018745761tmp>
Running org.apache.hadoop.hbase.util.TestRegionSplitter
Tests run: 5, Failures: 0, Errors: 0, Skipped: 0, Time elapsed: 36.551 sec
Forking command line: /bin/sh -c cd <https://builds.apache.org/job/HBase-0.94-security/ws/trunk>
&& /home/hudson/tools/java/jdk1.6.0_27-32/jre/bin/java -enableassertions -Xmx1900m
-Djava.security.egd=file:/dev/./urandom -jar <https://builds.apache.org/job/HBase-0.94-security/ws/trunk/target/surefire/surefirebooter4947355852086834985.jar>
<https://builds.apache.org/job/HBase-0.94-security/ws/trunk/target/surefire/surefire3101681348502738753tmp>
<https://builds.apache.org/job/HBase-0.94-security/ws/trunk/target/surefire/surefire_718626358042972260186tmp>
Running org.apache.hadoop.hbase.regionserver.TestStoreFileBlockCacheSummary
Tests run: 1, Failures: 0, Errors: 0, Skipped: 0, Time elapsed: 19.096 sec
Forking command line: /bin/sh -c cd <https://builds.apache.org/job/HBase-0.94-security/ws/trunk>
&& /home/hudson/tools/java/jdk1.6.0_27-32/jre/bin/java -enableassertions -Xmx1900m
-Djava.security.egd=file:/dev/./urandom -jar <https://builds.apache.org/job/HBase-0.94-security/ws/trunk/target/surefire/surefirebooter7090545589367951992.jar>
<https://builds.apache.org/job/HBase-0.94-security/ws/trunk/target/surefire/surefire2810715751443369606tmp>
<https://builds.apache.org/job/HBase-0.94-security/ws/trunk/target/surefire/surefire_72625191610994994390tmp>
Running org.apache.hadoop.hbase.regionserver.TestStore
Tests run: 12, Failures: 0, Errors: 0, Skipped: 0, Time elapsed: 9.425 sec
Forking command line: /bin/sh -c cd <https://builds.apache.org/job/HBase-0.94-security/ws/trunk>
&& /home/hudson/tools/java/jdk1.6.0_27-32/jre/bin/java -enableassertions -Xmx1900m
-Djava.security.egd=file:/dev/./urandom -jar <https://builds.apache.org/job/HBase-0.94-security/ws/trunk/target/surefire/surefirebooter923414843843459630.jar>
<https://builds.apache.org/job/HBase-0.94-security/ws/trunk/target/surefire/surefire4617461828136644352tmp>
<https://builds.apache.org/job/HBase-0.94-security/ws/trunk/target/surefire/surefire_73532125269752666817tmp>
Running org.apache.hadoop.hbase.regionserver.TestRegionServerMetrics
Tests run: 3, Failures: 0, Errors: 0, Skipped: 0, Time elapsed: 65.334 sec
Forking command line: /bin/sh -c cd <https://builds.apache.org/job/HBase-0.94-security/ws/trunk>
&& /home/hudson/tools/java/jdk1.6.0_27-32/jre/bin/java -enableassertions -Xmx1900m
-Djava.security.egd=file:/dev/./urandom -jar <https://builds.apache.org/job/HBase-0.94-security/ws/trunk/target/surefire/surefirebooter2992067973007607597.jar>
<https://builds.apache.org/job/HBase-0.94-security/ws/trunk/target/surefire/surefire7644599325696836825tmp>
<https://builds.apache.org/job/HBase-0.94-security/ws/trunk/target/surefire/surefire_743196331361252484481tmp>
Running org.apache.hadoop.hbase.regionserver.handler.TestOpenRegionHandler
Tests run: 3, Failures: 0, Errors: 0, Skipped: 0, Time elapsed: 1.245 sec
Forking command line: /bin/sh -c cd <https://builds.apache.org/job/HBase-0.94-security/ws/trunk>
&& /home/hudson/tools/java/jdk1.6.0_27-32/jre/bin/java -enableassertions -Xmx1900m
-Djava.security.egd=file:/dev/./urandom -jar <https://builds.apache.org/job/HBase-0.94-security/ws/trunk/target/surefire/surefirebooter3456005833990982316.jar>
<https://builds.apache.org/job/HBase-0.94-security/ws/trunk/target/surefire/surefire762961337916529036tmp>
<https://builds.apache.org/job/HBase-0.94-security/ws/trunk/target/surefire/surefire_755395414931368929535tmp>
Running org.apache.hadoop.hbase.regionserver.handler.TestCloseRegionHandler
Tests run: 3, Failures: 0, Errors: 0, Skipped: 0, Time elapsed: 1.619 sec
Forking command line: /bin/sh -c cd <https://builds.apache.org/job/HBase-0.94-security/ws/trunk>
&& /home/hudson/tools/java/jdk1.6.0_27-32/jre/bin/java -enableassertions -Xmx1900m
-Djava.security.egd=file:/dev/./urandom -jar <https://builds.apache.org/job/HBase-0.94-security/ws/trunk/target/surefire/surefirebooter4357689798354448018.jar>
<https://builds.apache.org/job/HBase-0.94-security/ws/trunk/target/surefire/surefire3758414616850150172tmp>
<https://builds.apache.org/job/HBase-0.94-security/ws/trunk/target/surefire/surefire_762022922417571792626tmp>
Running org.apache.hadoop.hbase.regionserver.TestParallelPut
Tests run: 2, Failures: 0, Errors: 0, Skipped: 0, Time elapsed: 4.652 sec
Forking command line: /bin/sh -c cd <https://builds.apache.org/job/HBase-0.94-security/ws/trunk>
&& /home/hudson/tools/java/jdk1.6.0_27-32/jre/bin/java -enableassertions -Xmx1900m
-Djava.security.egd=file:/dev/./urandom -jar <https://builds.apache.org/job/HBase-0.94-security/ws/trunk/target/surefire/surefirebooter1018877363929067731.jar>
<https://builds.apache.org/job/HBase-0.94-security/ws/trunk/target/surefire/surefire3496855893247558648tmp>
<https://builds.apache.org/job/HBase-0.94-security/ws/trunk/target/surefire/surefire_771890645223907057395tmp>
Running org.apache.hadoop.hbase.regionserver.TestServerCustomProtocol
Tests run: 7, Failures: 0, Errors: 0, Skipped: 0, Time elapsed: 15.346 sec
Forking command line: /bin/sh -c cd <https://builds.apache.org/job/HBase-0.94-security/ws/trunk>
&& /home/hudson/tools/java/jdk1.6.0_27-32/jre/bin/java -enableassertions -Xmx1900m
-Djava.security.egd=file:/dev/./urandom -jar <https://builds.apache.org/job/HBase-0.94-security/ws/trunk/target/surefire/surefirebooter2799396766915263501.jar>
<https://builds.apache.org/job/HBase-0.94-security/ws/trunk/target/surefire/surefire7555062704438250153tmp>
<https://builds.apache.org/job/HBase-0.94-security/ws/trunk/target/surefire/surefire_787352191380372485896tmp>
Running org.apache.hadoop.hbase.regionserver.TestHRegionOnCluster
Tests run: 1, Failures: 0, Errors: 0, Skipped: 0, Time elapsed: 26.953 sec
Forking command line: /bin/sh -c cd <https://builds.apache.org/job/HBase-0.94-security/ws/trunk>
&& /home/hudson/tools/java/jdk1.6.0_27-32/jre/bin/java -enableassertions -Xmx1900m
-Djava.security.egd=file:/dev/./urandom -jar <https://builds.apache.org/job/HBase-0.94-security/ws/trunk/target/surefire/surefirebooter2757715221758020425.jar>
<https://builds.apache.org/job/HBase-0.94-security/ws/trunk/target/surefire/surefire4468782548838092698tmp>
<https://builds.apache.org/job/HBase-0.94-security/ws/trunk/target/surefire/surefire_79260149083754466035tmp>
Running org.apache.hadoop.hbase.regionserver.TestAtomicOperation
Tests run: 5, Failures: 1, Errors: 0, Skipped: 0, Time elapsed: 12.838 sec <<< FAILURE!
Forking command line: /bin/sh -c cd <https://builds.apache.org/job/HBase-0.94-security/ws/trunk>
&& /home/hudson/tools/java/jdk1.6.0_27-32/jre/bin/java -enableassertions -Xmx1900m
-Djava.security.egd=file:/dev/./urandom -jar <https://builds.apache.org/job/HBase-0.94-security/ws/trunk/target/surefire/surefirebooter8973910063994601449.jar>
<https://builds.apache.org/job/HBase-0.94-security/ws/trunk/target/surefire/surefire720293594084512976tmp>
<https://builds.apache.org/job/HBase-0.94-security/ws/trunk/target/surefire/surefire_806173894349677890871tmp>
Running org.apache.hadoop.hbase.regionserver.TestBlocksRead
Tests run: 4, Failures: 0, Errors: 0, Skipped: 0, Time elapsed: 0.988 sec
Forking command line: /bin/sh -c cd <https://builds.apache.org/job/HBase-0.94-security/ws/trunk>
&& /home/hudson/tools/java/jdk1.6.0_27-32/jre/bin/java -enableassertions -Xmx1900m
-Djava.security.egd=file:/dev/./urandom -jar <https://builds.apache.org/job/HBase-0.94-security/ws/trunk/target/surefire/surefirebooter8196189936984098730.jar>
<https://builds.apache.org/job/HBase-0.94-security/ws/trunk/target/surefire/surefire8508470140626902360tmp>
<https://builds.apache.org/job/HBase-0.94-security/ws/trunk/target/surefire/surefire_811301328292096723463tmp>
Running org.apache.hadoop.hbase.regionserver.TestMasterAddressManager
Tests run: 1, Failures: 0, Errors: 0, Skipped: 0, Time elapsed: 0.676 sec
Forking command line: /bin/sh -c cd <https://builds.apache.org/job/HBase-0.94-security/ws/trunk>
&& /home/hudson/tools/java/jdk1.6.0_27-32/jre/bin/java -enableassertions -Xmx1900m
-Djava.security.egd=file:/dev/./urandom -jar <https://builds.apache.org/job/HBase-0.94-security/ws/trunk/target/surefire/surefirebooter5793834424829986944.jar>
<https://builds.apache.org/job/HBase-0.94-security/ws/trunk/target/surefire/surefire8222561854392441950tmp>
<https://builds.apache.org/job/HBase-0.94-security/ws/trunk/target/surefire/surefire_825828777156450967596tmp>
Running org.apache.hadoop.hbase.util.TestHBaseFsck
Tests run: 22, Failures: 0, Errors: 0, Skipped: 0, Time elapsed: 234.38 sec
Forking command line: /bin/sh -c cd <https://builds.apache.org/job/HBase-0.94-security/ws/trunk>
&& /home/hudson/tools/java/jdk1.6.0_27-32/jre/bin/java -enableassertions -Xmx1900m
-Djava.security.egd=file:/dev/./urandom -jar <https://builds.apache.org/job/HBase-0.94-security/ws/trunk/target/surefire/surefirebooter5095087500684980595.jar>
<https://builds.apache.org/job/HBase-0.94-security/ws/trunk/target/surefire/surefire5524657888944903366tmp>
<https://builds.apache.org/job/HBase-0.94-security/ws/trunk/target/surefire/surefire_834387042043400017951tmp>
Running org.apache.hadoop.hbase.regionserver.wal.TestWALReplayCompressed
Tests run: 6, Failures: 0, Errors: 0, Skipped: 0, Time elapsed: 41.051 sec
Running org.apache.hadoop.hbase.regionserver.wal.TestWALReplay
Tests run: 6, Failures: 0, Errors: 0, Skipped: 0, Time elapsed: 41.313 sec
Forking command line: /bin/sh -c cd <https://builds.apache.org/job/HBase-0.94-security/ws/trunk>
&& /home/hudson/tools/java/jdk1.6.0_27-32/jre/bin/java -enableassertions -Xmx1900m
-Djava.security.egd=file:/dev/./urandom -jar <https://builds.apache.org/job/HBase-0.94-security/ws/trunk/target/surefire/surefirebooter4460045488573291060.jar>
<https://builds.apache.org/job/HBase-0.94-security/ws/trunk/target/surefire/surefire2417307923175366886tmp>
<https://builds.apache.org/job/HBase-0.94-security/ws/trunk/target/surefire/surefire_848173264066562324948tmp>
Running org.apache.hadoop.hbase.regionserver.wal.TestLogRollingNoCluster
Tests run: 1, Failures: 0, Errors: 0, Skipped: 0, Time elapsed: 2.07 sec
Forking command line: /bin/sh -c cd <https://builds.apache.org/job/HBase-0.94-security/ws/trunk>
&& /home/hudson/tools/java/jdk1.6.0_27-32/jre/bin/java -enableassertions -Xmx1900m
-Djava.security.egd=file:/dev/./urandom -jar <https://builds.apache.org/job/HBase-0.94-security/ws/trunk/target/surefire/surefirebooter7209995224678846643.jar>
<https://builds.apache.org/job/HBase-0.94-security/ws/trunk/target/surefire/surefire7291727375612628334tmp>
<https://builds.apache.org/job/HBase-0.94-security/ws/trunk/target/surefire/surefire_852051679042933393267tmp>
Running org.apache.hadoop.hbase.regionserver.wal.TestHLogBench
Tests run: 1, Failures: 0, Errors: 0, Skipped: 0, Time elapsed: 1.276 sec
Forking command line: /bin/sh -c cd <https://builds.apache.org/job/HBase-0.94-security/ws/trunk>
&& /home/hudson/tools/java/jdk1.6.0_27-32/jre/bin/java -enableassertions -Xmx1900m
-Djava.security.egd=file:/dev/./urandom -jar <https://builds.apache.org/job/HBase-0.94-security/ws/trunk/target/surefire/surefirebooter6620003518365964794.jar>
<https://builds.apache.org/job/HBase-0.94-security/ws/trunk/target/surefire/surefire8944885254691275366tmp>
<https://builds.apache.org/job/HBase-0.94-security/ws/trunk/target/surefire/surefire_866064175210981375114tmp>
Forking command line: /bin/sh -c cd <https://builds.apache.org/job/HBase-0.94-security/ws/trunk>
&& /home/hudson/tools/java/jdk1.6.0_27-32/jre/bin/java -enableassertions -Xmx1900m
-Djava.security.egd=file:/dev/./urandom -jar <https://builds.apache.org/job/HBase-0.94-security/ws/trunk/target/surefire/surefirebooter4939500033469305138.jar>
<https://builds.apache.org/job/HBase-0.94-security/ws/trunk/target/surefire/surefire7009429747902352897tmp>
<https://builds.apache.org/job/HBase-0.94-security/ws/trunk/target/surefire/surefire_872995113937646751712tmp>
Running org.apache.hadoop.hbase.regionserver.metrics.TestSchemaMetrics
Tests run: 6, Failures: 0, Errors: 0, Skipped: 0, Time elapsed: 15.01 sec
Forking command line: /bin/sh -c cd <https://builds.apache.org/job/HBase-0.94-security/ws/trunk>
&& /home/hudson/tools/java/jdk1.6.0_27-32/jre/bin/java -enableassertions -Xmx1900m
-Djava.security.egd=file:/dev/./urandom -jar <https://builds.apache.org/job/HBase-0.94-security/ws/trunk/target/surefire/surefirebooter7139400699176230153.jar>
<https://builds.apache.org/job/HBase-0.94-security/ws/trunk/target/surefire/surefire1972984695834341180tmp>
<https://builds.apache.org/job/HBase-0.94-security/ws/trunk/target/surefire/surefire_882854879941040690624tmp>
Running org.apache.hadoop.hbase.regionserver.TestRpcMetrics
Tests run: 1, Failures: 0, Errors: 0, Skipped: 0, Time elapsed: 1.753 sec
Forking command line: /bin/sh -c cd <https://builds.apache.org/job/HBase-0.94-security/ws/trunk>
&& /home/hudson/tools/java/jdk1.6.0_27-32/jre/bin/java -enableassertions -Xmx1900m
-Djava.security.egd=file:/dev/./urandom -jar <https://builds.apache.org/job/HBase-0.94-security/ws/trunk/target/surefire/surefirebooter6911044336807259260.jar>
<https://builds.apache.org/job/HBase-0.94-security/ws/trunk/target/surefire/surefire6386107136466932838tmp>
<https://builds.apache.org/job/HBase-0.94-security/ws/trunk/target/surefire/surefire_893593258630375398635tmp>
Running org.apache.hadoop.hbase.regionserver.TestStoreScanner
Tests run: 16, Failures: 0, Errors: 0, Skipped: 0, Time elapsed: 0.052 sec
Forking command line: /bin/sh -c cd <https://builds.apache.org/job/HBase-0.94-security/ws/trunk>
&& /home/hudson/tools/java/jdk1.6.0_27-32/jre/bin/java -enableassertions -Xmx1900m
-Djava.security.egd=file:/dev/./urandom -jar <https://builds.apache.org/job/HBase-0.94-security/ws/trunk/target/surefire/surefirebooter4089054681329876666.jar>
<https://builds.apache.org/job/HBase-0.94-security/ws/trunk/target/surefire/surefire7232659348634566837tmp>
<https://builds.apache.org/job/HBase-0.94-security/ws/trunk/target/surefire/surefire_90653812554162884187tmp>
Running org.apache.hadoop.hbase.regionserver.TestCacheOnWriteInSchema
Tests run: 3, Failures: 0, Errors: 0, Skipped: 0, Time elapsed: 1.562 sec
Forking command line: /bin/sh -c cd <https://builds.apache.org/job/HBase-0.94-security/ws/trunk>
&& /home/hudson/tools/java/jdk1.6.0_27-32/jre/bin/java -enableassertions -Xmx1900m
-Djava.security.egd=file:/dev/./urandom -jar <https://builds.apache.org/job/HBase-0.94-security/ws/trunk/target/surefire/surefirebooter2441218360958150283.jar>
<https://builds.apache.org/job/HBase-0.94-security/ws/trunk/target/surefire/surefire7821182038732810631tmp>
<https://builds.apache.org/job/HBase-0.94-security/ws/trunk/target/surefire/surefire_91205021933990606001tmp>
Running org.apache.hadoop.hbase.regionserver.TestSeekOptimizations
Tests run: 6, Failures: 0, Errors: 0, Skipped: 0, Time elapsed: 2.746 sec
Forking command line: /bin/sh -c cd <https://builds.apache.org/job/HBase-0.94-security/ws/trunk>
&& /home/hudson/tools/java/jdk1.6.0_27-32/jre/bin/java -enableassertions -Xmx1900m
-Djava.security.egd=file:/dev/./urandom -jar <https://builds.apache.org/job/HBase-0.94-security/ws/trunk/target/surefire/surefirebooter6646924839067344695.jar>
<https://builds.apache.org/job/HBase-0.94-security/ws/trunk/target/surefire/surefire2234463299598593227tmp>
<https://builds.apache.org/job/HBase-0.94-security/ws/trunk/target/surefire/surefire_92391636958075994103tmp>
Running org.apache.hadoop.hbase.regionserver.TestFSErrorsExposed
Tests run: 3, Failures: 0, Errors: 0, Skipped: 0, Time elapsed: 29.105 sec
Forking command line: /bin/sh -c cd <https://builds.apache.org/job/HBase-0.94-security/ws/trunk>
&& /home/hudson/tools/java/jdk1.6.0_27-32/jre/bin/java -enableassertions -Xmx1900m
-Djava.security.egd=file:/dev/./urandom -jar <https://builds.apache.org/job/HBase-0.94-security/ws/trunk/target/surefire/surefirebooter5361487863506251107.jar>
<https://builds.apache.org/job/HBase-0.94-security/ws/trunk/target/surefire/surefire36777397606086678tmp>
<https://builds.apache.org/job/HBase-0.94-security/ws/trunk/target/surefire/surefire_93560833334832591809tmp>
Running org.apache.hadoop.hbase.regionserver.TestSplitLogWorker
Tests run: 5, Failures: 0, Errors: 0, Skipped: 0, Time elapsed: 2.639 sec
Forking command line: /bin/sh -c cd <https://builds.apache.org/job/HBase-0.94-security/ws/trunk>
&& /home/hudson/tools/java/jdk1.6.0_27-32/jre/bin/java -enableassertions -Xmx1900m
-Djava.security.egd=file:/dev/./urandom -jar <https://builds.apache.org/job/HBase-0.94-security/ws/trunk/target/surefire/surefirebooter8508718689383900639.jar>
<https://builds.apache.org/job/HBase-0.94-security/ws/trunk/target/surefire/surefire1716515368286193520tmp>
<https://builds.apache.org/job/HBase-0.94-security/ws/trunk/target/surefire/surefire_942905092280674111021tmp>
Running org.apache.hadoop.hbase.regionserver.TestMultiColumnScanner
Tests run: 12, Failures: 0, Errors: 0, Skipped: 0, Time elapsed: 41.182 sec
Forking command line: /bin/sh -c cd <https://builds.apache.org/job/HBase-0.94-security/ws/trunk>
&& /home/hudson/tools/java/jdk1.6.0_27-32/jre/bin/java -enableassertions -Xmx1900m
-Djava.security.egd=file:/dev/./urandom -jar <https://builds.apache.org/job/HBase-0.94-security/ws/trunk/target/surefire/surefirebooter6931417876282062201.jar>
<https://builds.apache.org/job/HBase-0.94-security/ws/trunk/target/surefire/surefire7818209735947392015tmp>
<https://builds.apache.org/job/HBase-0.94-security/ws/trunk/target/surefire/surefire_954130270812844651354tmp>
Running org.apache.hadoop.hbase.regionserver.wal.TestLogRollAbort
Tests run: 1, Failures: 0, Errors: 0, Skipped: 0, Time elapsed: 166.612 sec
Forking command line: /bin/sh -c cd <https://builds.apache.org/job/HBase-0.94-security/ws/trunk>
&& /home/hudson/tools/java/jdk1.6.0_27-32/jre/bin/java -enableassertions -Xmx1900m
-Djava.security.egd=file:/dev/./urandom -jar <https://builds.apache.org/job/HBase-0.94-security/ws/trunk/target/surefire/surefirebooter6890563861862441794.jar>
<https://builds.apache.org/job/HBase-0.94-security/ws/trunk/target/surefire/surefire2270662083171882086tmp>
<https://builds.apache.org/job/HBase-0.94-security/ws/trunk/target/surefire/surefire_968106774109045007000tmp>
Running org.apache.hadoop.hbase.client.replication.TestReplicationAdmin
Tests run: 1, Failures: 0, Errors: 0, Skipped: 0, Time elapsed: 1.023 sec
Forking command line: /bin/sh -c cd <https://builds.apache.org/job/HBase-0.94-security/ws/trunk>
&& /home/hudson/tools/java/jdk1.6.0_27-32/jre/bin/java -enableassertions -Xmx1900m
-Djava.security.egd=file:/dev/./urandom -jar <https://builds.apache.org/job/HBase-0.94-security/ws/trunk/target/surefire/surefirebooter5342120672299043351.jar>
<https://builds.apache.org/job/HBase-0.94-security/ws/trunk/target/surefire/surefire4502638089356568924tmp>
<https://builds.apache.org/job/HBase-0.94-security/ws/trunk/target/surefire/surefire_978652651992516786438tmp>
Running org.apache.hadoop.hbase.regionserver.TestHRegion
Tests run: 66, Failures: 0, Errors: 0, Skipped: 0, Time elapsed: 45.908 sec
Forking command line: /bin/sh -c cd <https://builds.apache.org/job/HBase-0.94-security/ws/trunk>
&& /home/hudson/tools/java/jdk1.6.0_27-32/jre/bin/java -enableassertions -Xmx1900m
-Djava.security.egd=file:/dev/./urandom -jar <https://builds.apache.org/job/HBase-0.94-security/ws/trunk/target/surefire/surefirebooter734671340632978640.jar>
<https://builds.apache.org/job/HBase-0.94-security/ws/trunk/target/surefire/surefire5974630899855557684tmp>
<https://builds.apache.org/job/HBase-0.94-security/ws/trunk/target/surefire/surefire_981218703662882734471tmp>
Running org.apache.hadoop.hbase.client.TestTimestampsFilter
Tests run: 3, Failures: 0, Errors: 0, Skipped: 0, Time elapsed: 25.449 sec
Forking command line: /bin/sh -c cd <https://builds.apache.org/job/HBase-0.94-security/ws/trunk>
&& /home/hudson/tools/java/jdk1.6.0_27-32/jre/bin/java -enableassertions -Xmx1900m
-Djava.security.egd=file:/dev/./urandom -jar <https://builds.apache.org/job/HBase-0.94-security/ws/trunk/target/surefire/surefirebooter5840662296683884375.jar>
<https://builds.apache.org/job/HBase-0.94-security/ws/trunk/target/surefire/surefire3897611807409445355tmp>
<https://builds.apache.org/job/HBase-0.94-security/ws/trunk/target/surefire/surefire_992103011739599376840tmp>
Running org.apache.hadoop.hbase.client.TestHCM
Tests run: 6, Failures: 0, Errors: 0, Skipped: 0, Time elapsed: 22.739 sec
Forking command line: /bin/sh -c cd <https://builds.apache.org/job/HBase-0.94-security/ws/trunk>
&& /home/hudson/tools/java/jdk1.6.0_27-32/jre/bin/java -enableassertions -Xmx1900m
-Djava.security.egd=file:/dev/./urandom -jar <https://builds.apache.org/job/HBase-0.94-security/ws/trunk/target/surefire/surefirebooter1308975242329436387.jar>
<https://builds.apache.org/job/HBase-0.94-security/ws/trunk/target/surefire/surefire2105813860952730983tmp>
<https://builds.apache.org/job/HBase-0.94-security/ws/trunk/target/surefire/surefire_1006786432706408638110tmp>
Running org.apache.hadoop.hbase.client.TestHTablePool$TestHTableReusablePool
Tests run: 9, Failures: 0, Errors: 0, Skipped: 0, Time elapsed: 6.164 sec
Running org.apache.hadoop.hbase.client.TestHTableUtil
Tests run: 2, Failures: 0, Errors: 0, Skipped: 0, Time elapsed: 18.542 sec
Forking command line: /bin/sh -c cd <https://builds.apache.org/job/HBase-0.94-security/ws/trunk>
&& /home/hudson/tools/java/jdk1.6.0_27-32/jre/bin/java -enableassertions -Xmx1900m
-Djava.security.egd=file:/dev/./urandom -jar <https://builds.apache.org/job/HBase-0.94-security/ws/trunk/target/surefire/surefirebooter7491382201934293408.jar>
<https://builds.apache.org/job/HBase-0.94-security/ws/trunk/target/surefire/surefire3762237700134803737tmp>
<https://builds.apache.org/job/HBase-0.94-security/ws/trunk/target/surefire/surefire_101677391176063519146tmp>
Running org.apache.hadoop.hbase.client.TestHTablePool$TestHTableThreadLocalPool
Tests run: 9, Failures: 0, Errors: 0, Skipped: 0, Time elapsed: 27.465 sec
Forking command line: /bin/sh -c cd <https://builds.apache.org/job/HBase-0.94-security/ws/trunk>
&& /home/hudson/tools/java/jdk1.6.0_27-32/jre/bin/java -enableassertions -Xmx1900m
-Djava.security.egd=file:/dev/./urandom -jar <https://builds.apache.org/job/HBase-0.94-security/ws/trunk/target/surefire/surefirebooter6630110757165571440.jar>
<https://builds.apache.org/job/HBase-0.94-security/ws/trunk/target/surefire/surefire5199838623569725145tmp>
<https://builds.apache.org/job/HBase-0.94-security/ws/trunk/target/surefire/surefire_1023370359234034185586tmp>
Running org.apache.hadoop.hbase.client.TestMetaScanner
Tests run: 1, Failures: 0, Errors: 0, Skipped: 0, Time elapsed: 16.351 sec
Forking command line: /bin/sh -c cd <https://builds.apache.org/job/HBase-0.94-security/ws/trunk>
&& /home/hudson/tools/java/jdk1.6.0_27-32/jre/bin/java -enableassertions -Xmx1900m
-Djava.security.egd=file:/dev/./urandom -jar <https://builds.apache.org/job/HBase-0.94-security/ws/trunk/target/surefire/surefirebooter1266791276714614250.jar>
<https://builds.apache.org/job/HBase-0.94-security/ws/trunk/target/surefire/surefire5238171983766011743tmp>
<https://builds.apache.org/job/HBase-0.94-security/ws/trunk/target/surefire/surefire_1035499792076866719644tmp>
Running org.apache.hadoop.hbase.client.TestMetaMigrationRemovingHTD
Tests run: 3, Failures: 0, Errors: 0, Skipped: 0, Time elapsed: 27.967 sec
Forking command line: /bin/sh -c cd <https://builds.apache.org/job/HBase-0.94-security/ws/trunk>
&& /home/hudson/tools/java/jdk1.6.0_27-32/jre/bin/java -enableassertions -Xmx1900m
-Djava.security.egd=file:/dev/./urandom -jar <https://builds.apache.org/job/HBase-0.94-security/ws/trunk/target/surefire/surefirebooter3778712246251818491.jar>
<https://builds.apache.org/job/HBase-0.94-security/ws/trunk/target/surefire/surefire8587518051415643582tmp>
<https://builds.apache.org/job/HBase-0.94-security/ws/trunk/target/surefire/surefire_1047608635057761639256tmp>
Running org.apache.hadoop.hbase.client.TestMultiParallel
Tests run: 11, Failures: 0, Errors: 0, Skipped: 0, Time elapsed: 43.164 sec
Forking command line: /bin/sh -c cd <https://builds.apache.org/job/HBase-0.94-security/ws/trunk>
&& /home/hudson/tools/java/jdk1.6.0_27-32/jre/bin/java -enableassertions -Xmx1900m
-Djava.security.egd=file:/dev/./urandom -jar <https://builds.apache.org/job/HBase-0.94-security/ws/trunk/target/surefire/surefirebooter1829972426736024593.jar>
<https://builds.apache.org/job/HBase-0.94-security/ws/trunk/target/surefire/surefire8713985876440631200tmp>
<https://builds.apache.org/job/HBase-0.94-security/ws/trunk/target/surefire/surefire_1051166915080925687434tmp>
Running org.apache.hadoop.hbase.TestMultiVersions
Tests run: 3, Failures: 0, Errors: 0, Skipped: 0, Time elapsed: 28.876 sec
Forking command line: /bin/sh -c cd <https://builds.apache.org/job/HBase-0.94-security/ws/trunk>
&& /home/hudson/tools/java/jdk1.6.0_27-32/jre/bin/java -enableassertions -Xmx1900m
-Djava.security.egd=file:/dev/./urandom -jar <https://builds.apache.org/job/HBase-0.94-security/ws/trunk/target/surefire/surefirebooter8416665118765988033.jar>
<https://builds.apache.org/job/HBase-0.94-security/ws/trunk/target/surefire/surefire5750440735749810772tmp>
<https://builds.apache.org/job/HBase-0.94-security/ws/trunk/target/surefire/surefire_1061261230685066316461tmp>
Running org.apache.hadoop.hbase.master.TestActiveMasterManager
Tests run: 2, Failures: 0, Errors: 0, Skipped: 0, Time elapsed: 1.036 sec
Forking command line: /bin/sh -c cd <https://builds.apache.org/job/HBase-0.94-security/ws/trunk>
&& /home/hudson/tools/java/jdk1.6.0_27-32/jre/bin/java -enableassertions -Xmx1900m
-Djava.security.egd=file:/dev/./urandom -jar <https://builds.apache.org/job/HBase-0.94-security/ws/trunk/target/surefire/surefirebooter7558609282302033871.jar>
<https://builds.apache.org/job/HBase-0.94-security/ws/trunk/target/surefire/surefire5838678234293674102tmp>
<https://builds.apache.org/job/HBase-0.94-security/ws/trunk/target/surefire/surefire_1073081606968263014299tmp>
Running org.apache.hadoop.hbase.master.TestDeadServer
Tests run: 1, Failures: 0, Errors: 0, Skipped: 0, Time elapsed: 0.202 sec
Forking command line: /bin/sh -c cd <https://builds.apache.org/job/HBase-0.94-security/ws/trunk>
&& /home/hudson/tools/java/jdk1.6.0_27-32/jre/bin/java -enableassertions -Xmx1900m
-Djava.security.egd=file:/dev/./urandom -jar <https://builds.apache.org/job/HBase-0.94-security/ws/trunk/target/surefire/surefirebooter3076339155043417714.jar>
<https://builds.apache.org/job/HBase-0.94-security/ws/trunk/target/surefire/surefire752349001966506327tmp>
<https://builds.apache.org/job/HBase-0.94-security/ws/trunk/target/surefire/surefire_1082201704877282284396tmp>
Running org.apache.hadoop.hbase.master.TestLogsCleaner
Tests run: 1, Failures: 0, Errors: 0, Skipped: 0, Time elapsed: 3.274 sec
Forking command line: /bin/sh -c cd <https://builds.apache.org/job/HBase-0.94-security/ws/trunk>
&& /home/hudson/tools/java/jdk1.6.0_27-32/jre/bin/java -enableassertions -Xmx1900m
-Djava.security.egd=file:/dev/./urandom -jar <https://builds.apache.org/job/HBase-0.94-security/ws/trunk/target/surefire/surefirebooter194148670703533971.jar>
<https://builds.apache.org/job/HBase-0.94-security/ws/trunk/target/surefire/surefire2940120770418667522tmp>
<https://builds.apache.org/job/HBase-0.94-security/ws/trunk/target/surefire/surefire_1093055028069787455179tmp>
Running org.apache.hadoop.hbase.master.TestZKBasedOpenCloseRegion
Tests run: 4, Failures: 0, Errors: 0, Skipped: 0, Time elapsed: 24.501 sec
Forking command line: /bin/sh -c cd <https://builds.apache.org/job/HBase-0.94-security/ws/trunk>
&& /home/hudson/tools/java/jdk1.6.0_27-32/jre/bin/java -enableassertions -Xmx1900m
-Djava.security.egd=file:/dev/./urandom -jar <https://builds.apache.org/job/HBase-0.94-security/ws/trunk/target/surefire/surefirebooter7179749365579899994.jar>
<https://builds.apache.org/job/HBase-0.94-security/ws/trunk/target/surefire/surefire8318879817430271022tmp>
<https://builds.apache.org/job/HBase-0.94-security/ws/trunk/target/surefire/surefire_1107588634350463501354tmp>
Running org.apache.hadoop.hbase.thrift.TestThriftServer
Tests run: 1, Failures: 0, Errors: 0, Skipped: 0, Time elapsed: 47.251 sec
Forking command line: /bin/sh -c cd <https://builds.apache.org/job/HBase-0.94-security/ws/trunk>
&& /home/hudson/tools/java/jdk1.6.0_27-32/jre/bin/java -enableassertions -Xmx1900m
-Djava.security.egd=file:/dev/./urandom -jar <https://builds.apache.org/job/HBase-0.94-security/ws/trunk/target/surefire/surefirebooter4010795279204982902.jar>
<https://builds.apache.org/job/HBase-0.94-security/ws/trunk/target/surefire/surefire7361141663895393199tmp>
<https://builds.apache.org/job/HBase-0.94-security/ws/trunk/target/surefire/surefire_1113695910499226191817tmp>
Running org.apache.hadoop.hbase.master.TestMaster
Tests run: 1, Failures: 0, Errors: 0, Skipped: 0, Time elapsed: 18.969 sec
Forking command line: /bin/sh -c cd <https://builds.apache.org/job/HBase-0.94-security/ws/trunk>
&& /home/hudson/tools/java/jdk1.6.0_27-32/jre/bin/java -enableassertions -Xmx1900m
-Djava.security.egd=file:/dev/./urandom -jar <https://builds.apache.org/job/HBase-0.94-security/ws/trunk/target/surefire/surefirebooter2766098690355471320.jar>
<https://builds.apache.org/job/HBase-0.94-security/ws/trunk/target/surefire/surefire8755681598819857569tmp>
<https://builds.apache.org/job/HBase-0.94-security/ws/trunk/target/surefire/surefire_1121789075111267092032tmp>
Running org.apache.hadoop.hbase.master.TestClockSkewDetection
Tests run: 1, Failures: 0, Errors: 0, Skipped: 0, Time elapsed: 0.289 sec
Forking command line: /bin/sh -c cd <https://builds.apache.org/job/HBase-0.94-security/ws/trunk>
&& /home/hudson/tools/java/jdk1.6.0_27-32/jre/bin/java -enableassertions -Xmx1900m
-Djava.security.egd=file:/dev/./urandom -jar <https://builds.apache.org/job/HBase-0.94-security/ws/trunk/target/surefire/surefirebooter3486259376196931001.jar>
<https://builds.apache.org/job/HBase-0.94-security/ws/trunk/target/surefire/surefire3849087690947841392tmp>
<https://builds.apache.org/job/HBase-0.94-security/ws/trunk/target/surefire/surefire_1132138270593886558180tmp>
Running org.apache.hadoop.hbase.master.TestOpenedRegionHandler
Tests run: 2, Failures: 0, Errors: 0, Skipped: 0, Time elapsed: 17.556 sec
Forking command line: /bin/sh -c cd <https://builds.apache.org/job/HBase-0.94-security/ws/trunk>
&& /home/hudson/tools/java/jdk1.6.0_27-32/jre/bin/java -enableassertions -Xmx1900m
-Djava.security.egd=file:/dev/./urandom -jar <https://builds.apache.org/job/HBase-0.94-security/ws/trunk/target/surefire/surefirebooter4538353911274289443.jar>
<https://builds.apache.org/job/HBase-0.94-security/ws/trunk/target/surefire/surefire7062140826928704540tmp>
<https://builds.apache.org/job/HBase-0.94-security/ws/trunk/target/surefire/surefire_1144906776940720979931tmp>
Running org.apache.hadoop.hbase.master.TestDefaultLoadBalancer
Tests run: 4, Failures: 0, Errors: 0, Skipped: 0, Time elapsed: 1.45 sec
Forking command line: /bin/sh -c cd <https://builds.apache.org/job/HBase-0.94-security/ws/trunk>
&& /home/hudson/tools/java/jdk1.6.0_27-32/jre/bin/java -enableassertions -Xmx1900m
-Djava.security.egd=file:/dev/./urandom -jar <https://builds.apache.org/job/HBase-0.94-security/ws/trunk/target/surefire/surefirebooter6364448574458593112.jar>
<https://builds.apache.org/job/HBase-0.94-security/ws/trunk/target/surefire/surefire3135963162974013255tmp>
<https://builds.apache.org/job/HBase-0.94-security/ws/trunk/target/surefire/surefire_1152204472774240252484tmp>
Running org.apache.hadoop.hbase.master.TestMasterStatusServlet
Tests run: 5, Failures: 0, Errors: 0, Skipped: 0, Time elapsed: 1.007 sec
Forking command line: /bin/sh -c cd <https://builds.apache.org/job/HBase-0.94-security/ws/trunk>
&& /home/hudson/tools/java/jdk1.6.0_27-32/jre/bin/java -enableassertions -Xmx1900m
-Djava.security.egd=file:/dev/./urandom -jar <https://builds.apache.org/job/HBase-0.94-security/ws/trunk/target/surefire/surefirebooter2087716491430869722.jar>
<https://builds.apache.org/job/HBase-0.94-security/ws/trunk/target/surefire/surefire9135078861766257294tmp>
<https://builds.apache.org/job/HBase-0.94-security/ws/trunk/target/surefire/surefire_1168474838587047518032tmp>
Running org.apache.hadoop.hbase.master.TestSplitLogManager
Tests run: 12, Failures: 0, Errors: 0, Skipped: 0, Time elapsed: 15.631 sec
Forking command line: /bin/sh -c cd <https://builds.apache.org/job/HBase-0.94-security/ws/trunk>
&& /home/hudson/tools/java/jdk1.6.0_27-32/jre/bin/java -enableassertions -Xmx1900m
-Djava.security.egd=file:/dev/./urandom -jar <https://builds.apache.org/job/HBase-0.94-security/ws/trunk/target/surefire/surefirebooter1554027551578652061.jar>
<https://builds.apache.org/job/HBase-0.94-security/ws/trunk/target/surefire/surefire8407338435488536561tmp>
<https://builds.apache.org/job/HBase-0.94-security/ws/trunk/target/surefire/surefire_1174228306187593118669tmp>
Running org.apache.hadoop.hbase.master.TestHMasterRPCException
Tests run: 1, Failures: 0, Errors: 0, Skipped: 0, Time elapsed: 1.376 sec
Forking command line: /bin/sh -c cd <https://builds.apache.org/job/HBase-0.94-security/ws/trunk>
&& /home/hudson/tools/java/jdk1.6.0_27-32/jre/bin/java -enableassertions -Xmx1900m
-Djava.security.egd=file:/dev/./urandom -jar <https://builds.apache.org/job/HBase-0.94-security/ws/trunk/target/surefire/surefirebooter5519873025786777560.jar>
<https://builds.apache.org/job/HBase-0.94-security/ws/trunk/target/surefire/surefire4326889718129787088tmp>
<https://builds.apache.org/job/HBase-0.94-security/ws/trunk/target/surefire/surefire_1182885858757266422828tmp>
Running org.apache.hadoop.hbase.avro.TestAvroServer
Tests run: 3, Failures: 0, Errors: 0, Skipped: 0, Time elapsed: 32.681 sec
Forking command line: /bin/sh -c cd <https://builds.apache.org/job/HBase-0.94-security/ws/trunk>
&& /home/hudson/tools/java/jdk1.6.0_27-32/jre/bin/java -enableassertions -Xmx1900m
-Djava.security.egd=file:/dev/./urandom -jar <https://builds.apache.org/job/HBase-0.94-security/ws/trunk/target/surefire/surefirebooter3855733038880795143.jar>
<https://builds.apache.org/job/HBase-0.94-security/ws/trunk/target/surefire/surefire1087104784881198634tmp>
<https://builds.apache.org/job/HBase-0.94-security/ws/trunk/target/surefire/surefire_1197988636685045768530tmp>
Running org.apache.hadoop.hbase.master.TestMasterZKSessionRecovery
Tests run: 4, Failures: 0, Errors: 0, Skipped: 0, Time elapsed: 68.385 sec
Forking command line: /bin/sh -c cd <https://builds.apache.org/job/HBase-0.94-security/ws/trunk>
&& /home/hudson/tools/java/jdk1.6.0_27-32/jre/bin/java -enableassertions -Xmx1900m
-Djava.security.egd=file:/dev/./urandom -jar <https://builds.apache.org/job/HBase-0.94-security/ws/trunk/target/surefire/surefirebooter4573633294704376669.jar>
<https://builds.apache.org/job/HBase-0.94-security/ws/trunk/target/surefire/surefire771873694642736697tmp>
<https://builds.apache.org/job/HBase-0.94-security/ws/trunk/target/surefire/surefire_120598261330641981650tmp>
Running org.apache.hadoop.hbase.ipc.TestDelayedRpc
Tests run: 4, Failures: 0, Errors: 0, Skipped: 0, Time elapsed: 2.303 sec
Forking command line: /bin/sh -c cd <https://builds.apache.org/job/HBase-0.94-security/ws/trunk>
&& /home/hudson/tools/java/jdk1.6.0_27-32/jre/bin/java -enableassertions -Xmx1900m
-Djava.security.egd=file:/dev/./urandom -jar <https://builds.apache.org/job/HBase-0.94-security/ws/trunk/target/surefire/surefirebooter4695002635095672564.jar>
<https://builds.apache.org/job/HBase-0.94-security/ws/trunk/target/surefire/surefire5529654109292040859tmp>
<https://builds.apache.org/job/HBase-0.94-security/ws/trunk/target/surefire/surefire_1214907277362887844540tmp>
Running org.apache.hadoop.hbase.thrift2.TestThriftHBaseServiceHandler
Tests run: 12, Failures: 0, Errors: 0, Skipped: 0, Time elapsed: 16.264 sec
Forking command line: /bin/sh -c cd <https://builds.apache.org/job/HBase-0.94-security/ws/trunk>
&& /home/hudson/tools/java/jdk1.6.0_27-32/jre/bin/java -enableassertions -Xmx1900m
-Djava.security.egd=file:/dev/./urandom -jar <https://builds.apache.org/job/HBase-0.94-security/ws/trunk/target/surefire/surefirebooter1634797294680863746.jar>
<https://builds.apache.org/job/HBase-0.94-security/ws/trunk/target/surefire/surefire5240889225060972119tmp>
<https://builds.apache.org/job/HBase-0.94-security/ws/trunk/target/surefire/surefire_1227705486196902027176tmp>
Running org.apache.hadoop.hbase.TestInfoServers
Tests run: 2, Failures: 0, Errors: 0, Skipped: 0, Time elapsed: 14.744 sec
Running org.apache.hadoop.hbase.TestAcidGuarantees
Tests run: 3, Failures: 0, Errors: 0, Skipped: 0, Time elapsed: 108.294 sec

Results :

Failed tests:   testMultiRowMutationMultiThreads(org.apache.hadoop.hbase.regionserver.TestAtomicOperation):
expected:<0> but was:<10>

Tests run: 648, Failures: 1, Errors: 0, Skipped: 2

[INFO] ------------------------------------------------------------------------
[INFO] BUILD FAILURE
[INFO] ------------------------------------------------------------------------
[INFO] Total time: 30:58.611s
[INFO] Finished at: Fri Jul 20 22:53:09 UTC 2012
[INFO] Final Memory: 45M/637M
[INFO] ------------------------------------------------------------------------
[ERROR] Failed to execute goal org.apache.maven.plugins:maven-surefire-plugin:2.12-TRUNK-HBASE-2:test
(secondPartTestsExecution) on project hbase: There are test failures.
[ERROR] 
[ERROR] Please refer to <https://builds.apache.org/job/HBase-0.94-security/ws/trunk/target/surefire-reports>
for the individual test results.
[ERROR] -> [Help 1]
org.apache.maven.lifecycle.LifecycleExecutionException: Failed to execute goal org.apache.maven.plugins:maven-surefire-plugin:2.12-TRUNK-HBASE-2:test
(secondPartTestsExecution) on project hbase: There are test failures.

Please refer to <https://builds.apache.org/job/HBase-0.94-security/ws/trunk/target/surefire-reports>
for the individual test results.
	at org.apache.maven.lifecycle.internal.MojoExecutor.execute(MojoExecutor.java:213)
	at org.apache.maven.lifecycle.internal.MojoExecutor.execute(MojoExecutor.java:153)
	at org.apache.maven.lifecycle.internal.MojoExecutor.execute(MojoExecutor.java:145)
	at org.apache.maven.lifecycle.internal.MojoExecutor.executeForkedExecutions(MojoExecutor.java:365)
	at org.apache.maven.lifecycle.internal.MojoExecutor.execute(MojoExecutor.java:199)
	at org.apache.maven.lifecycle.internal.MojoExecutor.execute(MojoExecutor.java:153)
	at org.apache.maven.lifecycle.internal.MojoExecutor.execute(MojoExecutor.java:145)
	at org.apache.maven.lifecycle.internal.LifecycleModuleBuilder.buildProject(LifecycleModuleBuilder.java:84)
	at org.apache.maven.lifecycle.internal.LifecycleModuleBuilder.buildProject(LifecycleModuleBuilder.java:59)
	at org.apache.maven.lifecycle.internal.LifecycleStarter.singleThreadedBuild(LifecycleStarter.java:183)
	at org.apache.maven.lifecycle.internal.LifecycleStarter.execute(LifecycleStarter.java:161)
	at org.apache.maven.DefaultMaven.doExecute(DefaultMaven.java:319)
	at org.apache.maven.DefaultMaven.execute(DefaultMaven.java:156)
	at org.apache.maven.cli.MavenCli.execute(MavenCli.java:537)
	at org.apache.maven.cli.MavenCli.doMain(MavenCli.java:196)
	at org.apache.maven.cli.MavenCli.main(MavenCli.java:141)
	at sun.reflect.NativeMethodAccessorImpl.invoke0(Native Method)
	at sun.reflect.NativeMethodAccessorImpl.invoke(NativeMethodAccessorImpl.java:39)
	at sun.reflect.DelegatingMethodAccessorImpl.invoke(DelegatingMethodAccessorImpl.java:25)
	at java.lang.reflect.Method.invoke(Method.java:597)
	at org.codehaus.plexus.classworlds.launcher.Launcher.launchEnhanced(Launcher.java:290)
	at org.codehaus.plexus.classworlds.launcher.Launcher.launch(Launcher.java:230)
	at org.codehaus.plexus.classworlds.launcher.Launcher.mainWithExitCode(Launcher.java:409)
	at org.codehaus.plexus.classworlds.launcher.Launcher.main(Launcher.java:352)
Caused by: org.apache.maven.plugin.MojoFailureException: There are test failures.

Please refer to <https://builds.apache.org/job/HBase-0.94-security/ws/trunk/target/surefire-reports>
for the individual test results.
	at org.apache.maven.plugin.surefire.SurefireHelper.reportExecution(SurefireHelper.java:87)
	at org.apache.maven.plugin.surefire.SurefirePlugin.writeSummary(SurefirePlugin.java:651)
	at org.apache.maven.plugin.surefire.SurefirePlugin.handleSummary(SurefirePlugin.java:625)
	at org.apache.maven.plugin.surefire.AbstractSurefireMojo.executeAfterPreconditionsChecked(AbstractSurefireMojo.java:137)
	at org.apache.maven.plugin.surefire.AbstractSurefireMojo.execute(AbstractSurefireMojo.java:98)
	at org.apache.maven.plugin.DefaultBuildPluginManager.executeMojo(DefaultBuildPluginManager.java:101)
	at org.apache.maven.lifecycle.internal.MojoExecutor.execute(MojoExecutor.java:209)
	... 23 more
[ERROR] 
[ERROR] 
[ERROR] For more information about the errors and possible solutions, please read the following
articles:
[ERROR] [Help 1] http://cwiki.apache.org/confluence/display/MAVEN/MojoFailureException
Build step 'Invoke top-level Maven targets' marked build as failure
Archiving artifacts
Updating HBASE-6426
Updating HBASE-5985
Updating HBASE-6389
Updating HBASE-6319
Updating HBASE-6406
Updating HBASE-4956
Updating HBASE-6420
Updating HBASE-6397
Updating HBASE-5966
Updating HBASE-6382
Updating HBASE-6392
Updating HBASE-6325
Recording test results

Mime
View raw message