hbase-dev mailing list archives

Site index · List index
Message view « Date » · « Thread »
Top « Date » · « Thread »
From Apache Jenkins Server <jenk...@builds.apache.org>
Subject Build failed in Jenkins: HBase-0.94-security-on-Hadoop-23 #5
Date Thu, 05 Jul 2012 18:18:32 GMT
See <https://builds.apache.org/job/HBase-0.94-security-on-Hadoop-23/5/changes>

Changes:

[larsh] HBASE-6326 Avoid nested retry loops in HConnectionManager

[apurtell] HBASE-6314. Fast fail behavior for unauthenticated user (Himanshu Vashishtha)

------------------------------------------
[...truncated 8752 lines...]
Forking command line: /bin/sh -c cd /x1/jenkins/jenkins-slave/workspace/HBase-0.94-security-on-Hadoop-23/trunk
&& /x1/jenkins/tools/java/jdk1.6.0_32-32/jre/bin/java -enableassertions -Xmx1900m
-Djava.security.egd=file:/dev/./urandom -jar /x1/jenkins/jenkins-slave/workspace/HBase-0.94-security-on-Hadoop-23/trunk/target/surefire/surefirebooter4738978723596550863.jar
/x1/jenkins/jenkins-slave/workspace/HBase-0.94-security-on-Hadoop-23/trunk/target/surefire/surefire7344517396832478695tmp
/x1/jenkins/jenkins-slave/workspace/HBase-0.94-security-on-Hadoop-23/trunk/target/surefire/surefire_713161926039421874086tmp
Running org.apache.hadoop.hbase.regionserver.TestStoreScanner
Tests run: 16, Failures: 0, Errors: 0, Skipped: 0, Time elapsed: 0.069 sec
Forking command line: /bin/sh -c cd /x1/jenkins/jenkins-slave/workspace/HBase-0.94-security-on-Hadoop-23/trunk
&& /x1/jenkins/tools/java/jdk1.6.0_32-32/jre/bin/java -enableassertions -Xmx1900m
-Djava.security.egd=file:/dev/./urandom -jar /x1/jenkins/jenkins-slave/workspace/HBase-0.94-security-on-Hadoop-23/trunk/target/surefire/surefirebooter8388542743057706562.jar
/x1/jenkins/jenkins-slave/workspace/HBase-0.94-security-on-Hadoop-23/trunk/target/surefire/surefire1322514197845870885tmp
/x1/jenkins/jenkins-slave/workspace/HBase-0.94-security-on-Hadoop-23/trunk/target/surefire/surefire_728569497816999589969tmp
Running org.apache.hadoop.hbase.regionserver.TestBlocksRead
Tests run: 4, Failures: 0, Errors: 0, Skipped: 0, Time elapsed: 4.792 sec
Forking command line: /bin/sh -c cd /x1/jenkins/jenkins-slave/workspace/HBase-0.94-security-on-Hadoop-23/trunk
&& /x1/jenkins/tools/java/jdk1.6.0_32-32/jre/bin/java -enableassertions -Xmx1900m
-Djava.security.egd=file:/dev/./urandom -jar /x1/jenkins/jenkins-slave/workspace/HBase-0.94-security-on-Hadoop-23/trunk/target/surefire/surefirebooter851679617263201341.jar
/x1/jenkins/jenkins-slave/workspace/HBase-0.94-security-on-Hadoop-23/trunk/target/surefire/surefire1932923964448723886tmp
/x1/jenkins/jenkins-slave/workspace/HBase-0.94-security-on-Hadoop-23/trunk/target/surefire/surefire_733039203472495497778tmp
Running org.apache.hadoop.hbase.regionserver.TestStoreFileBlockCacheSummary
Tests run: 1, Failures: 0, Errors: 0, Skipped: 0, Time elapsed: 14.733 sec
Forking command line: /bin/sh -c cd /x1/jenkins/jenkins-slave/workspace/HBase-0.94-security-on-Hadoop-23/trunk
&& /x1/jenkins/tools/java/jdk1.6.0_32-32/jre/bin/java -enableassertions -Xmx1900m
-Djava.security.egd=file:/dev/./urandom -jar /x1/jenkins/jenkins-slave/workspace/HBase-0.94-security-on-Hadoop-23/trunk/target/surefire/surefirebooter549752550908860855.jar
/x1/jenkins/jenkins-slave/workspace/HBase-0.94-security-on-Hadoop-23/trunk/target/surefire/surefire5602021232083803891tmp
/x1/jenkins/jenkins-slave/workspace/HBase-0.94-security-on-Hadoop-23/trunk/target/surefire/surefire_748986026492648157031tmp
Running org.apache.hadoop.hbase.regionserver.metrics.TestSchemaMetrics
Tests run: 6, Failures: 0, Errors: 0, Skipped: 0, Time elapsed: 39.777 sec
Forking command line: /bin/sh -c cd /x1/jenkins/jenkins-slave/workspace/HBase-0.94-security-on-Hadoop-23/trunk
&& /x1/jenkins/tools/java/jdk1.6.0_32-32/jre/bin/java -enableassertions -Xmx1900m
-Djava.security.egd=file:/dev/./urandom -jar /x1/jenkins/jenkins-slave/workspace/HBase-0.94-security-on-Hadoop-23/trunk/target/surefire/surefirebooter8998690573201481590.jar
/x1/jenkins/jenkins-slave/workspace/HBase-0.94-security-on-Hadoop-23/trunk/target/surefire/surefire7626284948623775318tmp
/x1/jenkins/jenkins-slave/workspace/HBase-0.94-security-on-Hadoop-23/trunk/target/surefire/surefire_753224816314668461427tmp
Running org.apache.hadoop.hbase.regionserver.TestMasterAddressManager
Tests run: 1, Failures: 0, Errors: 0, Skipped: 0, Time elapsed: 1.391 sec
Forking command line: /bin/sh -c cd /x1/jenkins/jenkins-slave/workspace/HBase-0.94-security-on-Hadoop-23/trunk
&& /x1/jenkins/tools/java/jdk1.6.0_32-32/jre/bin/java -enableassertions -Xmx1900m
-Djava.security.egd=file:/dev/./urandom -jar /x1/jenkins/jenkins-slave/workspace/HBase-0.94-security-on-Hadoop-23/trunk/target/surefire/surefirebooter5305623651299872096.jar
/x1/jenkins/jenkins-slave/workspace/HBase-0.94-security-on-Hadoop-23/trunk/target/surefire/surefire7883206600802381538tmp
/x1/jenkins/jenkins-slave/workspace/HBase-0.94-security-on-Hadoop-23/trunk/target/surefire/surefire_766141175016251989871tmp
Running org.apache.hadoop.hbase.regionserver.TestHRegion
Tests run: 65, Failures: 0, Errors: 0, Skipped: 0, Time elapsed: 87.781 sec
Forking command line: /bin/sh -c cd /x1/jenkins/jenkins-slave/workspace/HBase-0.94-security-on-Hadoop-23/trunk
&& /x1/jenkins/tools/java/jdk1.6.0_32-32/jre/bin/java -enableassertions -Xmx1900m
-Djava.security.egd=file:/dev/./urandom -jar /x1/jenkins/jenkins-slave/workspace/HBase-0.94-security-on-Hadoop-23/trunk/target/surefire/surefirebooter7198534213784759114.jar
/x1/jenkins/jenkins-slave/workspace/HBase-0.94-security-on-Hadoop-23/trunk/target/surefire/surefire3254608124630652860tmp
/x1/jenkins/jenkins-slave/workspace/HBase-0.94-security-on-Hadoop-23/trunk/target/surefire/surefire_776779940694283348184tmp
Running org.apache.hadoop.hbase.regionserver.TestMultiColumnScanner
Tests run: 12, Failures: 0, Errors: 0, Skipped: 0, Time elapsed: 130.649 sec
Forking command line: /bin/sh -c cd /x1/jenkins/jenkins-slave/workspace/HBase-0.94-security-on-Hadoop-23/trunk
&& /x1/jenkins/tools/java/jdk1.6.0_32-32/jre/bin/java -enableassertions -Xmx1900m
-Djava.security.egd=file:/dev/./urandom -jar /x1/jenkins/jenkins-slave/workspace/HBase-0.94-security-on-Hadoop-23/trunk/target/surefire/surefirebooter3052450691336265243.jar
/x1/jenkins/jenkins-slave/workspace/HBase-0.94-security-on-Hadoop-23/trunk/target/surefire/surefire7188089006825507848tmp
/x1/jenkins/jenkins-slave/workspace/HBase-0.94-security-on-Hadoop-23/trunk/target/surefire/surefire_782960447099206244032tmp
Running org.apache.hadoop.hbase.ipc.TestDelayedRpc
Tests run: 4, Failures: 0, Errors: 0, Skipped: 0, Time elapsed: 5.703 sec
Forking command line: /bin/sh -c cd /x1/jenkins/jenkins-slave/workspace/HBase-0.94-security-on-Hadoop-23/trunk
&& /x1/jenkins/tools/java/jdk1.6.0_32-32/jre/bin/java -enableassertions -Xmx1900m
-Djava.security.egd=file:/dev/./urandom -jar /x1/jenkins/jenkins-slave/workspace/HBase-0.94-security-on-Hadoop-23/trunk/target/surefire/surefirebooter7469379055205978049.jar
/x1/jenkins/jenkins-slave/workspace/HBase-0.94-security-on-Hadoop-23/trunk/target/surefire/surefire8394891001561651599tmp
/x1/jenkins/jenkins-slave/workspace/HBase-0.94-security-on-Hadoop-23/trunk/target/surefire/surefire_799123095343793124468tmp
Running org.apache.hadoop.hbase.TestGlobalMemStoreSize
Tests run: 1, Failures: 0, Errors: 0, Skipped: 0, Time elapsed: 23.458 sec
Forking command line: /bin/sh -c cd /x1/jenkins/jenkins-slave/workspace/HBase-0.94-security-on-Hadoop-23/trunk
&& /x1/jenkins/tools/java/jdk1.6.0_32-32/jre/bin/java -enableassertions -Xmx1900m
-Djava.security.egd=file:/dev/./urandom -jar /x1/jenkins/jenkins-slave/workspace/HBase-0.94-security-on-Hadoop-23/trunk/target/surefire/surefirebooter4046400164728503070.jar
/x1/jenkins/jenkins-slave/workspace/HBase-0.94-security-on-Hadoop-23/trunk/target/surefire/surefire2626422956894673536tmp
/x1/jenkins/jenkins-slave/workspace/HBase-0.94-security-on-Hadoop-23/trunk/target/surefire/surefire_808037253721397611128tmp
Running org.apache.hadoop.hbase.constraint.TestConstraint
Tests run: 5, Failures: 0, Errors: 0, Skipped: 0, Time elapsed: 29.418 sec
Forking command line: /bin/sh -c cd /x1/jenkins/jenkins-slave/workspace/HBase-0.94-security-on-Hadoop-23/trunk
&& /x1/jenkins/tools/java/jdk1.6.0_32-32/jre/bin/java -enableassertions -Xmx1900m
-Djava.security.egd=file:/dev/./urandom -jar /x1/jenkins/jenkins-slave/workspace/HBase-0.94-security-on-Hadoop-23/trunk/target/surefire/surefirebooter5663147474702108929.jar
/x1/jenkins/jenkins-slave/workspace/HBase-0.94-security-on-Hadoop-23/trunk/target/surefire/surefire5181407217992907905tmp
/x1/jenkins/jenkins-slave/workspace/HBase-0.94-security-on-Hadoop-23/trunk/target/surefire/surefire_818042153483343180981tmp
Running org.apache.hadoop.hbase.rest.TestSchemaResource
Tests run: 2, Failures: 0, Errors: 0, Skipped: 0, Time elapsed: 22.458 sec
Forking command line: /bin/sh -c cd /x1/jenkins/jenkins-slave/workspace/HBase-0.94-security-on-Hadoop-23/trunk
&& /x1/jenkins/tools/java/jdk1.6.0_32-32/jre/bin/java -enableassertions -Xmx1900m
-Djava.security.egd=file:/dev/./urandom -jar /x1/jenkins/jenkins-slave/workspace/HBase-0.94-security-on-Hadoop-23/trunk/target/surefire/surefirebooter2450387502722508281.jar
/x1/jenkins/jenkins-slave/workspace/HBase-0.94-security-on-Hadoop-23/trunk/target/surefire/surefire3654215526970506333tmp
/x1/jenkins/jenkins-slave/workspace/HBase-0.94-security-on-Hadoop-23/trunk/target/surefire/surefire_823125481830804795546tmp
Running org.apache.hadoop.hbase.rest.client.TestRemoteAdmin
Tests run: 1, Failures: 0, Errors: 0, Skipped: 0, Time elapsed: 19.097 sec
Forking command line: /bin/sh -c cd /x1/jenkins/jenkins-slave/workspace/HBase-0.94-security-on-Hadoop-23/trunk
&& /x1/jenkins/tools/java/jdk1.6.0_32-32/jre/bin/java -enableassertions -Xmx1900m
-Djava.security.egd=file:/dev/./urandom -jar /x1/jenkins/jenkins-slave/workspace/HBase-0.94-security-on-Hadoop-23/trunk/target/surefire/surefirebooter5490480070865143381.jar
/x1/jenkins/jenkins-slave/workspace/HBase-0.94-security-on-Hadoop-23/trunk/target/surefire/surefire1950557641300751600tmp
/x1/jenkins/jenkins-slave/workspace/HBase-0.94-security-on-Hadoop-23/trunk/target/surefire/surefire_834817188746212555233tmp
Running org.apache.hadoop.hbase.rest.client.TestRemoteTable
Tests run: 3, Failures: 0, Errors: 0, Skipped: 0, Time elapsed: 20.828 sec
Forking command line: /bin/sh -c cd /x1/jenkins/jenkins-slave/workspace/HBase-0.94-security-on-Hadoop-23/trunk
&& /x1/jenkins/tools/java/jdk1.6.0_32-32/jre/bin/java -enableassertions -Xmx1900m
-Djava.security.egd=file:/dev/./urandom -jar /x1/jenkins/jenkins-slave/workspace/HBase-0.94-security-on-Hadoop-23/trunk/target/surefire/surefirebooter349374711525124245.jar
/x1/jenkins/jenkins-slave/workspace/HBase-0.94-security-on-Hadoop-23/trunk/target/surefire/surefire3212428122070130947tmp
/x1/jenkins/jenkins-slave/workspace/HBase-0.94-security-on-Hadoop-23/trunk/target/surefire/surefire_844399033032168070577tmp
Running org.apache.hadoop.hbase.rest.TestTableResource
Tests run: 8, Failures: 0, Errors: 0, Skipped: 0, Time elapsed: 35.041 sec
Forking command line: /bin/sh -c cd /x1/jenkins/jenkins-slave/workspace/HBase-0.94-security-on-Hadoop-23/trunk
&& /x1/jenkins/tools/java/jdk1.6.0_32-32/jre/bin/java -enableassertions -Xmx1900m
-Djava.security.egd=file:/dev/./urandom -jar /x1/jenkins/jenkins-slave/workspace/HBase-0.94-security-on-Hadoop-23/trunk/target/surefire/surefirebooter6279601828301453313.jar
/x1/jenkins/jenkins-slave/workspace/HBase-0.94-security-on-Hadoop-23/trunk/target/surefire/surefire309777921140808336tmp
/x1/jenkins/jenkins-slave/workspace/HBase-0.94-security-on-Hadoop-23/trunk/target/surefire/surefire_854742654249860505447tmp
Running org.apache.hadoop.hbase.rest.TestMultiRowResource
Tests run: 3, Failures: 0, Errors: 0, Skipped: 0, Time elapsed: 20.122 sec
Forking command line: /bin/sh -c cd /x1/jenkins/jenkins-slave/workspace/HBase-0.94-security-on-Hadoop-23/trunk
&& /x1/jenkins/tools/java/jdk1.6.0_32-32/jre/bin/java -enableassertions -Xmx1900m
-Djava.security.egd=file:/dev/./urandom -jar /x1/jenkins/jenkins-slave/workspace/HBase-0.94-security-on-Hadoop-23/trunk/target/surefire/surefirebooter8520610166883757878.jar
/x1/jenkins/jenkins-slave/workspace/HBase-0.94-security-on-Hadoop-23/trunk/target/surefire/surefire6056976448530585676tmp
/x1/jenkins/jenkins-slave/workspace/HBase-0.94-security-on-Hadoop-23/trunk/target/surefire/surefire_867650236277132134325tmp
Running org.apache.hadoop.hbase.TestLocalHBaseCluster
Tests run: 1, Failures: 0, Errors: 1, Skipped: 0, Time elapsed: 204.824 sec <<< FAILURE!
Forking command line: /bin/sh -c cd /x1/jenkins/jenkins-slave/workspace/HBase-0.94-security-on-Hadoop-23/trunk
&& /x1/jenkins/tools/java/jdk1.6.0_32-32/jre/bin/java -enableassertions -Xmx1900m
-Djava.security.egd=file:/dev/./urandom -jar /x1/jenkins/jenkins-slave/workspace/HBase-0.94-security-on-Hadoop-23/trunk/target/surefire/surefirebooter1937965689755393504.jar
/x1/jenkins/jenkins-slave/workspace/HBase-0.94-security-on-Hadoop-23/trunk/target/surefire/surefire1225070663455341325tmp
/x1/jenkins/jenkins-slave/workspace/HBase-0.94-security-on-Hadoop-23/trunk/target/surefire/surefire_871374676419348673995tmp
Running org.apache.hadoop.hbase.rest.TestGzipFilter
Tests run: 3, Failures: 0, Errors: 0, Skipped: 0, Time elapsed: 19.179 sec
Forking command line: /bin/sh -c cd /x1/jenkins/jenkins-slave/workspace/HBase-0.94-security-on-Hadoop-23/trunk
&& /x1/jenkins/tools/java/jdk1.6.0_32-32/jre/bin/java -enableassertions -Xmx1900m
-Djava.security.egd=file:/dev/./urandom -jar /x1/jenkins/jenkins-slave/workspace/HBase-0.94-security-on-Hadoop-23/trunk/target/surefire/surefirebooter1431836665725844033.jar
/x1/jenkins/jenkins-slave/workspace/HBase-0.94-security-on-Hadoop-23/trunk/target/surefire/surefire7788453370148534141tmp
/x1/jenkins/jenkins-slave/workspace/HBase-0.94-security-on-Hadoop-23/trunk/target/surefire/surefire_886870509949378774023tmp
Running org.apache.hadoop.hbase.rest.TestRowResource
Tests run: 11, Failures: 0, Errors: 0, Skipped: 0, Time elapsed: 22.049 sec
Forking command line: /bin/sh -c cd /x1/jenkins/jenkins-slave/workspace/HBase-0.94-security-on-Hadoop-23/trunk
&& /x1/jenkins/tools/java/jdk1.6.0_32-32/jre/bin/java -enableassertions -Xmx1900m
-Djava.security.egd=file:/dev/./urandom -jar /x1/jenkins/jenkins-slave/workspace/HBase-0.94-security-on-Hadoop-23/trunk/target/surefire/surefirebooter3051574309173454341.jar
/x1/jenkins/jenkins-slave/workspace/HBase-0.94-security-on-Hadoop-23/trunk/target/surefire/surefire5609081434555423909tmp
/x1/jenkins/jenkins-slave/workspace/HBase-0.94-security-on-Hadoop-23/trunk/target/surefire/surefire_891891961554149216187tmp
Running org.apache.hadoop.hbase.rest.TestVersionResource
Tests run: 7, Failures: 0, Errors: 0, Skipped: 0, Time elapsed: 19.608 sec
Forking command line: /bin/sh -c cd /x1/jenkins/jenkins-slave/workspace/HBase-0.94-security-on-Hadoop-23/trunk
&& /x1/jenkins/tools/java/jdk1.6.0_32-32/jre/bin/java -enableassertions -Xmx1900m
-Djava.security.egd=file:/dev/./urandom -jar /x1/jenkins/jenkins-slave/workspace/HBase-0.94-security-on-Hadoop-23/trunk/target/surefire/surefirebooter1045536725498130120.jar
/x1/jenkins/jenkins-slave/workspace/HBase-0.94-security-on-Hadoop-23/trunk/target/surefire/surefire170282495540176793tmp
/x1/jenkins/jenkins-slave/workspace/HBase-0.94-security-on-Hadoop-23/trunk/target/surefire/surefire_903249493547525331747tmp
Running org.apache.hadoop.hbase.rest.TestScannerResource
Tests run: 5, Failures: 0, Errors: 0, Skipped: 0, Time elapsed: 39.616 sec
Forking command line: /bin/sh -c cd /x1/jenkins/jenkins-slave/workspace/HBase-0.94-security-on-Hadoop-23/trunk
&& /x1/jenkins/tools/java/jdk1.6.0_32-32/jre/bin/java -enableassertions -Xmx1900m
-Djava.security.egd=file:/dev/./urandom -jar /x1/jenkins/jenkins-slave/workspace/HBase-0.94-security-on-Hadoop-23/trunk/target/surefire/surefirebooter4745796895075337670.jar
/x1/jenkins/jenkins-slave/workspace/HBase-0.94-security-on-Hadoop-23/trunk/target/surefire/surefire8163225191642612259tmp
/x1/jenkins/jenkins-slave/workspace/HBase-0.94-security-on-Hadoop-23/trunk/target/surefire/surefire_919059940215983122199tmp
Running org.apache.hadoop.hbase.rest.TestStatusResource
Tests run: 2, Failures: 0, Errors: 0, Skipped: 0, Time elapsed: 20.503 sec
Forking command line: /bin/sh -c cd /x1/jenkins/jenkins-slave/workspace/HBase-0.94-security-on-Hadoop-23/trunk
&& /x1/jenkins/tools/java/jdk1.6.0_32-32/jre/bin/java -enableassertions -Xmx1900m
-Djava.security.egd=file:/dev/./urandom -jar /x1/jenkins/jenkins-slave/workspace/HBase-0.94-security-on-Hadoop-23/trunk/target/surefire/surefirebooter5251915272527823907.jar
/x1/jenkins/jenkins-slave/workspace/HBase-0.94-security-on-Hadoop-23/trunk/target/surefire/surefire8836342128428296650tmp
/x1/jenkins/jenkins-slave/workspace/HBase-0.94-security-on-Hadoop-23/trunk/target/surefire/surefire_924993205100315968547tmp
Running org.apache.hadoop.hbase.metrics.TestMetricsMBeanBase
Tests run: 2, Failures: 0, Errors: 0, Skipped: 0, Time elapsed: 1.382 sec
Forking command line: /bin/sh -c cd /x1/jenkins/jenkins-slave/workspace/HBase-0.94-security-on-Hadoop-23/trunk
&& /x1/jenkins/tools/java/jdk1.6.0_32-32/jre/bin/java -enableassertions -Xmx1900m
-Djava.security.egd=file:/dev/./urandom -jar /x1/jenkins/jenkins-slave/workspace/HBase-0.94-security-on-Hadoop-23/trunk/target/surefire/surefirebooter8160704159564035181.jar
/x1/jenkins/jenkins-slave/workspace/HBase-0.94-security-on-Hadoop-23/trunk/target/surefire/surefire574779376918226919tmp
/x1/jenkins/jenkins-slave/workspace/HBase-0.94-security-on-Hadoop-23/trunk/target/surefire/surefire_937478675729927563005tmp
Running org.apache.hadoop.hbase.rest.TestScannersWithFilters
Tests run: 10, Failures: 0, Errors: 0, Skipped: 0, Time elapsed: 28.789 sec
Forking command line: /bin/sh -c cd /x1/jenkins/jenkins-slave/workspace/HBase-0.94-security-on-Hadoop-23/trunk
&& /x1/jenkins/tools/java/jdk1.6.0_32-32/jre/bin/java -enableassertions -Xmx1900m
-Djava.security.egd=file:/dev/./urandom -jar /x1/jenkins/jenkins-slave/workspace/HBase-0.94-security-on-Hadoop-23/trunk/target/surefire/surefirebooter7371332104310728890.jar
/x1/jenkins/jenkins-slave/workspace/HBase-0.94-security-on-Hadoop-23/trunk/target/surefire/surefire6440839931197047562tmp
/x1/jenkins/jenkins-slave/workspace/HBase-0.94-security-on-Hadoop-23/trunk/target/surefire/surefire_948479751290581052650tmp
Running org.apache.hadoop.hbase.io.hfile.TestHFileBlockIndex
Tests run: 10, Failures: 0, Errors: 0, Skipped: 0, Time elapsed: 29.408 sec
Running org.apache.hadoop.hbase.io.hfile.TestHFileSeek
Tests run: 1, Failures: 0, Errors: 0, Skipped: 0, Time elapsed: 19.265 sec
Forking command line: /bin/sh -c cd /x1/jenkins/jenkins-slave/workspace/HBase-0.94-security-on-Hadoop-23/trunk
&& /x1/jenkins/tools/java/jdk1.6.0_32-32/jre/bin/java -enableassertions -Xmx1900m
-Djava.security.egd=file:/dev/./urandom -jar /x1/jenkins/jenkins-slave/workspace/HBase-0.94-security-on-Hadoop-23/trunk/target/surefire/surefirebooter5726548353530207286.jar
/x1/jenkins/jenkins-slave/workspace/HBase-0.94-security-on-Hadoop-23/trunk/target/surefire/surefire6517290604254684621tmp
/x1/jenkins/jenkins-slave/workspace/HBase-0.94-security-on-Hadoop-23/trunk/target/surefire/surefire_953297322328154971624tmp
Forking command line: /bin/sh -c cd /x1/jenkins/jenkins-slave/workspace/HBase-0.94-security-on-Hadoop-23/trunk
&& /x1/jenkins/tools/java/jdk1.6.0_32-32/jre/bin/java -enableassertions -Xmx1900m
-Djava.security.egd=file:/dev/./urandom -jar /x1/jenkins/jenkins-slave/workspace/HBase-0.94-security-on-Hadoop-23/trunk/target/surefire/surefirebooter3673407730045784830.jar
/x1/jenkins/jenkins-slave/workspace/HBase-0.94-security-on-Hadoop-23/trunk/target/surefire/surefire7750794416006263695tmp
/x1/jenkins/jenkins-slave/workspace/HBase-0.94-security-on-Hadoop-23/trunk/target/surefire/surefire_968271602724111003041tmp
Running org.apache.hadoop.hbase.io.hfile.TestLruBlockCache
Tests run: 16, Failures: 0, Errors: 0, Skipped: 0, Time elapsed: 1.223 sec
Forking command line: /bin/sh -c cd /x1/jenkins/jenkins-slave/workspace/HBase-0.94-security-on-Hadoop-23/trunk
&& /x1/jenkins/tools/java/jdk1.6.0_32-32/jre/bin/java -enableassertions -Xmx1900m
-Djava.security.egd=file:/dev/./urandom -jar /x1/jenkins/jenkins-slave/workspace/HBase-0.94-security-on-Hadoop-23/trunk/target/surefire/surefirebooter9120919934390106138.jar
/x1/jenkins/jenkins-slave/workspace/HBase-0.94-security-on-Hadoop-23/trunk/target/surefire/surefire1240871083400863455tmp
/x1/jenkins/jenkins-slave/workspace/HBase-0.94-security-on-Hadoop-23/trunk/target/surefire/surefire_97822791386458941802tmp
Running org.apache.hadoop.hbase.io.hfile.TestFixedFileTrailer
Tests run: 2, Failures: 0, Errors: 0, Skipped: 0, Time elapsed: 2.478 sec
Forking command line: /bin/sh -c cd /x1/jenkins/jenkins-slave/workspace/HBase-0.94-security-on-Hadoop-23/trunk
&& /x1/jenkins/tools/java/jdk1.6.0_32-32/jre/bin/java -enableassertions -Xmx1900m
-Djava.security.egd=file:/dev/./urandom -jar /x1/jenkins/jenkins-slave/workspace/HBase-0.94-security-on-Hadoop-23/trunk/target/surefire/surefirebooter2877154068073081135.jar
/x1/jenkins/jenkins-slave/workspace/HBase-0.94-security-on-Hadoop-23/trunk/target/surefire/surefire4831312217458695252tmp
/x1/jenkins/jenkins-slave/workspace/HBase-0.94-security-on-Hadoop-23/trunk/target/surefire/surefire_987508986090616464802tmp
Running org.apache.hadoop.hbase.io.hfile.TestHFilePerformance
Tests run: 1, Failures: 0, Errors: 0, Skipped: 0, Time elapsed: 9.746 sec
Forking command line: /bin/sh -c cd /x1/jenkins/jenkins-slave/workspace/HBase-0.94-security-on-Hadoop-23/trunk
&& /x1/jenkins/tools/java/jdk1.6.0_32-32/jre/bin/java -enableassertions -Xmx1900m
-Djava.security.egd=file:/dev/./urandom -jar /x1/jenkins/jenkins-slave/workspace/HBase-0.94-security-on-Hadoop-23/trunk/target/surefire/surefirebooter3282276839426228783.jar
/x1/jenkins/jenkins-slave/workspace/HBase-0.94-security-on-Hadoop-23/trunk/target/surefire/surefire94761760210817422tmp
/x1/jenkins/jenkins-slave/workspace/HBase-0.94-security-on-Hadoop-23/trunk/target/surefire/surefire_999076198770606403439tmp
Running org.apache.hadoop.hbase.io.hfile.TestHFileBlockCompatibility
Tests run: 10, Failures: 0, Errors: 0, Skipped: 0, Time elapsed: 3.81 sec
Forking command line: /bin/sh -c cd /x1/jenkins/jenkins-slave/workspace/HBase-0.94-security-on-Hadoop-23/trunk
&& /x1/jenkins/tools/java/jdk1.6.0_32-32/jre/bin/java -enableassertions -Xmx1900m
-Djava.security.egd=file:/dev/./urandom -jar /x1/jenkins/jenkins-slave/workspace/HBase-0.94-security-on-Hadoop-23/trunk/target/surefire/surefirebooter2574679993343333865.jar
/x1/jenkins/jenkins-slave/workspace/HBase-0.94-security-on-Hadoop-23/trunk/target/surefire/surefire4854836799131768634tmp
/x1/jenkins/jenkins-slave/workspace/HBase-0.94-security-on-Hadoop-23/trunk/target/surefire/surefire_1005701235022904173695tmp
#
# There is insufficient memory for the Java Runtime Environment to continue.
# Native memory allocation (malloc) failed to allocate 1060656 bytes for Arena::Amalloc
# An error report file with more information is saved as:
# /x1/jenkins/jenkins-slave/workspace/HBase-0.94-security-on-Hadoop-23/trunk/hs_err_pid5551.log
org.apache.maven.surefire.booter.SurefireBooterForkException: Error occurred in starting fork,
check output in log
	at org.apache.maven.plugin.surefire.booterclient.ForkStarter.fork(ForkStarter.java:238)
	at org.apache.maven.plugin.surefire.booterclient.ForkStarter.access$000(ForkStarter.java:64)
	at org.apache.maven.plugin.surefire.booterclient.ForkStarter$ParallelFork.call(ForkStarter.java:303)
	at org.apache.maven.plugin.surefire.booterclient.ForkStarter$ParallelFork.call(ForkStarter.java:285)
	at java.util.concurrent.FutureTask$Sync.innerRun(FutureTask.java:303)
	at java.util.concurrent.FutureTask.run(FutureTask.java:138)
	at java.util.concurrent.ThreadPoolExecutor$Worker.runTask(ThreadPoolExecutor.java:886)
	at java.util.concurrent.ThreadPoolExecutor$Worker.run(ThreadPoolExecutor.java:908)
	at java.lang.Thread.run(Thread.java:662)
No results for java.util.concurrent.FutureTask@18bd16f
Forking command line: /bin/sh -c cd /x1/jenkins/jenkins-slave/workspace/HBase-0.94-security-on-Hadoop-23/trunk
&& /x1/jenkins/tools/java/jdk1.6.0_32-32/jre/bin/java -enableassertions -Xmx1900m
-Djava.security.egd=file:/dev/./urandom -jar /x1/jenkins/jenkins-slave/workspace/HBase-0.94-security-on-Hadoop-23/trunk/target/surefire/surefirebooter1875424403233630839.jar
/x1/jenkins/jenkins-slave/workspace/HBase-0.94-security-on-Hadoop-23/trunk/target/surefire/surefire5598745992090408053tmp
/x1/jenkins/jenkins-slave/workspace/HBase-0.94-security-on-Hadoop-23/trunk/target/surefire/surefire_1015881274159227676603tmp
Running org.apache.hadoop.hbase.io.hfile.TestChecksum
Tests run: 3, Failures: 0, Errors: 0, Skipped: 0, Time elapsed: 3.193 sec
Forking command line: /bin/sh -c cd /x1/jenkins/jenkins-slave/workspace/HBase-0.94-security-on-Hadoop-23/trunk
&& /x1/jenkins/tools/java/jdk1.6.0_32-32/jre/bin/java -enableassertions -Xmx1900m
-Djava.security.egd=file:/dev/./urandom -jar /x1/jenkins/jenkins-slave/workspace/HBase-0.94-security-on-Hadoop-23/trunk/target/surefire/surefirebooter8874613864324009760.jar
/x1/jenkins/jenkins-slave/workspace/HBase-0.94-security-on-Hadoop-23/trunk/target/surefire/surefire7645276228966375693tmp
/x1/jenkins/jenkins-slave/workspace/HBase-0.94-security-on-Hadoop-23/trunk/target/surefire/surefire_1029140227041927399176tmp
Running org.apache.hadoop.hbase.io.hfile.TestCacheOnWrite
Tests run: 36, Failures: 0, Errors: 0, Skipped: 0, Time elapsed: 91.81 sec
Forking command line: /bin/sh -c cd /x1/jenkins/jenkins-slave/workspace/HBase-0.94-security-on-Hadoop-23/trunk
&& /x1/jenkins/tools/java/jdk1.6.0_32-32/jre/bin/java -enableassertions -Xmx1900m
-Djava.security.egd=file:/dev/./urandom -jar /x1/jenkins/jenkins-slave/workspace/HBase-0.94-security-on-Hadoop-23/trunk/target/surefire/surefirebooter4147059496227314727.jar
/x1/jenkins/jenkins-slave/workspace/HBase-0.94-security-on-Hadoop-23/trunk/target/surefire/surefire4614771778529622818tmp
/x1/jenkins/jenkins-slave/workspace/HBase-0.94-security-on-Hadoop-23/trunk/target/surefire/surefire_1033463375047404795158tmp
Running org.apache.hadoop.hbase.io.hfile.TestHFileBlock
Tests run: 16, Failures: 0, Errors: 0, Skipped: 0, Time elapsed: 60.038 sec
Forking command line: /bin/sh -c cd /x1/jenkins/jenkins-slave/workspace/HBase-0.94-security-on-Hadoop-23/trunk
&& /x1/jenkins/tools/java/jdk1.6.0_32-32/jre/bin/java -enableassertions -Xmx1900m
-Djava.security.egd=file:/dev/./urandom -jar /x1/jenkins/jenkins-slave/workspace/HBase-0.94-security-on-Hadoop-23/trunk/target/surefire/surefirebooter7992067202238860754.jar
/x1/jenkins/jenkins-slave/workspace/HBase-0.94-security-on-Hadoop-23/trunk/target/surefire/surefire3461341760702787959tmp
/x1/jenkins/jenkins-slave/workspace/HBase-0.94-security-on-Hadoop-23/trunk/target/surefire/surefire_1044027032955058633425tmp
Running org.apache.hadoop.hbase.io.hfile.slab.TestSlabCache
Tests run: 7, Failures: 0, Errors: 0, Skipped: 0, Time elapsed: 27.681 sec
Forking command line: /bin/sh -c cd /x1/jenkins/jenkins-slave/workspace/HBase-0.94-security-on-Hadoop-23/trunk
&& /x1/jenkins/tools/java/jdk1.6.0_32-32/jre/bin/java -enableassertions -Xmx1900m
-Djava.security.egd=file:/dev/./urandom -jar /x1/jenkins/jenkins-slave/workspace/HBase-0.94-security-on-Hadoop-23/trunk/target/surefire/surefirebooter4573212690935076519.jar
/x1/jenkins/jenkins-slave/workspace/HBase-0.94-security-on-Hadoop-23/trunk/target/surefire/surefire4970924268239696952tmp
/x1/jenkins/jenkins-slave/workspace/HBase-0.94-security-on-Hadoop-23/trunk/target/surefire/surefire_1055644905577654438623tmp
Running org.apache.hadoop.hbase.io.encoding.TestLoadAndSwitchEncodeOnDisk
Running org.apache.hadoop.hbase.io.hfile.slab.TestSingleSizeCache
Tests run: 5, Failures: 0, Errors: 0, Skipped: 0, Time elapsed: 44.089 sec
Tests run: 1, Failures: 0, Errors: 0, Skipped: 0, Time elapsed: 33.136 sec
Forking command line: /bin/sh -c cd /x1/jenkins/jenkins-slave/workspace/HBase-0.94-security-on-Hadoop-23/trunk
&& /x1/jenkins/tools/java/jdk1.6.0_32-32/jre/bin/java -enableassertions -Xmx1900m
-Djava.security.egd=file:/dev/./urandom -jar /x1/jenkins/jenkins-slave/workspace/HBase-0.94-security-on-Hadoop-23/trunk/target/surefire/surefirebooter4187952802181483916.jar
/x1/jenkins/jenkins-slave/workspace/HBase-0.94-security-on-Hadoop-23/trunk/target/surefire/surefire7789376350149470946tmp
/x1/jenkins/jenkins-slave/workspace/HBase-0.94-security-on-Hadoop-23/trunk/target/surefire/surefire_1065900893973211070959tmp
Forking command line: /bin/sh -c cd /x1/jenkins/jenkins-slave/workspace/HBase-0.94-security-on-Hadoop-23/trunk
&& /x1/jenkins/tools/java/jdk1.6.0_32-32/jre/bin/java -enableassertions -Xmx1900m
-Djava.security.egd=file:/dev/./urandom -jar /x1/jenkins/jenkins-slave/workspace/HBase-0.94-security-on-Hadoop-23/trunk/target/surefire/surefirebooter5579742049735761452.jar
/x1/jenkins/jenkins-slave/workspace/HBase-0.94-security-on-Hadoop-23/trunk/target/surefire/surefire1610009976747841502tmp
/x1/jenkins/jenkins-slave/workspace/HBase-0.94-security-on-Hadoop-23/trunk/target/surefire/surefire_1075184348860224776035tmp
Running org.apache.hadoop.hbase.replication.TestReplicationZookeeper
Tests run: 1, Failures: 0, Errors: 0, Skipped: 0, Time elapsed: 2.909 sec
Forking command line: /bin/sh -c cd /x1/jenkins/jenkins-slave/workspace/HBase-0.94-security-on-Hadoop-23/trunk
&& /x1/jenkins/tools/java/jdk1.6.0_32-32/jre/bin/java -enableassertions -Xmx1900m
-Djava.security.egd=file:/dev/./urandom -jar /x1/jenkins/jenkins-slave/workspace/HBase-0.94-security-on-Hadoop-23/trunk/target/surefire/surefirebooter3441649644771510539.jar
/x1/jenkins/jenkins-slave/workspace/HBase-0.94-security-on-Hadoop-23/trunk/target/surefire/surefire443024634974062336tmp
/x1/jenkins/jenkins-slave/workspace/HBase-0.94-security-on-Hadoop-23/trunk/target/surefire/surefire_1082754610038240460794tmp
Running org.apache.hadoop.hbase.replication.regionserver.TestReplicationSourceManager
Tests run: 1, Failures: 0, Errors: 0, Skipped: 0, Time elapsed: 4.549 sec
Forking command line: /bin/sh -c cd /x1/jenkins/jenkins-slave/workspace/HBase-0.94-security-on-Hadoop-23/trunk
&& /x1/jenkins/tools/java/jdk1.6.0_32-32/jre/bin/java -enableassertions -Xmx1900m
-Djava.security.egd=file:/dev/./urandom -jar /x1/jenkins/jenkins-slave/workspace/HBase-0.94-security-on-Hadoop-23/trunk/target/surefire/surefirebooter8309064215423494798.jar
/x1/jenkins/jenkins-slave/workspace/HBase-0.94-security-on-Hadoop-23/trunk/target/surefire/surefire1861193442179046635tmp
/x1/jenkins/jenkins-slave/workspace/HBase-0.94-security-on-Hadoop-23/trunk/target/surefire/surefire_1093083275452131606968tmp
Running org.apache.hadoop.hbase.replication.TestReplicationSource
Tests run: 1, Failures: 0, Errors: 0, Skipped: 0, Time elapsed: 9.361 sec
Forking command line: /bin/sh -c cd /x1/jenkins/jenkins-slave/workspace/HBase-0.94-security-on-Hadoop-23/trunk
&& /x1/jenkins/tools/java/jdk1.6.0_32-32/jre/bin/java -enableassertions -Xmx1900m
-Djava.security.egd=file:/dev/./urandom -jar /x1/jenkins/jenkins-slave/workspace/HBase-0.94-security-on-Hadoop-23/trunk/target/surefire/surefirebooter4401402450964572446.jar
/x1/jenkins/jenkins-slave/workspace/HBase-0.94-security-on-Hadoop-23/trunk/target/surefire/surefire1619199520805011018tmp
/x1/jenkins/jenkins-slave/workspace/HBase-0.94-security-on-Hadoop-23/trunk/target/surefire/surefire_1102988475048513016728tmp
Running org.apache.hadoop.hbase.replication.regionserver.TestReplicationSink
Tests run: 5, Failures: 0, Errors: 0, Skipped: 0, Time elapsed: 19.943 sec
Forking command line: /bin/sh -c cd /x1/jenkins/jenkins-slave/workspace/HBase-0.94-security-on-Hadoop-23/trunk
&& /x1/jenkins/tools/java/jdk1.6.0_32-32/jre/bin/java -enableassertions -Xmx1900m
-Djava.security.egd=file:/dev/./urandom -jar /x1/jenkins/jenkins-slave/workspace/HBase-0.94-security-on-Hadoop-23/trunk/target/surefire/surefirebooter1931474689403904686.jar
/x1/jenkins/jenkins-slave/workspace/HBase-0.94-security-on-Hadoop-23/trunk/target/surefire/surefire7843991106927488738tmp
/x1/jenkins/jenkins-slave/workspace/HBase-0.94-security-on-Hadoop-23/trunk/target/surefire/surefire_1119185956402434210648tmp
Running org.apache.hadoop.hbase.util.TestFSTableDescriptors
Tests run: 10, Failures: 0, Errors: 0, Skipped: 0, Time elapsed: 1.786 sec
Forking command line: /bin/sh -c cd /x1/jenkins/jenkins-slave/workspace/HBase-0.94-security-on-Hadoop-23/trunk
&& /x1/jenkins/tools/java/jdk1.6.0_32-32/jre/bin/java -enableassertions -Xmx1900m
-Djava.security.egd=file:/dev/./urandom -jar /x1/jenkins/jenkins-slave/workspace/HBase-0.94-security-on-Hadoop-23/trunk/target/surefire/surefirebooter5009743832022660679.jar
/x1/jenkins/jenkins-slave/workspace/HBase-0.94-security-on-Hadoop-23/trunk/target/surefire/surefire8407583119359572486tmp
/x1/jenkins/jenkins-slave/workspace/HBase-0.94-security-on-Hadoop-23/trunk/target/surefire/surefire_1123607177855957434698tmp
Running org.apache.hadoop.hbase.replication.TestReplicationPeer
Tests run: 1, Failures: 0, Errors: 0, Skipped: 0, Time elapsed: 8.7 sec
Forking command line: /bin/sh -c cd /x1/jenkins/jenkins-slave/workspace/HBase-0.94-security-on-Hadoop-23/trunk
&& /x1/jenkins/tools/java/jdk1.6.0_32-32/jre/bin/java -enableassertions -Xmx1900m
-Djava.security.egd=file:/dev/./urandom -jar /x1/jenkins/jenkins-slave/workspace/HBase-0.94-security-on-Hadoop-23/trunk/target/surefire/surefirebooter5005028226545979600.jar
/x1/jenkins/jenkins-slave/workspace/HBase-0.94-security-on-Hadoop-23/trunk/target/surefire/surefire4109093207974286765tmp
/x1/jenkins/jenkins-slave/workspace/HBase-0.94-security-on-Hadoop-23/trunk/target/surefire/surefire_1136447713837648722648tmp
Running org.apache.hadoop.hbase.util.TestEnvironmentEdgeManager
Tests run: 2, Failures: 0, Errors: 0, Skipped: 0, Time elapsed: 0.992 sec
Forking command line: /bin/sh -c cd /x1/jenkins/jenkins-slave/workspace/HBase-0.94-security-on-Hadoop-23/trunk
&& /x1/jenkins/tools/java/jdk1.6.0_32-32/jre/bin/java -enableassertions -Xmx1900m
-Djava.security.egd=file:/dev/./urandom -jar /x1/jenkins/jenkins-slave/workspace/HBase-0.94-security-on-Hadoop-23/trunk/target/surefire/surefirebooter5211151099102804593.jar
/x1/jenkins/jenkins-slave/workspace/HBase-0.94-security-on-Hadoop-23/trunk/target/surefire/surefire6810790947404970363tmp
/x1/jenkins/jenkins-slave/workspace/HBase-0.94-security-on-Hadoop-23/trunk/target/surefire/surefire_114668548990947402211tmp
Running org.apache.hadoop.hbase.util.TestIdLock
Tests run: 1, Failures: 0, Errors: 0, Skipped: 0, Time elapsed: 16.624 sec
Forking command line: /bin/sh -c cd /x1/jenkins/jenkins-slave/workspace/HBase-0.94-security-on-Hadoop-23/trunk
&& /x1/jenkins/tools/java/jdk1.6.0_32-32/jre/bin/java -enableassertions -Xmx1900m
-Djava.security.egd=file:/dev/./urandom -jar /x1/jenkins/jenkins-slave/workspace/HBase-0.94-security-on-Hadoop-23/trunk/target/surefire/surefirebooter6252999916694288082.jar
/x1/jenkins/jenkins-slave/workspace/HBase-0.94-security-on-Hadoop-23/trunk/target/surefire/surefire8380162772629122228tmp
/x1/jenkins/jenkins-slave/workspace/HBase-0.94-security-on-Hadoop-23/trunk/target/surefire/surefire_1154875297256095712459tmp
Running org.apache.hadoop.hbase.util.TestMergeTable
Tests run: 1, Failures: 0, Errors: 0, Skipped: 0, Time elapsed: 30.891 sec
Forking command line: /bin/sh -c cd /x1/jenkins/jenkins-slave/workspace/HBase-0.94-security-on-Hadoop-23/trunk
&& /x1/jenkins/tools/java/jdk1.6.0_32-32/jre/bin/java -enableassertions -Xmx1900m
-Djava.security.egd=file:/dev/./urandom -jar /x1/jenkins/jenkins-slave/workspace/HBase-0.94-security-on-Hadoop-23/trunk/target/surefire/surefirebooter9021414275306745578.jar
/x1/jenkins/jenkins-slave/workspace/HBase-0.94-security-on-Hadoop-23/trunk/target/surefire/surefire725223851491720730tmp
/x1/jenkins/jenkins-slave/workspace/HBase-0.94-security-on-Hadoop-23/trunk/target/surefire/surefire_1169009484837627477939tmp
Running org.apache.hadoop.hbase.util.TestFSUtils
Tests run: 4, Failures: 0, Errors: 0, Skipped: 0, Time elapsed: 19.343 sec
Forking command line: /bin/sh -c cd /x1/jenkins/jenkins-slave/workspace/HBase-0.94-security-on-Hadoop-23/trunk
&& /x1/jenkins/tools/java/jdk1.6.0_32-32/jre/bin/java -enableassertions -Xmx1900m
-Djava.security.egd=file:/dev/./urandom -jar /x1/jenkins/jenkins-slave/workspace/HBase-0.94-security-on-Hadoop-23/trunk/target/surefire/surefirebooter7646491761965084814.jar
/x1/jenkins/jenkins-slave/workspace/HBase-0.94-security-on-Hadoop-23/trunk/target/surefire/surefire193897503163232290tmp
/x1/jenkins/jenkins-slave/workspace/HBase-0.94-security-on-Hadoop-23/trunk/target/surefire/surefire_1177533673574963122071tmp
Running org.apache.hadoop.hbase.util.TestPoolMap$TestRoundRobinPoolType
Tests run: 3, Failures: 0, Errors: 0, Skipped: 0, Time elapsed: 0.006 sec
Running org.apache.hadoop.hbase.util.TestPoolMap$TestThreadLocalPoolType
Tests run: 3, Failures: 0, Errors: 0, Skipped: 0, Time elapsed: 0.005 sec
Running org.apache.hadoop.hbase.util.TestPoolMap$TestReusablePoolType
Tests run: 3, Failures: 0, Errors: 0, Skipped: 0, Time elapsed: 0.112 sec
Forking command line: /bin/sh -c cd /x1/jenkins/jenkins-slave/workspace/HBase-0.94-security-on-Hadoop-23/trunk
&& /x1/jenkins/tools/java/jdk1.6.0_32-32/jre/bin/java -enableassertions -Xmx1900m
-Djava.security.egd=file:/dev/./urandom -jar /x1/jenkins/jenkins-slave/workspace/HBase-0.94-security-on-Hadoop-23/trunk/target/surefire/surefirebooter816441793917875122.jar
/x1/jenkins/jenkins-slave/workspace/HBase-0.94-security-on-Hadoop-23/trunk/target/surefire/surefire2808038504224862228tmp
/x1/jenkins/jenkins-slave/workspace/HBase-0.94-security-on-Hadoop-23/trunk/target/surefire/surefire_1188985556822676465408tmp
Running org.apache.hadoop.hbase.util.TestRegionSplitter
Tests run: 5, Failures: 0, Errors: 0, Skipped: 0, Time elapsed: 20.775 sec
Forking command line: /bin/sh -c cd /x1/jenkins/jenkins-slave/workspace/HBase-0.94-security-on-Hadoop-23/trunk
&& /x1/jenkins/tools/java/jdk1.6.0_32-32/jre/bin/java -enableassertions -Xmx1900m
-Djava.security.egd=file:/dev/./urandom -jar /x1/jenkins/jenkins-slave/workspace/HBase-0.94-security-on-Hadoop-23/trunk/target/surefire/surefirebooter1415103713774273902.jar
/x1/jenkins/jenkins-slave/workspace/HBase-0.94-security-on-Hadoop-23/trunk/target/surefire/surefire4743663955766118741tmp
/x1/jenkins/jenkins-slave/workspace/HBase-0.94-security-on-Hadoop-23/trunk/target/surefire/surefire_1192439162178524299316tmp
Running org.apache.hadoop.hbase.util.hbck.TestOfflineMetaRebuildBase
Tests run: 1, Failures: 0, Errors: 0, Skipped: 0, Time elapsed: 26.422 sec
Forking command line: /bin/sh -c cd /x1/jenkins/jenkins-slave/workspace/HBase-0.94-security-on-Hadoop-23/trunk
&& /x1/jenkins/tools/java/jdk1.6.0_32-32/jre/bin/java -enableassertions -Xmx1900m
-Djava.security.egd=file:/dev/./urandom -jar /x1/jenkins/jenkins-slave/workspace/HBase-0.94-security-on-Hadoop-23/trunk/target/surefire/surefirebooter2741900920697540136.jar
/x1/jenkins/jenkins-slave/workspace/HBase-0.94-security-on-Hadoop-23/trunk/target/surefire/surefire8693376760765908831tmp
/x1/jenkins/jenkins-slave/workspace/HBase-0.94-security-on-Hadoop-23/trunk/target/surefire/surefire_1203773226143474614087tmp
Running org.apache.hadoop.hbase.util.hbck.TestOfflineMetaRebuildOverlap
Tests run: 1, Failures: 0, Errors: 0, Skipped: 0, Time elapsed: 22.499 sec
Forking command line: /bin/sh -c cd /x1/jenkins/jenkins-slave/workspace/HBase-0.94-security-on-Hadoop-23/trunk
&& /x1/jenkins/tools/java/jdk1.6.0_32-32/jre/bin/java -enableassertions -Xmx1900m
-Djava.security.egd=file:/dev/./urandom -jar /x1/jenkins/jenkins-slave/workspace/HBase-0.94-security-on-Hadoop-23/trunk/target/surefire/surefirebooter7553176316839538592.jar
/x1/jenkins/jenkins-slave/workspace/HBase-0.94-security-on-Hadoop-23/trunk/target/surefire/surefire3891147622563255698tmp
/x1/jenkins/jenkins-slave/workspace/HBase-0.94-security-on-Hadoop-23/trunk/target/surefire/surefire_1215586791328066423019tmp
Running org.apache.hadoop.hbase.util.hbck.TestOfflineMetaRebuildHole
Tests run: 1, Failures: 0, Errors: 0, Skipped: 0, Time elapsed: 27.05 sec
Forking command line: /bin/sh -c cd /x1/jenkins/jenkins-slave/workspace/HBase-0.94-security-on-Hadoop-23/trunk
&& /x1/jenkins/tools/java/jdk1.6.0_32-32/jre/bin/java -enableassertions -Xmx1900m
-Djava.security.egd=file:/dev/./urandom -jar /x1/jenkins/jenkins-slave/workspace/HBase-0.94-security-on-Hadoop-23/trunk/target/surefire/surefirebooter8354366337235507874.jar
/x1/jenkins/jenkins-slave/workspace/HBase-0.94-security-on-Hadoop-23/trunk/target/surefire/surefire1803265175303860085tmp
/x1/jenkins/jenkins-slave/workspace/HBase-0.94-security-on-Hadoop-23/trunk/target/surefire/surefire_1224616384506772586486tmp
Running org.apache.hadoop.hbase.util.TestDefaultEnvironmentEdge
Tests run: 1, Failures: 0, Errors: 0, Skipped: 0, Time elapsed: 0.427 sec
Forking command line: /bin/sh -c cd /x1/jenkins/jenkins-slave/workspace/HBase-0.94-security-on-Hadoop-23/trunk
&& /x1/jenkins/tools/java/jdk1.6.0_32-32/jre/bin/java -enableassertions -Xmx1900m
-Djava.security.egd=file:/dev/./urandom -jar /x1/jenkins/jenkins-slave/workspace/HBase-0.94-security-on-Hadoop-23/trunk/target/surefire/surefirebooter7234984525304487117.jar
/x1/jenkins/jenkins-slave/workspace/HBase-0.94-security-on-Hadoop-23/trunk/target/surefire/surefire7295167866392759894tmp
/x1/jenkins/jenkins-slave/workspace/HBase-0.94-security-on-Hadoop-23/trunk/target/surefire/surefire_1232132363781419632168tmp
Running org.apache.hadoop.hbase.TestInfoServers
Tests run: 2, Failures: 0, Errors: 0, Skipped: 0, Time elapsed: 16.257 sec
Running org.apache.hadoop.hbase.util.TestHBaseFsck
Tests run: 19, Failures: 0, Errors: 0, Skipped: 0, Time elapsed: 183.799 sec

Results :

Failed tests:   testSimpleCase(org.apache.hadoop.hbase.mapreduce.TestImportExport)
  testWithDeletes(org.apache.hadoop.hbase.mapreduce.TestImportExport)

Tests in error: 
  testMROnTable(org.apache.hadoop.hbase.mapreduce.TestImportTsv): Failed to Start org.apache.hadoop.mapred.MiniMRCluster
  testLocalHBaseCluster(org.apache.hadoop.hbase.TestLocalHBaseCluster): Master not initialized
after 200 seconds

Tests run: 641, Failures: 2, Errors: 2, Skipped: 2

[INFO] ------------------------------------------------------------------------
[INFO] BUILD FAILURE
[INFO] ------------------------------------------------------------------------
[INFO] Total time: 40:59.188s
[INFO] Finished at: Thu Jul 05 18:17:13 UTC 2012
[INFO] Final Memory: 50M/580M
[INFO] ------------------------------------------------------------------------
[ERROR] Failed to execute goal org.apache.maven.plugins:maven-surefire-plugin:2.12-TRUNK-HBASE-2:test
(secondPartTestsExecution) on project hbase: There are test failures.
[ERROR] 
[ERROR] Please refer to /x1/jenkins/jenkins-slave/workspace/HBase-0.94-security-on-Hadoop-23/trunk/target/surefire-reports
for the individual test results.
[ERROR] -> [Help 1]
org.apache.maven.lifecycle.LifecycleExecutionException: Failed to execute goal org.apache.maven.plugins:maven-surefire-plugin:2.12-TRUNK-HBASE-2:test
(secondPartTestsExecution) on project hbase: There are test failures.

Please refer to /x1/jenkins/jenkins-slave/workspace/HBase-0.94-security-on-Hadoop-23/trunk/target/surefire-reports
for the individual test results.
	at org.apache.maven.lifecycle.internal.MojoExecutor.execute(MojoExecutor.java:213)
	at org.apache.maven.lifecycle.internal.MojoExecutor.execute(MojoExecutor.java:153)
	at org.apache.maven.lifecycle.internal.MojoExecutor.execute(MojoExecutor.java:145)
	at org.apache.maven.lifecycle.internal.MojoExecutor.executeForkedExecutions(MojoExecutor.java:365)
	at org.apache.maven.lifecycle.internal.MojoExecutor.execute(MojoExecutor.java:199)
	at org.apache.maven.lifecycle.internal.MojoExecutor.execute(MojoExecutor.java:153)
	at org.apache.maven.lifecycle.internal.MojoExecutor.execute(MojoExecutor.java:145)
	at org.apache.maven.lifecycle.internal.LifecycleModuleBuilder.buildProject(LifecycleModuleBuilder.java:84)
	at org.apache.maven.lifecycle.internal.LifecycleModuleBuilder.buildProject(LifecycleModuleBuilder.java:59)
	at org.apache.maven.lifecycle.internal.LifecycleStarter.singleThreadedBuild(LifecycleStarter.java:183)
	at org.apache.maven.lifecycle.internal.LifecycleStarter.execute(LifecycleStarter.java:161)
	at org.apache.maven.DefaultMaven.doExecute(DefaultMaven.java:319)
	at org.apache.maven.DefaultMaven.execute(DefaultMaven.java:156)
	at org.apache.maven.cli.MavenCli.execute(MavenCli.java:537)
	at org.apache.maven.cli.MavenCli.doMain(MavenCli.java:196)
	at org.apache.maven.cli.MavenCli.main(MavenCli.java:141)
	at sun.reflect.NativeMethodAccessorImpl.invoke0(Native Method)
	at sun.reflect.NativeMethodAccessorImpl.invoke(NativeMethodAccessorImpl.java:39)
	at sun.reflect.DelegatingMethodAccessorImpl.invoke(DelegatingMethodAccessorImpl.java:25)
	at java.lang.reflect.Method.invoke(Method.java:597)
	at org.codehaus.plexus.classworlds.launcher.Launcher.launchEnhanced(Launcher.java:290)
	at org.codehaus.plexus.classworlds.launcher.Launcher.launch(Launcher.java:230)
	at org.codehaus.plexus.classworlds.launcher.Launcher.mainWithExitCode(Launcher.java:409)
	at org.codehaus.plexus.classworlds.launcher.Launcher.main(Launcher.java:352)
Caused by: org.apache.maven.plugin.MojoFailureException: There are test failures.

Please refer to /x1/jenkins/jenkins-slave/workspace/HBase-0.94-security-on-Hadoop-23/trunk/target/surefire-reports
for the individual test results.
	at org.apache.maven.plugin.surefire.SurefireHelper.reportExecution(SurefireHelper.java:87)
	at org.apache.maven.plugin.surefire.SurefirePlugin.writeSummary(SurefirePlugin.java:651)
	at org.apache.maven.plugin.surefire.SurefirePlugin.handleSummary(SurefirePlugin.java:625)
	at org.apache.maven.plugin.surefire.AbstractSurefireMojo.executeAfterPreconditionsChecked(AbstractSurefireMojo.java:137)
	at org.apache.maven.plugin.surefire.AbstractSurefireMojo.execute(AbstractSurefireMojo.java:98)
	at org.apache.maven.plugin.DefaultBuildPluginManager.executeMojo(DefaultBuildPluginManager.java:101)
	at org.apache.maven.lifecycle.internal.MojoExecutor.execute(MojoExecutor.java:209)
	... 23 more
[ERROR] 
[ERROR] 
[ERROR] For more information about the errors and possible solutions, please read the following
articles:
[ERROR] [Help 1] http://cwiki.apache.org/confluence/display/MAVEN/MojoFailureException
Build step 'Invoke top-level Maven targets' marked build as failure
Archiving artifacts
Updating HBASE-6326
Updating HBASE-6314
Recording test results

Mime
View raw message