hbase-dev mailing list archives

Site index · List index
Message view « Date » · « Thread »
Top « Date » · « Thread »
From Apache Jenkins Server <jenk...@builds.apache.org>
Subject Build failed in Jenkins: HBase-0.94 #379
Date Tue, 31 Jul 2012 22:07:32 GMT
See <https://builds.apache.org/job/HBase-0.94/379/changes>

Changes:

[larsh] HBASE-6427 addendum

------------------------------------------
[...truncated 604 lines...]
Tests run: 1, Failures: 0, Errors: 0, Skipped: 0, Time elapsed: 18.856 sec
Running org.apache.hadoop.hbase.regionserver.TestRegionServerMetrics
Tests run: 3, Failures: 0, Errors: 0, Skipped: 0, Time elapsed: 56.659 sec
Running org.apache.hadoop.hbase.regionserver.TestEndToEndSplitTransaction
Tests run: 2, Failures: 0, Errors: 0, Skipped: 0, Time elapsed: 58.865 sec
Running org.apache.hadoop.hbase.regionserver.metrics.TestSchemaMetrics
Tests run: 6, Failures: 0, Errors: 0, Skipped: 0, Time elapsed: 15.637 sec
Running org.apache.hadoop.hbase.regionserver.TestStoreFileBlockCacheSummary
Tests run: 1, Failures: 0, Errors: 0, Skipped: 0, Time elapsed: 18.686 sec
Running org.apache.hadoop.hbase.regionserver.TestBlocksRead
Tests run: 4, Failures: 0, Errors: 0, Skipped: 0, Time elapsed: 1.114 sec
Running org.apache.hadoop.hbase.regionserver.TestSplitTransactionOnCluster
Tests run: 7, Failures: 0, Errors: 0, Skipped: 0, Time elapsed: 112.388 sec
Running org.apache.hadoop.hbase.regionserver.TestHRegion
Tests run: 66, Failures: 0, Errors: 0, Skipped: 0, Time elapsed: 51.094 sec
Running org.apache.hadoop.hbase.regionserver.TestFSErrorsExposed
Tests run: 3, Failures: 0, Errors: 0, Skipped: 0, Time elapsed: 34.23 sec
Running org.apache.hadoop.hbase.regionserver.wal.TestLogRollingNoCluster
Tests run: 1, Failures: 0, Errors: 0, Skipped: 0, Time elapsed: 2.359 sec
Running org.apache.hadoop.hbase.regionserver.TestCompactionWithCoprocessor
Tests run: 15, Failures: 0, Errors: 0, Skipped: 0, Time elapsed: 40.813 sec
Running org.apache.hadoop.hbase.regionserver.wal.TestLogRollAbort
Tests run: 1, Failures: 0, Errors: 0, Skipped: 0, Time elapsed: 20.475 sec
Running org.apache.hadoop.hbase.regionserver.wal.TestWALReplay
Tests run: 6, Failures: 0, Errors: 0, Skipped: 0, Time elapsed: 37.175 sec
Running org.apache.hadoop.hbase.regionserver.wal.TestWALReplayCompressed
Tests run: 6, Failures: 0, Errors: 0, Skipped: 0, Time elapsed: 38.558 sec
Running org.apache.hadoop.hbase.regionserver.wal.TestHLog
Tests run: 10, Failures: 0, Errors: 0, Skipped: 0, Time elapsed: 63.219 sec
Running org.apache.hadoop.hbase.regionserver.wal.TestHLogBench
Tests run: 1, Failures: 0, Errors: 0, Skipped: 0, Time elapsed: 1.3 sec
Running org.apache.hadoop.hbase.regionserver.handler.TestCloseRegionHandler
Tests run: 3, Failures: 0, Errors: 0, Skipped: 0, Time elapsed: 1.353 sec
Running org.apache.hadoop.hbase.regionserver.handler.TestOpenRegionHandler
Tests run: 3, Failures: 0, Errors: 0, Skipped: 0, Time elapsed: 1.088 sec
Running org.apache.hadoop.hbase.filter.TestColumnRangeFilter
Tests run: 1, Failures: 0, Errors: 0, Skipped: 0, Time elapsed: 16.669 sec
Running org.apache.hadoop.hbase.regionserver.TestHRegionServerBulkLoad
Tests run: 1, Failures: 0, Errors: 0, Skipped: 0, Time elapsed: 49.17 sec
Running org.apache.hadoop.hbase.coprocessor.TestClassLoading
Tests run: 6, Failures: 0, Errors: 0, Skipped: 0, Time elapsed: 31.233 sec
Running org.apache.hadoop.hbase.coprocessor.TestAggregateProtocol
Tests run: 45, Failures: 0, Errors: 0, Skipped: 0, Time elapsed: 15.562 sec
Running org.apache.hadoop.hbase.coprocessor.TestRegionServerCoprocessorExceptionWithRemove
Tests run: 1, Failures: 0, Errors: 0, Skipped: 0, Time elapsed: 17.168 sec
Running org.apache.hadoop.hbase.coprocessor.TestRegionServerCoprocessorExceptionWithAbort
Tests run: 1, Failures: 0, Errors: 0, Skipped: 0, Time elapsed: 15.367 sec
Running org.apache.hadoop.hbase.coprocessor.TestMasterObserver
Tests run: 3, Failures: 0, Errors: 0, Skipped: 0, Time elapsed: 27.881 sec
Running org.apache.hadoop.hbase.coprocessor.TestCoprocessorEndpoint
Tests run: 3, Failures: 0, Errors: 0, Skipped: 1, Time elapsed: 29.644 sec
Running org.apache.hadoop.hbase.coprocessor.TestWALObserver
Tests run: 3, Failures: 0, Errors: 0, Skipped: 0, Time elapsed: 16.137 sec
Running org.apache.hadoop.hbase.regionserver.wal.TestHLogSplit
Tests run: 30, Failures: 0, Errors: 0, Skipped: 1, Time elapsed: 239.277 sec
Running org.apache.hadoop.hbase.coprocessor.TestMasterCoprocessorExceptionWithAbort
Tests run: 1, Failures: 0, Errors: 0, Skipped: 0, Time elapsed: 10.401 sec
Running org.apache.hadoop.hbase.coprocessor.TestMasterCoprocessorExceptionWithRemove
Tests run: 1, Failures: 0, Errors: 0, Skipped: 0, Time elapsed: 20.291 sec
Running org.apache.hadoop.hbase.coprocessor.TestRegionObserverBypass
Tests run: 2, Failures: 0, Errors: 0, Skipped: 0, Time elapsed: 13.185 sec
Running org.apache.hadoop.hbase.coprocessor.TestRegionObserverInterface
Tests run: 7, Failures: 0, Errors: 0, Skipped: 0, Time elapsed: 45.317 sec
Running org.apache.hadoop.hbase.mapred.TestTableInputFormat
Tests run: 10, Failures: 0, Errors: 0, Skipped: 0, Time elapsed: 31.766 sec
Running org.apache.hadoop.hbase.TestGlobalMemStoreSize
Tests run: 1, Failures: 0, Errors: 0, Skipped: 0, Time elapsed: 17.285 sec
Running org.apache.hadoop.hbase.mapreduce.TestHLogRecordReader
Tests run: 2, Failures: 0, Errors: 0, Skipped: 0, Time elapsed: 5.878 sec
Running org.apache.hadoop.hbase.mapred.TestTableMapReduce
Tests run: 1, Failures: 0, Errors: 0, Skipped: 0, Time elapsed: 92.769 sec
Running org.apache.hadoop.hbase.mapreduce.TestTableMapReduce
Tests run: 1, Failures: 0, Errors: 0, Skipped: 0, Time elapsed: 117.511 sec
Running org.apache.hadoop.hbase.mapreduce.TestLoadIncrementalHFilesSplitRecovery
Tests run: 4, Failures: 0, Errors: 0, Skipped: 0, Time elapsed: 113.767 sec
Running org.apache.hadoop.hbase.mapreduce.TestWALPlayer
Tests run: 1, Failures: 0, Errors: 0, Skipped: 0, Time elapsed: 45.083 sec
Running org.apache.hadoop.hbase.regionserver.wal.TestLogRolling
Tests run: 3, Failures: 0, Errors: 0, Skipped: 0, Time elapsed: 406.977 sec
Running org.apache.hadoop.hbase.mapreduce.TestImportTsv
Tests run: 9, Failures: 0, Errors: 0, Skipped: 0, Time elapsed: 166.263 sec
Running org.apache.hadoop.hbase.mapreduce.TestMultithreadedTableMapper
Tests run: 1, Failures: 0, Errors: 0, Skipped: 0, Time elapsed: 128.513 sec
Running org.apache.hadoop.hbase.mapreduce.TestHFileOutputFormat
Tests run: 9, Failures: 0, Errors: 0, Skipped: 0, Time elapsed: 251.994 sec
Running org.apache.hadoop.hbase.mapreduce.TestTimeRangeMapRed
Tests run: 1, Failures: 0, Errors: 0, Skipped: 0, Time elapsed: 41.223 sec
Running org.apache.hadoop.hbase.mapreduce.TestLoadIncrementalHFiles
Tests run: 6, Failures: 0, Errors: 0, Skipped: 0, Time elapsed: 37.283 sec
Running org.apache.hadoop.hbase.thrift2.TestThriftHBaseServiceHandler
Tests run: 12, Failures: 0, Errors: 0, Skipped: 0, Time elapsed: 16.73 sec
Running org.apache.hadoop.hbase.catalog.TestMetaReaderEditorNoCluster
Tests run: 1, Failures: 0, Errors: 0, Skipped: 0, Time elapsed: 4.17 sec
Running org.apache.hadoop.hbase.mapreduce.TestImportExport
Tests run: 2, Failures: 0, Errors: 0, Skipped: 0, Time elapsed: 51.274 sec
Running org.apache.hadoop.hbase.catalog.TestMetaReaderEditor
Tests run: 5, Failures: 0, Errors: 0, Skipped: 0, Time elapsed: 27.473 sec
Running org.apache.hadoop.hbase.catalog.TestCatalogTracker
Tests run: 10, Failures: 0, Errors: 0, Skipped: 1, Time elapsed: 8.704 sec
Running org.apache.hadoop.hbase.client.TestTimestampsFilter
Tests run: 3, Failures: 0, Errors: 0, Skipped: 0, Time elapsed: 23.129 sec
Running org.apache.hadoop.hbase.TestAcidGuarantees
Tests run: 3, Failures: 0, Errors: 0, Skipped: 0, Time elapsed: 104.456 sec
Running org.apache.hadoop.hbase.catalog.TestCatalogTrackerOnCluster
Tests run: 1, Failures: 0, Errors: 0, Skipped: 0, Time elapsed: 78.898 sec
Running org.apache.hadoop.hbase.client.TestHCM
Tests run: 6, Failures: 0, Errors: 0, Skipped: 0, Time elapsed: 20.904 sec
Running org.apache.hadoop.hbase.client.TestScannerTimeout
Tests run: 4, Failures: 0, Errors: 0, Skipped: 0, Time elapsed: 46.656 sec
Running org.apache.hadoop.hbase.client.TestShell
Tests run: 1, Failures: 0, Errors: 0, Skipped: 0, Time elapsed: 90.236 sec
Running org.apache.hadoop.hbase.client.TestMetaScanner
Tests run: 1, Failures: 0, Errors: 0, Skipped: 0, Time elapsed: 18.119 sec
Running org.apache.hadoop.hbase.client.TestHTableUtil
Tests run: 2, Failures: 0, Errors: 0, Skipped: 0, Time elapsed: 13.105 sec
Running org.apache.hadoop.hbase.client.TestMetaMigrationRemovingHTD
Tests run: 3, Failures: 0, Errors: 0, Skipped: 0, Time elapsed: 26.939 sec
Running org.apache.hadoop.hbase.client.TestHTablePool$TestHTableReusablePool
Tests run: 9, Failures: 0, Errors: 0, Skipped: 0, Time elapsed: 8.131 sec
Running org.apache.hadoop.hbase.client.TestHTablePool$TestHTableThreadLocalPool
Tests run: 9, Failures: 0, Errors: 0, Skipped: 0, Time elapsed: 25.342 sec
Running org.apache.hadoop.hbase.client.TestFromClientSide
Tests run: 55, Failures: 0, Errors: 0, Skipped: 3, Time elapsed: 179.829 sec
Running org.apache.hadoop.hbase.client.replication.TestReplicationAdmin
Tests run: 1, Failures: 0, Errors: 0, Skipped: 0, Time elapsed: 1.026 sec
Running org.apache.hadoop.hbase.client.TestMultipleTimestamps
Tests run: 8, Failures: 0, Errors: 0, Skipped: 0, Time elapsed: 30.476 sec
Running org.apache.hadoop.hbase.client.TestMultiParallel
Tests run: 11, Failures: 0, Errors: 0, Skipped: 0, Time elapsed: 32.332 sec
Running org.apache.hadoop.hbase.metrics.TestMetricsMBeanBase
Tests run: 2, Failures: 0, Errors: 0, Skipped: 0, Time elapsed: 1.12 sec
Running org.apache.hadoop.hbase.constraint.TestConstraint
Tests run: 5, Failures: 0, Errors: 0, Skipped: 0, Time elapsed: 31.67 sec
Running org.apache.hadoop.hbase.client.TestFromClientSideWithCoprocessor
Tests run: 55, Failures: 0, Errors: 0, Skipped: 3, Time elapsed: 180.878 sec
Running org.apache.hadoop.hbase.rest.TestGzipFilter
Tests run: 3, Failures: 0, Errors: 0, Skipped: 0, Time elapsed: 14.948 sec
Running org.apache.hadoop.hbase.rest.TestMultiRowResource
Tests run: 3, Failures: 0, Errors: 0, Skipped: 0, Time elapsed: 15.241 sec
Running org.apache.hadoop.hbase.rest.TestScannersWithFilters
Tests run: 10, Failures: 0, Errors: 0, Skipped: 0, Time elapsed: 17.793 sec
Running org.apache.hadoop.hbase.rest.TestRowResource
Tests run: 11, Failures: 0, Errors: 0, Skipped: 0, Time elapsed: 16.898 sec
Running org.apache.hadoop.hbase.rest.client.TestRemoteTable
Tests run: 3, Failures: 0, Errors: 0, Skipped: 0, Time elapsed: 19.397 sec
Running org.apache.hadoop.hbase.rest.client.TestRemoteAdmin
Tests run: 1, Failures: 0, Errors: 0, Skipped: 0, Time elapsed: 22.088 sec
Running org.apache.hadoop.hbase.rest.TestVersionResource
Tests run: 7, Failures: 0, Errors: 0, Skipped: 0, Time elapsed: 11.647 sec
Running org.apache.hadoop.hbase.mapreduce.TestTableInputFormatScan
Tests run: 12, Failures: 0, Errors: 0, Skipped: 0, Time elapsed: 602.247 sec
Running org.apache.hadoop.hbase.rest.TestScannerResource
Tests run: 5, Failures: 0, Errors: 0, Skipped: 0, Time elapsed: 27.766 sec
Running org.apache.hadoop.hbase.rest.TestStatusResource
Tests run: 2, Failures: 0, Errors: 0, Skipped: 0, Time elapsed: 13.902 sec
Running org.apache.hadoop.hbase.rest.TestTableResource
Tests run: 8, Failures: 0, Errors: 0, Skipped: 0, Time elapsed: 24.445 sec
Running org.apache.hadoop.hbase.rest.TestSchemaResource
Tests run: 2, Failures: 0, Errors: 0, Skipped: 0, Time elapsed: 18.481 sec
Running org.apache.hadoop.hbase.client.TestAdmin
Tests run: 38, Failures: 0, Errors: 0, Skipped: 0, Time elapsed: 186.625 sec
Running org.apache.hadoop.hbase.io.encoding.TestLoadAndSwitchEncodeOnDisk
Tests run: 1, Failures: 0, Errors: 0, Skipped: 0, Time elapsed: 27.296 sec
Running org.apache.hadoop.hbase.thrift.TestThriftServer
Tests run: 1, Failures: 0, Errors: 0, Skipped: 0, Time elapsed: 42.632 sec
Running org.apache.hadoop.hbase.io.encoding.TestUpgradeFromHFileV1ToEncoding
Tests run: 1, Failures: 0, Errors: 0, Skipped: 0, Time elapsed: 83.192 sec
Running org.apache.hadoop.hbase.io.hfile.TestHFileSeek
Tests run: 1, Failures: 0, Errors: 0, Skipped: 0, Time elapsed: 8.574 sec
Running org.apache.hadoop.hbase.io.hfile.slab.TestSlabCache
Tests run: 7, Failures: 0, Errors: 0, Skipped: 0, Time elapsed: 18.704 sec
Running org.apache.hadoop.hbase.io.encoding.TestDataBlockEncoders
Tests run: 12, Failures: 0, Errors: 0, Skipped: 0, Time elapsed: 142.881 sec
Running org.apache.hadoop.hbase.io.hfile.slab.TestSingleSizeCache
Tests run: 5, Failures: 0, Errors: 0, Skipped: 0, Time elapsed: 26.973 sec
Running org.apache.hadoop.hbase.io.hfile.TestChecksum
Tests run: 3, Failures: 0, Errors: 0, Skipped: 0, Time elapsed: 0.886 sec
Running org.apache.hadoop.hbase.io.hfile.TestLruBlockCache
Tests run: 16, Failures: 0, Errors: 0, Skipped: 0, Time elapsed: 0.743 sec
Running org.apache.hadoop.hbase.io.hfile.TestHFilePerformance
Tests run: 1, Failures: 0, Errors: 0, Skipped: 0, Time elapsed: 6.838 sec
Running org.apache.hadoop.hbase.io.hfile.TestFixedFileTrailer
Tests run: 2, Failures: 0, Errors: 0, Skipped: 0, Time elapsed: 0.58 sec
Running org.apache.hadoop.hbase.io.hfile.TestHFileBlockIndex
Tests run: 10, Failures: 0, Errors: 0, Skipped: 0, Time elapsed: 10.5 sec
Running org.apache.hadoop.hbase.io.hfile.TestHFileBlockCompatibility
Tests run: 10, Failures: 0, Errors: 0, Skipped: 0, Time elapsed: 1.17 sec
Running org.apache.hadoop.hbase.io.hfile.TestHFileBlock
Tests run: 16, Failures: 0, Errors: 0, Skipped: 0, Time elapsed: 48.249 sec
Running org.apache.hadoop.hbase.io.hfile.TestForceCacheImportantBlocks
Tests run: 4, Failures: 0, Errors: 0, Skipped: 0, Time elapsed: 66.341 sec
Running org.apache.hadoop.hbase.io.hfile.TestCacheOnWrite
Tests run: 36, Failures: 0, Errors: 0, Skipped: 0, Time elapsed: 36.103 sec
Running org.apache.hadoop.hbase.TestClusterBootOrder
Tests run: 2, Failures: 0, Errors: 0, Skipped: 0, Time elapsed: 29.75 sec
Running org.apache.hadoop.hbase.io.encoding.TestChangingEncoding
Tests run: 4, Failures: 0, Errors: 0, Skipped: 0, Time elapsed: 257.091 sec
Running org.apache.hadoop.hbase.replication.regionserver.TestReplicationSourceManager
Tests run: 1, Failures: 0, Errors: 0, Skipped: 0, Time elapsed: 1.157 sec
Running org.apache.hadoop.hbase.replication.regionserver.TestReplicationSink
Tests run: 5, Failures: 0, Errors: 0, Skipped: 0, Time elapsed: 17.246 sec
Running org.apache.hadoop.hbase.avro.TestAvroServer
Tests run: 3, Failures: 0, Errors: 0, Skipped: 0, Time elapsed: 30.449 sec
Running org.apache.hadoop.hbase.replication.TestReplicationSource
Tests run: 1, Failures: 0, Errors: 0, Skipped: 0, Time elapsed: 2.813 sec
Running org.apache.hadoop.hbase.replication.TestReplicationZookeeper
Tests run: 1, Failures: 0, Errors: 0, Skipped: 0, Time elapsed: 0.671 sec
Running org.apache.hadoop.hbase.replication.TestMultiSlaveReplication
Tests run: 1, Failures: 0, Errors: 0, Skipped: 0, Time elapsed: 46.236 sec
Running org.apache.hadoop.hbase.ipc.TestDelayedRpc
Tests run: 4, Failures: 0, Errors: 0, Skipped: 0, Time elapsed: 2.496 sec
Running org.apache.hadoop.hbase.TestZooKeeper
Tests run: 7, Failures: 0, Errors: 0, Skipped: 0, Time elapsed: 22.25 sec
Running org.apache.hadoop.hbase.replication.TestMasterReplication
Tests run: 2, Failures: 0, Errors: 0, Skipped: 0, Time elapsed: 69.748 sec
Running org.apache.hadoop.hbase.thrift.TestThriftServerCmdLine
Tests run: 20, Failures: 0, Errors: 0, Skipped: 0, Time elapsed: 397.126 sec
Running org.apache.hadoop.hbase.TestHBaseTestingUtility
Tests run: 7, Failures: 0, Errors: 0, Skipped: 0, Time elapsed: 62.368 sec
Running org.apache.hadoop.hbase.replication.TestReplication
Tests run: 10, Failures: 1, Errors: 0, Skipped: 0, Time elapsed: 182.602 sec <<<
FAILURE!

Results :

Failed tests:   queueFailover(org.apache.hadoop.hbase.replication.TestReplication): Waited
too much time for queueFailover replication

Tests run: 1024, Failures: 1, Errors: 0, Skipped: 12

[INFO] ------------------------------------------------------------------------
[INFO] BUILD FAILURE
[INFO] ------------------------------------------------------------------------
[INFO] Total time: 41:03.710s
[INFO] Finished at: Tue Jul 31 22:06:52 UTC 2012
[INFO] Final Memory: 46M/558M
[INFO] ------------------------------------------------------------------------
[ERROR] Failed to execute goal org.apache.maven.plugins:maven-surefire-plugin:2.12-TRUNK-HBASE-2:test
(secondPartTestsExecution) on project hbase: There are test failures.
[ERROR] 
[ERROR] Please refer to <https://builds.apache.org/job/HBase-0.94/ws/trunk/target/surefire-reports>
for the individual test results.
[ERROR] -> [Help 1]
[ERROR] 
[ERROR] To see the full stack trace of the errors, re-run Maven with the -e switch.
[ERROR] Re-run Maven using the -X switch to enable full debug logging.
[ERROR] 
[ERROR] For more information about the errors and possible solutions, please read the following
articles:
[ERROR] [Help 1] http://cwiki.apache.org/confluence/display/MAVEN/MojoFailureException
Build step 'Invoke top-level Maven targets' marked build as failure
Archiving artifacts
Updating HBASE-6427
Recording test results

Mime
View raw message