hbase-dev mailing list archives

Site index · List index
Message view « Date » · « Thread »
Top « Date » · « Thread »
From Apache Jenkins Server <jenk...@builds.apache.org>
Subject Build failed in Jenkins: HBase-TRUNK #3058
Date Fri, 22 Jun 2012 17:58:09 GMT
See <https://builds.apache.org/job/HBase-TRUNK/3058/changes>

Changes:

[jxiang] HBASE-6206 Large tests fail with jdk1.7

------------------------------------------
[...truncated 2406 lines...]
41 KB   16 KB   
42 KB   16 KB   
42 KB   16 KB   
43 KB   16 KB   
43 KB   16 KB   
44 KB   16 KB   
44 KB   16 KB   
45 KB   16 KB   
45 KB   16 KB   
46 KB   16 KB   
46 KB   16 KB   
47 KB   16 KB   
47 KB           
48 KB   
48 KB   
49 KB   
49 KB   
50 KB   
50 KB   
51 KB   
51 KB   
                
Downloaded: http://repo1.maven.org/maven2/com/stumbleupon/async/1.2.0/async-1.2.0.jar (16
KB at 415.2 KB/sec)
52 KB   
52 KB   
53 KB   
53 KB   
54 KB   
54 KB   
55 KB   
55 KB   
56 KB   
56 KB   
57 KB   
57 KB   
58 KB   
58 KB   
59 KB   
59 KB   
60 KB   
60 KB   
61 KB   
61 KB   
62 KB   
62 KB   
63 KB   
63 KB   
64 KB   
64 KB   
65 KB   
66 KB   
66 KB   
67 KB   
67 KB   
68 KB   
68 KB   
69 KB   
69 KB   
70 KB   
70 KB   
71 KB   
71 KB   
72 KB   
72 KB   
73 KB   
73 KB   
74 KB   
75 KB   
75 KB   
76 KB   
76 KB   
77 KB   
77 KB   
78 KB   
78 KB   
79 KB   
79 KB   
80 KB   
80 KB   
81 KB   
81 KB   
82 KB   
82 KB   
83 KB   
83 KB   
84 KB   
84 KB   
85 KB   
85 KB   
86 KB   
86 KB   
87 KB   
87 KB   
88 KB   
88 KB   
89 KB   
89 KB   
90 KB   
91 KB   
91 KB   
92 KB   
92 KB   
93 KB   
93 KB   
94 KB   
94 KB   
95 KB   
95 KB   
96 KB   
96 KB   
97 KB   
97 KB   
98 KB   
98 KB   
99 KB   
99 KB   
100 KB   
100 KB   
101 KB   
101 KB   
102 KB   
103 KB   
103 KB   
104 KB   
104 KB   
105 KB   
105 KB   
106 KB   
106 KB   
107 KB   
107 KB   
108 KB   
108 KB   
109 KB   
109 KB   
110 KB   
110 KB   
111 KB   
111 KB   
112 KB   
112 KB   
113 KB   
113 KB   
114 KB   
114 KB   
115 KB   
115 KB   
116 KB   
116 KB   
117 KB   
117 KB   
118 KB   
118 KB   
119 KB   
119 KB   
120 KB   
120 KB   
121 KB   
121 KB   
122 KB   
122 KB   
123 KB   
123 KB   
124 KB   
125 KB   
125 KB   
126 KB   
126 KB   
127 KB   
127 KB   
128 KB   
128 KB   
129 KB   
129 KB   
130 KB   
130 KB   
131 KB   
131 KB   
132 KB   
132 KB   
133 KB   
133 KB   
134 KB   
134 KB   
135 KB   
135 KB   
136 KB   
136 KB   
137 KB   
137 KB   
138 KB   
138 KB   
139 KB   
139 KB   
140 KB   
140 KB   
141 KB   
141 KB   
142 KB   
142 KB   
143 KB   
143 KB   
144 KB   
145 KB   
145 KB   
146 KB   
146 KB   
147 KB   
148 KB   
149 KB   
151 KB   
153 KB   
155 KB   
157 KB   
157 KB   
         
Downloaded: http://repo1.maven.org/maven2/org/hbase/asynchbase/1.3.1/asynchbase-1.3.1.jar
(157 KB at 2903.3 KB/sec)
[INFO]                                                                         
[INFO] ------------------------------------------------------------------------
[INFO] Skipping HBase
[INFO] This project has been banned from the build due to previous failures.
[INFO] ------------------------------------------------------------------------
[INFO] ------------------------------------------------------------------------
[INFO] Reactor Summary:
[INFO] 
[INFO] HBase ............................................. FAILURE [23.747s]
[INFO] HBase - Common .................................... SKIPPED
[INFO] HBase - Server .................................... SKIPPED
[INFO] ------------------------------------------------------------------------
[INFO] BUILD FAILURE
[INFO] ------------------------------------------------------------------------
[INFO] Total time: 24.474s
[INFO] Finished at: Fri Jun 22 17:58:07 UTC 2012
[INFO] Final Memory: 14M/114M
[INFO] ------------------------------------------------------------------------
[ERROR] Failed to execute goal on project hbase-server: Could not resolve dependencies for
project org.apache.hbase:hbase-server:jar:0.95-SNAPSHOT: Could not find artifact org.apache.hbase:hbase-common:jar:0.95-SNAPSHOT
in cloudbees netty (http://repository-netty.forge.cloudbees.com/snapshot/) -> [Help 1]
[ERROR] 
[ERROR] To see the full stack trace of the errors, re-run Maven with the -e switch.
[ERROR] Re-run Maven using the -X switch to enable full debug logging.
[ERROR] 
[ERROR] For more information about the errors and possible solutions, please read the following
articles:
[ERROR] [Help 1] http://cwiki.apache.org/confluence/display/MAVEN/DependencyResolutionException
[ERROR] 
[ERROR] After correcting the problems, you can resume the build with the command
[ERROR]   mvn <goals> -rf :hbase-server
Build step 'Invoke top-level Maven targets' marked build as failure
Archiving artifacts
Recording test results
Updating HBASE-6206

Mime
View raw message