hbase-dev mailing list archives

Site index · List index
Message view « Date » · « Thread »
Top « Date » · « Thread »
From Apache Jenkins Server <jenk...@builds.apache.org>
Subject Build failed in Jenkins: HBase-TRUNK #2972
Date Sat, 02 Jun 2012 00:20:41 GMT
See <https://builds.apache.org/job/HBase-TRUNK/2972/changes>

Changes:

[tedyu] HBASE-6138 HadoopQA not running findbugs [Trunk] (Anoop Sam John)

[stack] HBASE-5936 Add Column-level PB-based calls to HMasterInterface

------------------------------------------
[...truncated 7276 lines...]
Running org.apache.hadoop.hbase.regionserver.TestSeekOptimizations
Tests run: 6, Failures: 0, Errors: 0, Skipped: 0, Time elapsed: 2.987 sec
Forking command line: /bin/sh -c cd <https://builds.apache.org/job/HBase-TRUNK/ws/trunk/hbase-server>
&& /home/hudson/tools/java/jdk1.6.0_27-32/jre/bin/java -enableassertions -Xmx1900m
-Djava.security.egd=file:/dev/./urandom -jar <https://builds.apache.org/job/HBase-TRUNK/ws/trunk/hbase-server/target/surefire/surefirebooter2596032485980213956.jar>
<https://builds.apache.org/job/HBase-TRUNK/ws/trunk/hbase-server/target/surefire/surefire685628647982167401tmp>
<https://builds.apache.org/job/HBase-TRUNK/ws/trunk/hbase-server/target/surefire/surefire_1285933035634116684905tmp>
Running org.apache.hadoop.hbase.regionserver.metrics.TestSchemaMetrics
Tests run: 6, Failures: 0, Errors: 0, Skipped: 0, Time elapsed: 15.692 sec
Forking command line: /bin/sh -c cd <https://builds.apache.org/job/HBase-TRUNK/ws/trunk/hbase-server>
&& /home/hudson/tools/java/jdk1.6.0_27-32/jre/bin/java -enableassertions -Xmx1900m
-Djava.security.egd=file:/dev/./urandom -jar <https://builds.apache.org/job/HBase-TRUNK/ws/trunk/hbase-server/target/surefire/surefirebooter3244282324627753262.jar>
<https://builds.apache.org/job/HBase-TRUNK/ws/trunk/hbase-server/target/surefire/surefire4015141187046781470tmp>
<https://builds.apache.org/job/HBase-TRUNK/ws/trunk/hbase-server/target/surefire/surefire_129835208437621047541tmp>
Running org.apache.hadoop.hbase.regionserver.TestFSErrorsExposed
Tests run: 3, Failures: 0, Errors: 0, Skipped: 0, Time elapsed: 36.95 sec
Forking command line: /bin/sh -c cd <https://builds.apache.org/job/HBase-TRUNK/ws/trunk/hbase-server>
&& /home/hudson/tools/java/jdk1.6.0_27-32/jre/bin/java -enableassertions -Xmx1900m
-Djava.security.egd=file:/dev/./urandom -jar <https://builds.apache.org/job/HBase-TRUNK/ws/trunk/hbase-server/target/surefire/surefirebooter6717494463525786831.jar>
<https://builds.apache.org/job/HBase-TRUNK/ws/trunk/hbase-server/target/surefire/surefire7436307886446725654tmp>
<https://builds.apache.org/job/HBase-TRUNK/ws/trunk/hbase-server/target/surefire/surefire_1305881488358957456332tmp>
Running org.apache.hadoop.hbase.regionserver.TestSplitLogWorker
Tests run: 5, Failures: 0, Errors: 0, Skipped: 0, Time elapsed: 3.717 sec
Forking command line: /bin/sh -c cd <https://builds.apache.org/job/HBase-TRUNK/ws/trunk/hbase-server>
&& /home/hudson/tools/java/jdk1.6.0_27-32/jre/bin/java -enableassertions -Xmx1900m
-Djava.security.egd=file:/dev/./urandom -jar <https://builds.apache.org/job/HBase-TRUNK/ws/trunk/hbase-server/target/surefire/surefirebooter7488057110969802199.jar>
<https://builds.apache.org/job/HBase-TRUNK/ws/trunk/hbase-server/target/surefire/surefire4327995195259656670tmp>
<https://builds.apache.org/job/HBase-TRUNK/ws/trunk/hbase-server/target/surefire/surefire_1316993335477208716462tmp>
Running org.apache.hadoop.hbase.regionserver.TestHRegionServerBulkLoad
Tests run: 1, Failures: 0, Errors: 0, Skipped: 0, Time elapsed: 54.225 sec
Forking command line: /bin/sh -c cd <https://builds.apache.org/job/HBase-TRUNK/ws/trunk/hbase-server>
&& /home/hudson/tools/java/jdk1.6.0_27-32/jre/bin/java -enableassertions -Xmx1900m
-Djava.security.egd=file:/dev/./urandom -jar <https://builds.apache.org/job/HBase-TRUNK/ws/trunk/hbase-server/target/surefire/surefirebooter7108188387697175999.jar>
<https://builds.apache.org/job/HBase-TRUNK/ws/trunk/hbase-server/target/surefire/surefire3280885604233723854tmp>
<https://builds.apache.org/job/HBase-TRUNK/ws/trunk/hbase-server/target/surefire/surefire_13247222810540104588tmp>
Running org.apache.hadoop.hbase.regionserver.wal.TestLogRollAbort
Tests run: 1, Failures: 0, Errors: 0, Skipped: 0, Time elapsed: 167.98 sec
Forking command line: /bin/sh -c cd <https://builds.apache.org/job/HBase-TRUNK/ws/trunk/hbase-server>
&& /home/hudson/tools/java/jdk1.6.0_27-32/jre/bin/java -enableassertions -Xmx1900m
-Djava.security.egd=file:/dev/./urandom -jar <https://builds.apache.org/job/HBase-TRUNK/ws/trunk/hbase-server/target/surefire/surefirebooter101447099612302309.jar>
<https://builds.apache.org/job/HBase-TRUNK/ws/trunk/hbase-server/target/surefire/surefire1095427573792759622tmp>
<https://builds.apache.org/job/HBase-TRUNK/ws/trunk/hbase-server/target/surefire/surefire_1338935267804110753827tmp>
Running org.apache.hadoop.hbase.regionserver.TestMultiColumnScanner
Tests run: 12, Failures: 0, Errors: 0, Skipped: 0, Time elapsed: 42.96 sec
Forking command line: /bin/sh -c cd <https://builds.apache.org/job/HBase-TRUNK/ws/trunk/hbase-server>
&& /home/hudson/tools/java/jdk1.6.0_27-32/jre/bin/java -enableassertions -Xmx1900m
-Djava.security.egd=file:/dev/./urandom -jar <https://builds.apache.org/job/HBase-TRUNK/ws/trunk/hbase-server/target/surefire/surefirebooter1633252903158745566.jar>
<https://builds.apache.org/job/HBase-TRUNK/ws/trunk/hbase-server/target/surefire/surefire159314600906938377tmp>
<https://builds.apache.org/job/HBase-TRUNK/ws/trunk/hbase-server/target/surefire/surefire_1342980873113795076069tmp>
Running org.apache.hadoop.hbase.regionserver.TestCompoundBloomFilter
Tests run: 3, Failures: 0, Errors: 0, Skipped: 0, Time elapsed: 26.554 sec
Forking command line: /bin/sh -c cd <https://builds.apache.org/job/HBase-TRUNK/ws/trunk/hbase-server>
&& /home/hudson/tools/java/jdk1.6.0_27-32/jre/bin/java -enableassertions -Xmx1900m
-Djava.security.egd=file:/dev/./urandom -jar <https://builds.apache.org/job/HBase-TRUNK/ws/trunk/hbase-server/target/surefire/surefirebooter8426397501262459087.jar>
<https://builds.apache.org/job/HBase-TRUNK/ws/trunk/hbase-server/target/surefire/surefire3769725765596341149tmp>
<https://builds.apache.org/job/HBase-TRUNK/ws/trunk/hbase-server/target/surefire/surefire_1358535129379906213632tmp>
Running org.apache.hadoop.hbase.regionserver.TestHRegion
Tests run: 62, Failures: 0, Errors: 0, Skipped: 0, Time elapsed: 45.55 sec
Forking command line: /bin/sh -c cd <https://builds.apache.org/job/HBase-TRUNK/ws/trunk/hbase-server>
&& /home/hudson/tools/java/jdk1.6.0_27-32/jre/bin/java -enableassertions -Xmx1900m
-Djava.security.egd=file:/dev/./urandom -jar <https://builds.apache.org/job/HBase-TRUNK/ws/trunk/hbase-server/target/surefire/surefirebooter6676948606934674263.jar>
<https://builds.apache.org/job/HBase-TRUNK/ws/trunk/hbase-server/target/surefire/surefire5209209066713818862tmp>
<https://builds.apache.org/job/HBase-TRUNK/ws/trunk/hbase-server/target/surefire/surefire_1364532943963173692464tmp>
Running org.apache.hadoop.hbase.client.replication.TestReplicationAdmin
Tests run: 1, Failures: 0, Errors: 0, Skipped: 0, Time elapsed: 1.285 sec
Forking command line: /bin/sh -c cd <https://builds.apache.org/job/HBase-TRUNK/ws/trunk/hbase-server>
&& /home/hudson/tools/java/jdk1.6.0_27-32/jre/bin/java -enableassertions -Xmx1900m
-Djava.security.egd=file:/dev/./urandom -jar <https://builds.apache.org/job/HBase-TRUNK/ws/trunk/hbase-server/target/surefire/surefirebooter8793783111824588193.jar>
<https://builds.apache.org/job/HBase-TRUNK/ws/trunk/hbase-server/target/surefire/surefire1168743906209753082tmp>
<https://builds.apache.org/job/HBase-TRUNK/ws/trunk/hbase-server/target/surefire/surefire_1373824570671318517555tmp>
Running org.apache.hadoop.hbase.regionserver.TestCompactionState
Tests run: 2, Failures: 0, Errors: 0, Skipped: 0, Time elapsed: 52.324 sec
Forking command line: /bin/sh -c cd <https://builds.apache.org/job/HBase-TRUNK/ws/trunk/hbase-server>
&& /home/hudson/tools/java/jdk1.6.0_27-32/jre/bin/java -enableassertions -Xmx1900m
-Djava.security.egd=file:/dev/./urandom -jar <https://builds.apache.org/job/HBase-TRUNK/ws/trunk/hbase-server/target/surefire/surefirebooter7397648943998652936.jar>
<https://builds.apache.org/job/HBase-TRUNK/ws/trunk/hbase-server/target/surefire/surefire514572091970769366tmp>
<https://builds.apache.org/job/HBase-TRUNK/ws/trunk/hbase-server/target/surefire/surefire_1385137950632779712329tmp>
Running org.apache.hadoop.hbase.regionserver.TestEndToEndSplitTransaction
Tests run: 2, Failures: 0, Errors: 0, Skipped: 0, Time elapsed: 78.104 sec
Forking command line: /bin/sh -c cd <https://builds.apache.org/job/HBase-TRUNK/ws/trunk/hbase-server>
&& /home/hudson/tools/java/jdk1.6.0_27-32/jre/bin/java -enableassertions -Xmx1900m
-Djava.security.egd=file:/dev/./urandom -jar <https://builds.apache.org/job/HBase-TRUNK/ws/trunk/hbase-server/target/surefire/surefirebooter5624109856118077408.jar>
<https://builds.apache.org/job/HBase-TRUNK/ws/trunk/hbase-server/target/surefire/surefire4776683563623446635tmp>
<https://builds.apache.org/job/HBase-TRUNK/ws/trunk/hbase-server/target/surefire/surefire_1397936336635747216568tmp>
Running org.apache.hadoop.hbase.client.TestTimestampsFilter
Tests run: 3, Failures: 0, Errors: 0, Skipped: 0, Time elapsed: 30.789 sec
Forking command line: /bin/sh -c cd <https://builds.apache.org/job/HBase-TRUNK/ws/trunk/hbase-server>
&& /home/hudson/tools/java/jdk1.6.0_27-32/jre/bin/java -enableassertions -Xmx1900m
-Djava.security.egd=file:/dev/./urandom -jar <https://builds.apache.org/job/HBase-TRUNK/ws/trunk/hbase-server/target/surefire/surefirebooter4169867747682765426.jar>
<https://builds.apache.org/job/HBase-TRUNK/ws/trunk/hbase-server/target/surefire/surefire5214560418965817656tmp>
<https://builds.apache.org/job/HBase-TRUNK/ws/trunk/hbase-server/target/surefire/surefire_1404561586228350599560tmp>
Running org.apache.hadoop.hbase.client.TestMultipleTimestamps
Tests run: 8, Failures: 0, Errors: 0, Skipped: 0, Time elapsed: 45.474 sec
Forking command line: /bin/sh -c cd <https://builds.apache.org/job/HBase-TRUNK/ws/trunk/hbase-server>
&& /home/hudson/tools/java/jdk1.6.0_27-32/jre/bin/java -enableassertions -Xmx1900m
-Djava.security.egd=file:/dev/./urandom -jar <https://builds.apache.org/job/HBase-TRUNK/ws/trunk/hbase-server/target/surefire/surefirebooter1812288523799760827.jar>
<https://builds.apache.org/job/HBase-TRUNK/ws/trunk/hbase-server/target/surefire/surefire2300083383394011344tmp>
<https://builds.apache.org/job/HBase-TRUNK/ws/trunk/hbase-server/target/surefire/surefire_1414819701125286589453tmp>
Running org.apache.hadoop.hbase.client.TestHCM
Tests run: 7, Failures: 0, Errors: 0, Skipped: 0, Time elapsed: 31.586 sec
Forking command line: /bin/sh -c cd <https://builds.apache.org/job/HBase-TRUNK/ws/trunk/hbase-server>
&& /home/hudson/tools/java/jdk1.6.0_27-32/jre/bin/java -enableassertions -Xmx1900m
-Djava.security.egd=file:/dev/./urandom -jar <https://builds.apache.org/job/HBase-TRUNK/ws/trunk/hbase-server/target/surefire/surefirebooter1910386022116750337.jar>
<https://builds.apache.org/job/HBase-TRUNK/ws/trunk/hbase-server/target/surefire/surefire7835593645098419240tmp>
<https://builds.apache.org/job/HBase-TRUNK/ws/trunk/hbase-server/target/surefire/surefire_1425328166734775889026tmp>
Running org.apache.hadoop.hbase.client.TestHTablePool$TestHTableReusablePool
Tests run: 9, Failures: 0, Errors: 0, Skipped: 0, Time elapsed: 6.264 sec
Running org.apache.hadoop.hbase.client.TestHTablePool$TestHTableThreadLocalPool
Tests run: 9, Failures: 0, Errors: 0, Skipped: 0, Time elapsed: 34.842 sec
Forking command line: /bin/sh -c cd <https://builds.apache.org/job/HBase-TRUNK/ws/trunk/hbase-server>
&& /home/hudson/tools/java/jdk1.6.0_27-32/jre/bin/java -enableassertions -Xmx1900m
-Djava.security.egd=file:/dev/./urandom -jar <https://builds.apache.org/job/HBase-TRUNK/ws/trunk/hbase-server/target/surefire/surefirebooter1258773819670996529.jar>
<https://builds.apache.org/job/HBase-TRUNK/ws/trunk/hbase-server/target/surefire/surefire7713782346500284990tmp>
<https://builds.apache.org/job/HBase-TRUNK/ws/trunk/hbase-server/target/surefire/surefire_1438786439648114485366tmp>
Running org.apache.hadoop.hbase.client.TestFromClientSide3
Tests run: 1, Failures: 0, Errors: 0, Skipped: 0, Time elapsed: 40.026 sec
Forking command line: /bin/sh -c cd <https://builds.apache.org/job/HBase-TRUNK/ws/trunk/hbase-server>
&& /home/hudson/tools/java/jdk1.6.0_27-32/jre/bin/java -enableassertions -Xmx1900m
-Djava.security.egd=file:/dev/./urandom -jar <https://builds.apache.org/job/HBase-TRUNK/ws/trunk/hbase-server/target/surefire/surefirebooter111235564678897460.jar>
<https://builds.apache.org/job/HBase-TRUNK/ws/trunk/hbase-server/target/surefire/surefire4486329608569186768tmp>
<https://builds.apache.org/job/HBase-TRUNK/ws/trunk/hbase-server/target/surefire/surefire_1447314171994570665583tmp>
Running org.apache.hadoop.hbase.client.TestHTableUtil
Tests run: 2, Failures: 0, Errors: 0, Skipped: 0, Time elapsed: 22.768 sec
Forking command line: /bin/sh -c cd <https://builds.apache.org/job/HBase-TRUNK/ws/trunk/hbase-server>
&& /home/hudson/tools/java/jdk1.6.0_27-32/jre/bin/java -enableassertions -Xmx1900m
-Djava.security.egd=file:/dev/./urandom -jar <https://builds.apache.org/job/HBase-TRUNK/ws/trunk/hbase-server/target/surefire/surefirebooter8815477121366636594.jar>
<https://builds.apache.org/job/HBase-TRUNK/ws/trunk/hbase-server/target/surefire/surefire677379002545812611tmp>
<https://builds.apache.org/job/HBase-TRUNK/ws/trunk/hbase-server/target/surefire/surefire_1453731780572178324072tmp>
Running org.apache.hadoop.hbase.client.TestMetaScanner
Tests run: 1, Failures: 0, Errors: 0, Skipped: 0, Time elapsed: 24.584 sec
Forking command line: /bin/sh -c cd <https://builds.apache.org/job/HBase-TRUNK/ws/trunk/hbase-server>
&& /home/hudson/tools/java/jdk1.6.0_27-32/jre/bin/java -enableassertions -Xmx1900m
-Djava.security.egd=file:/dev/./urandom -jar <https://builds.apache.org/job/HBase-TRUNK/ws/trunk/hbase-server/target/surefire/surefirebooter5040382040834236376.jar>
<https://builds.apache.org/job/HBase-TRUNK/ws/trunk/hbase-server/target/surefire/surefire6998121838780830533tmp>
<https://builds.apache.org/job/HBase-TRUNK/ws/trunk/hbase-server/target/surefire/surefire_1466025821773049819096tmp>
Running org.apache.hadoop.hbase.regionserver.wal.TestHLogSplit
Tests run: 30, Failures: 0, Errors: 0, Skipped: 1, Time elapsed: 304.541 sec
Forking command line: /bin/sh -c cd <https://builds.apache.org/job/HBase-TRUNK/ws/trunk/hbase-server>
&& /home/hudson/tools/java/jdk1.6.0_27-32/jre/bin/java -enableassertions -Xmx1900m
-Djava.security.egd=file:/dev/./urandom -jar <https://builds.apache.org/job/HBase-TRUNK/ws/trunk/hbase-server/target/surefire/surefirebooter1136409252382407204.jar>
<https://builds.apache.org/job/HBase-TRUNK/ws/trunk/hbase-server/target/surefire/surefire7934685877786547887tmp>
<https://builds.apache.org/job/HBase-TRUNK/ws/trunk/hbase-server/target/surefire/surefire_1474554045602452073364tmp>
Running org.apache.hadoop.hbase.client.TestScannerTimeout
Tests run: 4, Failures: 0, Errors: 1, Skipped: 0, Time elapsed: 61.534 sec <<< FAILURE!
Forking command line: /bin/sh -c cd <https://builds.apache.org/job/HBase-TRUNK/ws/trunk/hbase-server>
&& /home/hudson/tools/java/jdk1.6.0_27-32/jre/bin/java -enableassertions -Xmx1900m
-Djava.security.egd=file:/dev/./urandom -jar <https://builds.apache.org/job/HBase-TRUNK/ws/trunk/hbase-server/target/surefire/surefirebooter3281024689555254778.jar>
<https://builds.apache.org/job/HBase-TRUNK/ws/trunk/hbase-server/target/surefire/surefire3313027903010454267tmp>
<https://builds.apache.org/job/HBase-TRUNK/ws/trunk/hbase-server/target/surefire/surefire_1486219829410700376926tmp>
Running org.apache.hadoop.hbase.client.TestMetaMigrationRemovingHTD
Tests run: 3, Failures: 0, Errors: 0, Skipped: 0, Time elapsed: 41.96 sec
Forking command line: /bin/sh -c cd <https://builds.apache.org/job/HBase-TRUNK/ws/trunk/hbase-server>
&& /home/hudson/tools/java/jdk1.6.0_27-32/jre/bin/java -enableassertions -Xmx1900m
-Djava.security.egd=file:/dev/./urandom -jar <https://builds.apache.org/job/HBase-TRUNK/ws/trunk/hbase-server/target/surefire/surefirebooter6693280953999211330.jar>
<https://builds.apache.org/job/HBase-TRUNK/ws/trunk/hbase-server/target/surefire/surefire81410249621602407tmp>
<https://builds.apache.org/job/HBase-TRUNK/ws/trunk/hbase-server/target/surefire/surefire_149583273507617178167tmp>
Running org.apache.hadoop.hbase.client.TestFromClientSide
Tests run: 56, Failures: 0, Errors: 0, Skipped: 3, Time elapsed: 256.026 sec
Forking command line: /bin/sh -c cd <https://builds.apache.org/job/HBase-TRUNK/ws/trunk/hbase-server>
&& /home/hudson/tools/java/jdk1.6.0_27-32/jre/bin/java -enableassertions -Xmx1900m
-Djava.security.egd=file:/dev/./urandom -jar <https://builds.apache.org/job/HBase-TRUNK/ws/trunk/hbase-server/target/surefire/surefirebooter8302910814968395223.jar>
<https://builds.apache.org/job/HBase-TRUNK/ws/trunk/hbase-server/target/surefire/surefire9066814444574849802tmp>
<https://builds.apache.org/job/HBase-TRUNK/ws/trunk/hbase-server/target/surefire/surefire_1507302111742985534500tmp>
Running org.apache.hadoop.hbase.client.TestShell
Tests run: 1, Failures: 0, Errors: 0, Skipped: 0, Time elapsed: 166.79 sec
Forking command line: /bin/sh -c cd <https://builds.apache.org/job/HBase-TRUNK/ws/trunk/hbase-server>
&& /home/hudson/tools/java/jdk1.6.0_27-32/jre/bin/java -enableassertions -Xmx1900m
-Djava.security.egd=file:/dev/./urandom -jar <https://builds.apache.org/job/HBase-TRUNK/ws/trunk/hbase-server/target/surefire/surefirebooter1464762484561661230.jar>
<https://builds.apache.org/job/HBase-TRUNK/ws/trunk/hbase-server/target/surefire/surefire1731172759879579325tmp>
<https://builds.apache.org/job/HBase-TRUNK/ws/trunk/hbase-server/target/surefire/surefire_1514369802319503634244tmp>
Running org.apache.hadoop.hbase.TestMultiVersions
Tests run: 3, Failures: 0, Errors: 0, Skipped: 0, Time elapsed: 33.112 sec
Forking command line: /bin/sh -c cd <https://builds.apache.org/job/HBase-TRUNK/ws/trunk/hbase-server>
&& /home/hudson/tools/java/jdk1.6.0_27-32/jre/bin/java -enableassertions -Xmx1900m
-Djava.security.egd=file:/dev/./urandom -jar <https://builds.apache.org/job/HBase-TRUNK/ws/trunk/hbase-server/target/surefire/surefirebooter3684407348418150864.jar>
<https://builds.apache.org/job/HBase-TRUNK/ws/trunk/hbase-server/target/surefire/surefire5134619996474120141tmp>
<https://builds.apache.org/job/HBase-TRUNK/ws/trunk/hbase-server/target/surefire/surefire_1527823999767271375986tmp>
Running org.apache.hadoop.hbase.client.TestMultiParallel
Tests run: 11, Failures: 0, Errors: 0, Skipped: 0, Time elapsed: 68.954 sec
Forking command line: /bin/sh -c cd <https://builds.apache.org/job/HBase-TRUNK/ws/trunk/hbase-server>
&& /home/hudson/tools/java/jdk1.6.0_27-32/jre/bin/java -enableassertions -Xmx1900m
-Djava.security.egd=file:/dev/./urandom -jar <https://builds.apache.org/job/HBase-TRUNK/ws/trunk/hbase-server/target/surefire/surefirebooter483575224694446624.jar>
<https://builds.apache.org/job/HBase-TRUNK/ws/trunk/hbase-server/target/surefire/surefire7057877858536187442tmp>
<https://builds.apache.org/job/HBase-TRUNK/ws/trunk/hbase-server/target/surefire/surefire_1537433130664984897447tmp>
Running org.apache.hadoop.hbase.client.TestAdmin
Tests run: 39, Failures: 0, Errors: 0, Skipped: 0, Time elapsed: 256.352 sec
Forking command line: /bin/sh -c cd <https://builds.apache.org/job/HBase-TRUNK/ws/trunk/hbase-server>
&& /home/hudson/tools/java/jdk1.6.0_27-32/jre/bin/java -enableassertions -Xmx1900m
-Djava.security.egd=file:/dev/./urandom -jar <https://builds.apache.org/job/HBase-TRUNK/ws/trunk/hbase-server/target/surefire/surefirebooter3222364074945616667.jar>
<https://builds.apache.org/job/HBase-TRUNK/ws/trunk/hbase-server/target/surefire/surefire287147172530237022tmp>
<https://builds.apache.org/job/HBase-TRUNK/ws/trunk/hbase-server/target/surefire/surefire_1545654298947918164876tmp>
Running org.apache.hadoop.hbase.master.TestActiveMasterManager
Tests run: 2, Failures: 0, Errors: 0, Skipped: 0, Time elapsed: 1.242 sec
Forking command line: /bin/sh -c cd <https://builds.apache.org/job/HBase-TRUNK/ws/trunk/hbase-server>
&& /home/hudson/tools/java/jdk1.6.0_27-32/jre/bin/java -enableassertions -Xmx1900m
-Djava.security.egd=file:/dev/./urandom -jar <https://builds.apache.org/job/HBase-TRUNK/ws/trunk/hbase-server/target/surefire/surefirebooter9056938979084307672.jar>
<https://builds.apache.org/job/HBase-TRUNK/ws/trunk/hbase-server/target/surefire/surefire8558517101612248135tmp>
<https://builds.apache.org/job/HBase-TRUNK/ws/trunk/hbase-server/target/surefire/surefire_1551656148366207113349tmp>
Running org.apache.hadoop.hbase.master.TestMasterNoCluster
Tests run: 3, Failures: 0, Errors: 0, Skipped: 0, Time elapsed: 6.815 sec
Forking command line: /bin/sh -c cd <https://builds.apache.org/job/HBase-TRUNK/ws/trunk/hbase-server>
&& /home/hudson/tools/java/jdk1.6.0_27-32/jre/bin/java -enableassertions -Xmx1900m
-Djava.security.egd=file:/dev/./urandom -jar <https://builds.apache.org/job/HBase-TRUNK/ws/trunk/hbase-server/target/surefire/surefirebooter920949802963736372.jar>
<https://builds.apache.org/job/HBase-TRUNK/ws/trunk/hbase-server/target/surefire/surefire6336459236986023588tmp>
<https://builds.apache.org/job/HBase-TRUNK/ws/trunk/hbase-server/target/surefire/surefire_1562315519162111032664tmp>
Running org.apache.hadoop.hbase.master.TestLogsCleaner
Tests run: 1, Failures: 0, Errors: 0, Skipped: 0, Time elapsed: 3.357 sec
Forking command line: /bin/sh -c cd <https://builds.apache.org/job/HBase-TRUNK/ws/trunk/hbase-server>
&& /home/hudson/tools/java/jdk1.6.0_27-32/jre/bin/java -enableassertions -Xmx1900m
-Djava.security.egd=file:/dev/./urandom -jar <https://builds.apache.org/job/HBase-TRUNK/ws/trunk/hbase-server/target/surefire/surefirebooter7509455294855701950.jar>
<https://builds.apache.org/job/HBase-TRUNK/ws/trunk/hbase-server/target/surefire/surefire7952977910573228589tmp>
<https://builds.apache.org/job/HBase-TRUNK/ws/trunk/hbase-server/target/surefire/surefire_1574029590272222397140tmp>
Running org.apache.hadoop.hbase.master.TestRollingRestart
Tests run: 1, Failures: 0, Errors: 0, Skipped: 0, Time elapsed: 65.005 sec
Forking command line: /bin/sh -c cd <https://builds.apache.org/job/HBase-TRUNK/ws/trunk/hbase-server>
&& /home/hudson/tools/java/jdk1.6.0_27-32/jre/bin/java -enableassertions -Xmx1900m
-Djava.security.egd=file:/dev/./urandom -jar <https://builds.apache.org/job/HBase-TRUNK/ws/trunk/hbase-server/target/surefire/surefirebooter4172118672092286005.jar>
<https://builds.apache.org/job/HBase-TRUNK/ws/trunk/hbase-server/target/surefire/surefire5618837666646764884tmp>
<https://builds.apache.org/job/HBase-TRUNK/ws/trunk/hbase-server/target/surefire/surefire_1581336677175040117747tmp>
Running org.apache.hadoop.hbase.master.balancer.TestDefaultLoadBalancer
Tests run: 1, Failures: 0, Errors: 0, Skipped: 0, Time elapsed: 1.425 sec
Forking command line: /bin/sh -c cd <https://builds.apache.org/job/HBase-TRUNK/ws/trunk/hbase-server>
&& /home/hudson/tools/java/jdk1.6.0_27-32/jre/bin/java -enableassertions -Xmx1900m
-Djava.security.egd=file:/dev/./urandom -jar <https://builds.apache.org/job/HBase-TRUNK/ws/trunk/hbase-server/target/surefire/surefirebooter1870667870587776067.jar>
<https://builds.apache.org/job/HBase-TRUNK/ws/trunk/hbase-server/target/surefire/surefire5553466888040185543tmp>
<https://builds.apache.org/job/HBase-TRUNK/ws/trunk/hbase-server/target/surefire/surefire_1593170218990536955064tmp>
Running org.apache.hadoop.hbase.master.balancer.TestBaseLoadBalancer
Tests run: 3, Failures: 0, Errors: 0, Skipped: 0, Time elapsed: 0.486 sec
Forking command line: /bin/sh -c cd <https://builds.apache.org/job/HBase-TRUNK/ws/trunk/hbase-server>
&& /home/hudson/tools/java/jdk1.6.0_27-32/jre/bin/java -enableassertions -Xmx1900m
-Djava.security.egd=file:/dev/./urandom -jar <https://builds.apache.org/job/HBase-TRUNK/ws/trunk/hbase-server/target/surefire/surefirebooter8850618137271224546.jar>
<https://builds.apache.org/job/HBase-TRUNK/ws/trunk/hbase-server/target/surefire/surefire5126719879753479158tmp>
<https://builds.apache.org/job/HBase-TRUNK/ws/trunk/hbase-server/target/surefire/surefire_1605549505123030084121tmp>
Running org.apache.hadoop.hbase.thrift.TestThriftServer
Tests run: 1, Failures: 0, Errors: 0, Skipped: 0, Time elapsed: 96.293 sec
Forking command line: /bin/sh -c cd <https://builds.apache.org/job/HBase-TRUNK/ws/trunk/hbase-server>
&& /home/hudson/tools/java/jdk1.6.0_27-32/jre/bin/java -enableassertions -Xmx1900m
-Djava.security.egd=file:/dev/./urandom -jar <https://builds.apache.org/job/HBase-TRUNK/ws/trunk/hbase-server/target/surefire/surefirebooter7232603558640273637.jar>
<https://builds.apache.org/job/HBase-TRUNK/ws/trunk/hbase-server/target/surefire/surefire230572485216111615tmp>
<https://builds.apache.org/job/HBase-TRUNK/ws/trunk/hbase-server/target/surefire/surefire_1615214937959784009226tmp>
Running org.apache.hadoop.hbase.master.TestZKBasedOpenCloseRegion
Tests run: 4, Failures: 0, Errors: 0, Skipped: 0, Time elapsed: 27.562 sec
Forking command line: /bin/sh -c cd <https://builds.apache.org/job/HBase-TRUNK/ws/trunk/hbase-server>
&& /home/hudson/tools/java/jdk1.6.0_27-32/jre/bin/java -enableassertions -Xmx1900m
-Djava.security.egd=file:/dev/./urandom -jar <https://builds.apache.org/job/HBase-TRUNK/ws/trunk/hbase-server/target/surefire/surefirebooter7793673397896560162.jar>
<https://builds.apache.org/job/HBase-TRUNK/ws/trunk/hbase-server/target/surefire/surefire3468139563782193094tmp>
<https://builds.apache.org/job/HBase-TRUNK/ws/trunk/hbase-server/target/surefire/surefire_1623059905645471386460tmp>
Running org.apache.hadoop.hbase.master.TestMaster
Tests run: 1, Failures: 0, Errors: 0, Skipped: 0, Time elapsed: 21.149 sec
Forking command line: /bin/sh -c cd <https://builds.apache.org/job/HBase-TRUNK/ws/trunk/hbase-server>
&& /home/hudson/tools/java/jdk1.6.0_27-32/jre/bin/java -enableassertions -Xmx1900m
-Djava.security.egd=file:/dev/./urandom -jar <https://builds.apache.org/job/HBase-TRUNK/ws/trunk/hbase-server/target/surefire/surefirebooter5843025661484256398.jar>
<https://builds.apache.org/job/HBase-TRUNK/ws/trunk/hbase-server/target/surefire/surefire6909492489356800637tmp>
<https://builds.apache.org/job/HBase-TRUNK/ws/trunk/hbase-server/target/surefire/surefire_1634661668952040248660tmp>
Running org.apache.hadoop.hbase.master.TestMasterTransitions
Tests run: 3, Failures: 0, Errors: 0, Skipped: 3, Time elapsed: 25.971 sec
Forking command line: /bin/sh -c cd <https://builds.apache.org/job/HBase-TRUNK/ws/trunk/hbase-server>
&& /home/hudson/tools/java/jdk1.6.0_27-32/jre/bin/java -enableassertions -Xmx1900m
-Djava.security.egd=file:/dev/./urandom -jar <https://builds.apache.org/job/HBase-TRUNK/ws/trunk/hbase-server/target/surefire/surefirebooter8531303726835874066.jar>
<https://builds.apache.org/job/HBase-TRUNK/ws/trunk/hbase-server/target/surefire/surefire8232448901468263486tmp>
<https://builds.apache.org/job/HBase-TRUNK/ws/trunk/hbase-server/target/surefire/surefire_1645305054124434245386tmp>
Running org.apache.hadoop.hbase.master.TestOpenedRegionHandler
Tests run: 2, Failures: 0, Errors: 0, Skipped: 0, Time elapsed: 19.932 sec
Forking command line: /bin/sh -c cd <https://builds.apache.org/job/HBase-TRUNK/ws/trunk/hbase-server>
&& /home/hudson/tools/java/jdk1.6.0_27-32/jre/bin/java -enableassertions -Xmx1900m
-Djava.security.egd=file:/dev/./urandom -jar <https://builds.apache.org/job/HBase-TRUNK/ws/trunk/hbase-server/target/surefire/surefirebooter7709840007478524206.jar>
<https://builds.apache.org/job/HBase-TRUNK/ws/trunk/hbase-server/target/surefire/surefire7914868314631319091tmp>
<https://builds.apache.org/job/HBase-TRUNK/ws/trunk/hbase-server/target/surefire/surefire_1658215795738010065632tmp>
Running org.apache.hadoop.hbase.master.TestMXBean
Tests run: 1, Failures: 0, Errors: 0, Skipped: 0, Time elapsed: 17.775 sec
Forking command line: /bin/sh -c cd <https://builds.apache.org/job/HBase-TRUNK/ws/trunk/hbase-server>
&& /home/hudson/tools/java/jdk1.6.0_27-32/jre/bin/java -enableassertions -Xmx1900m
-Djava.security.egd=file:/dev/./urandom -jar <https://builds.apache.org/job/HBase-TRUNK/ws/trunk/hbase-server/target/surefire/surefirebooter1761791719656301280.jar>
<https://builds.apache.org/job/HBase-TRUNK/ws/trunk/hbase-server/target/surefire/surefire4080310944879239913tmp>
<https://builds.apache.org/job/HBase-TRUNK/ws/trunk/hbase-server/target/surefire/surefire_1663289558570404947793tmp>
Running org.apache.hadoop.hbase.master.TestSplitLogManager
Tests run: 12, Failures: 0, Errors: 0, Skipped: 0, Time elapsed: 16.747 sec
Forking command line: /bin/sh -c cd <https://builds.apache.org/job/HBase-TRUNK/ws/trunk/hbase-server>
&& /home/hudson/tools/java/jdk1.6.0_27-32/jre/bin/java -enableassertions -Xmx1900m
-Djava.security.egd=file:/dev/./urandom -jar <https://builds.apache.org/job/HBase-TRUNK/ws/trunk/hbase-server/target/surefire/surefirebooter236531110061491284.jar>
<https://builds.apache.org/job/HBase-TRUNK/ws/trunk/hbase-server/target/surefire/surefire8051566256512280995tmp>
<https://builds.apache.org/job/HBase-TRUNK/ws/trunk/hbase-server/target/surefire/surefire_1678070861070943055019tmp>
Running org.apache.hadoop.hbase.master.TestAssignmentManager
Running org.apache.hadoop.hbase.master.balancer.TestStochasticLoadBalancer
Tests run: 11, Failures: 0, Errors: 0, Skipped: 0, Time elapsed: 3.432 sec
Tests run: 4, Failures: 0, Errors: 0, Skipped: 0, Time elapsed: 95.626 sec
Forking command line: /bin/sh -c cd <https://builds.apache.org/job/HBase-TRUNK/ws/trunk/hbase-server>
&& /home/hudson/tools/java/jdk1.6.0_27-32/jre/bin/java -enableassertions -Xmx1900m
-Djava.security.egd=file:/dev/./urandom -jar <https://builds.apache.org/job/HBase-TRUNK/ws/trunk/hbase-server/target/surefire/surefirebooter5983477592046894659.jar>
<https://builds.apache.org/job/HBase-TRUNK/ws/trunk/hbase-server/target/surefire/surefire528823821447530982tmp>
<https://builds.apache.org/job/HBase-TRUNK/ws/trunk/hbase-server/target/surefire/surefire_1681811989867875028293tmp>
Forking command line: /bin/sh -c cd <https://builds.apache.org/job/HBase-TRUNK/ws/trunk/hbase-server>
&& /home/hudson/tools/java/jdk1.6.0_27-32/jre/bin/java -enableassertions -Xmx1900m
-Djava.security.egd=file:/dev/./urandom -jar <https://builds.apache.org/job/HBase-TRUNK/ws/trunk/hbase-server/target/surefire/surefirebooter6571616997813484960.jar>
<https://builds.apache.org/job/HBase-TRUNK/ws/trunk/hbase-server/target/surefire/surefire2028128186321113472tmp>
<https://builds.apache.org/job/HBase-TRUNK/ws/trunk/hbase-server/target/surefire/surefire_1691379855277080999897tmp>
Running org.apache.hadoop.hbase.master.TestMasterStatusServlet
Tests run: 5, Failures: 0, Errors: 0, Skipped: 0, Time elapsed: 1.292 sec
Forking command line: /bin/sh -c cd <https://builds.apache.org/job/HBase-TRUNK/ws/trunk/hbase-server>
&& /home/hudson/tools/java/jdk1.6.0_27-32/jre/bin/java -enableassertions -Xmx1900m
-Djava.security.egd=file:/dev/./urandom -jar <https://builds.apache.org/job/HBase-TRUNK/ws/trunk/hbase-server/target/surefire/surefirebooter7162037389663321954.jar>
<https://builds.apache.org/job/HBase-TRUNK/ws/trunk/hbase-server/target/surefire/surefire6801301827141646805tmp>
<https://builds.apache.org/job/HBase-TRUNK/ws/trunk/hbase-server/target/surefire/surefire_1702105918833302041052tmp>
Running org.apache.hadoop.hbase.master.TestHMasterRPCException
Tests run: 1, Failures: 1, Errors: 0, Skipped: 0, Time elapsed: 1.099 sec <<< FAILURE!
Forking command line: /bin/sh -c cd <https://builds.apache.org/job/HBase-TRUNK/ws/trunk/hbase-server>
&& /home/hudson/tools/java/jdk1.6.0_27-32/jre/bin/java -enableassertions -Xmx1900m
-Djava.security.egd=file:/dev/./urandom -jar <https://builds.apache.org/job/HBase-TRUNK/ws/trunk/hbase-server/target/surefire/surefirebooter4591065937885406627.jar>
<https://builds.apache.org/job/HBase-TRUNK/ws/trunk/hbase-server/target/surefire/surefire2325884078509517105tmp>
<https://builds.apache.org/job/HBase-TRUNK/ws/trunk/hbase-server/target/surefire/surefire_171835660361189582482tmp>
Running org.apache.hadoop.hbase.master.TestMasterRestartAfterDisablingTable
Tests run: 1, Failures: 0, Errors: 0, Skipped: 0, Time elapsed: 19.637 sec
Forking command line: /bin/sh -c cd <https://builds.apache.org/job/HBase-TRUNK/ws/trunk/hbase-server>
&& /home/hudson/tools/java/jdk1.6.0_27-32/jre/bin/java -enableassertions -Xmx1900m
-Djava.security.egd=file:/dev/./urandom -jar <https://builds.apache.org/job/HBase-TRUNK/ws/trunk/hbase-server/target/surefire/surefirebooter2819822400077562651.jar>
<https://builds.apache.org/job/HBase-TRUNK/ws/trunk/hbase-server/target/surefire/surefire924438306479661758tmp>
<https://builds.apache.org/job/HBase-TRUNK/ws/trunk/hbase-server/target/surefire/surefire_1729066847309015505405tmp>
Running org.apache.hadoop.hbase.master.TestMasterShutdown
Tests run: 1, Failures: 0, Errors: 0, Skipped: 0, Time elapsed: 17.682 sec
Forking command line: /bin/sh -c cd <https://builds.apache.org/job/HBase-TRUNK/ws/trunk/hbase-server>
&& /home/hudson/tools/java/jdk1.6.0_27-32/jre/bin/java -enableassertions -Xmx1900m
-Djava.security.egd=file:/dev/./urandom -jar <https://builds.apache.org/job/HBase-TRUNK/ws/trunk/hbase-server/target/surefire/surefirebooter16803914634918248.jar>
<https://builds.apache.org/job/HBase-TRUNK/ws/trunk/hbase-server/target/surefire/surefire5482893400088547000tmp>
<https://builds.apache.org/job/HBase-TRUNK/ws/trunk/hbase-server/target/surefire/surefire_1736748112305099316780tmp>
Running org.apache.hadoop.hbase.master.TestRestartCluster
Tests run: 2, Failures: 0, Errors: 0, Skipped: 0, Time elapsed: 40.52 sec
Forking command line: /bin/sh -c cd <https://builds.apache.org/job/HBase-TRUNK/ws/trunk/hbase-server>
&& /home/hudson/tools/java/jdk1.6.0_27-32/jre/bin/java -enableassertions -Xmx1900m
-Djava.security.egd=file:/dev/./urandom -jar <https://builds.apache.org/job/HBase-TRUNK/ws/trunk/hbase-server/target/surefire/surefirebooter950757727633745961.jar>
<https://builds.apache.org/job/HBase-TRUNK/ws/trunk/hbase-server/target/surefire/surefire8530819482128550807tmp>
<https://builds.apache.org/job/HBase-TRUNK/ws/trunk/hbase-server/target/surefire/surefire_174517622185402975402tmp>
Running org.apache.hadoop.hbase.master.TestMasterFailover
Tests run: 4, Failures: 0, Errors: 0, Skipped: 0, Time elapsed: 89.05 sec
Forking command line: /bin/sh -c cd <https://builds.apache.org/job/HBase-TRUNK/ws/trunk/hbase-server>
&& /home/hudson/tools/java/jdk1.6.0_27-32/jre/bin/java -enableassertions -Xmx1900m
-Djava.security.egd=file:/dev/./urandom -jar <https://builds.apache.org/job/HBase-TRUNK/ws/trunk/hbase-server/target/surefire/surefirebooter3094901899049385710.jar>
<https://builds.apache.org/job/HBase-TRUNK/ws/trunk/hbase-server/target/surefire/surefire3567445970822720852tmp>
<https://builds.apache.org/job/HBase-TRUNK/ws/trunk/hbase-server/target/surefire/surefire_1756269558573857754622tmp>
Running org.apache.hadoop.hbase.avro.TestAvroServer
Tests run: 3, Failures: 0, Errors: 0, Skipped: 0, Time elapsed: 38.73 sec
Forking command line: /bin/sh -c cd <https://builds.apache.org/job/HBase-TRUNK/ws/trunk/hbase-server>
&& /home/hudson/tools/java/jdk1.6.0_27-32/jre/bin/java -enableassertions -Xmx1900m
-Djava.security.egd=file:/dev/./urandom -jar <https://builds.apache.org/job/HBase-TRUNK/ws/trunk/hbase-server/target/surefire/surefirebooter5503336534685658792.jar>
<https://builds.apache.org/job/HBase-TRUNK/ws/trunk/hbase-server/target/surefire/surefire3047772372234232029tmp>
<https://builds.apache.org/job/HBase-TRUNK/ws/trunk/hbase-server/target/surefire/surefire_1761035090235564996495tmp>
Running org.apache.hadoop.hbase.master.TestDistributedLogSplitting
Tests run: 4, Failures: 0, Errors: 0, Skipped: 0, Time elapsed: 138.146 sec
Forking command line: /bin/sh -c cd <https://builds.apache.org/job/HBase-TRUNK/ws/trunk/hbase-server>
&& /home/hudson/tools/java/jdk1.6.0_27-32/jre/bin/java -enableassertions -Xmx1900m
-Djava.security.egd=file:/dev/./urandom -jar <https://builds.apache.org/job/HBase-TRUNK/ws/trunk/hbase-server/target/surefire/surefirebooter6910235103928677581.jar>
<https://builds.apache.org/job/HBase-TRUNK/ws/trunk/hbase-server/target/surefire/surefire9039054803485049132tmp>
<https://builds.apache.org/job/HBase-TRUNK/ws/trunk/hbase-server/target/surefire/surefire_177972737869408123424tmp>
Running org.apache.hadoop.hbase.TestZooKeeper
Tests run: 9, Failures: 0, Errors: 0, Skipped: 0, Time elapsed: 30.034 sec
Forking command line: /bin/sh -c cd <https://builds.apache.org/job/HBase-TRUNK/ws/trunk/hbase-server>
&& /home/hudson/tools/java/jdk1.6.0_27-32/jre/bin/java -enableassertions -Xmx1900m
-Djava.security.egd=file:/dev/./urandom -jar <https://builds.apache.org/job/HBase-TRUNK/ws/trunk/hbase-server/target/surefire/surefirebooter2320383830877699920.jar>
<https://builds.apache.org/job/HBase-TRUNK/ws/trunk/hbase-server/target/surefire/surefire384557582179755720tmp>
<https://builds.apache.org/job/HBase-TRUNK/ws/trunk/hbase-server/target/surefire/surefire_1782264275617882291345tmp>
Running org.apache.hadoop.hbase.ipc.TestDelayedRpc
Tests run: 4, Failures: 0, Errors: 0, Skipped: 0, Time elapsed: 2.468 sec
Forking command line: /bin/sh -c cd <https://builds.apache.org/job/HBase-TRUNK/ws/trunk/hbase-server>
&& /home/hudson/tools/java/jdk1.6.0_27-32/jre/bin/java -enableassertions -Xmx1900m
-Djava.security.egd=file:/dev/./urandom -jar <https://builds.apache.org/job/HBase-TRUNK/ws/trunk/hbase-server/target/surefire/surefirebooter7539278343135089766.jar>
<https://builds.apache.org/job/HBase-TRUNK/ws/trunk/hbase-server/target/surefire/surefire8061046822119151084tmp>
<https://builds.apache.org/job/HBase-TRUNK/ws/trunk/hbase-server/target/surefire/surefire_1794220414769615136054tmp>
Running org.apache.hadoop.hbase.TestRegionRebalancing
Tests run: 2, Failures: 0, Errors: 0, Skipped: 0, Time elapsed: 119.791 sec
Forking command line: /bin/sh -c cd <https://builds.apache.org/job/HBase-TRUNK/ws/trunk/hbase-server>
&& /home/hudson/tools/java/jdk1.6.0_27-32/jre/bin/java -enableassertions -Xmx1900m
-Djava.security.egd=file:/dev/./urandom -jar <https://builds.apache.org/job/HBase-TRUNK/ws/trunk/hbase-server/target/surefire/surefirebooter7528989433564047928.jar>
<https://builds.apache.org/job/HBase-TRUNK/ws/trunk/hbase-server/target/surefire/surefire2926058160923818859tmp>
<https://builds.apache.org/job/HBase-TRUNK/ws/trunk/hbase-server/target/surefire/surefire_1806407424878306110280tmp>
Running org.apache.hadoop.hbase.thrift2.TestThriftHBaseServiceHandler
Tests run: 12, Failures: 0, Errors: 0, Skipped: 0, Time elapsed: 16.384 sec
Running org.apache.hadoop.hbase.TestInfoServers
Tests run: 2, Failures: 0, Errors: 0, Skipped: 0, Time elapsed: 13.749 sec
Running org.apache.hadoop.hbase.TestAcidGuarantees
Tests run: 3, Failures: 0, Errors: 0, Skipped: 0, Time elapsed: 109.825 sec
Running org.apache.hadoop.hbase.thrift.TestThriftServerCmdLine
Tests run: 20, Failures: 0, Errors: 0, Skipped: 0, Time elapsed: 549.955 sec

Results :

Failed tests:   testMultiSlaveReplication(org.apache.hadoop.hbase.replication.TestMultiSlaveReplication):
expected:<1> but was:<0>
  testRegionHole(org.apache.hadoop.hbase.util.TestHBaseFsck): expected:<[HOLE_IN_REGION_CHAIN]>
but was:<[NOT_DEPLOYED, NOT_DEPLOYED, NOT_DEPLOYED]>
  testNotInMetaOrDeployedHole(org.apache.hadoop.hbase.util.TestHBaseFsck): expected:<[NOT_IN_META_OR_DEPLOYED,
HOLE_IN_REGION_CHAIN]> but was:<[NOT_DEPLOYED, NOT_DEPLOYED, NOT_IN_META_OR_DEPLOYED,
NOT_DEPLOYED]>
  testShutdownFixupWhenDaughterHasSplit(org.apache.hadoop.hbase.regionserver.TestSplitTransactionOnCluster):
expected:<1> but was:<0>
  testRPCException(org.apache.hadoop.hbase.master.TestHMasterRPCException): Unexpected throwable:
org.apache.hadoop.hbase.ipc.ServerNotRunningYetException: org.apache.hadoop.hbase.ipc.ServerNotRunningYetException:
Server is not running yet

Tests in error: 
  testFlippingEncodeOnDisk(org.apache.hadoop.hbase.io.encoding.TestChangingEncoding): Call
to vesta.apache.org/67.195.138.9:44173 failed on socket timeout exception: java.net.SocketTimeoutException:
60000 millis timeout while waiting for channel to be ready for read. ch : java.nio.channels.SocketChannel[connected
local=/67.195.138.9:34929 remote=vesta.apache.org/67.195.138.9:44173]
  test3686a(org.apache.hadoop.hbase.client.TestScannerTimeout): 10293ms passed since the last
invocation, timeout is currently set to 10000

Tests run: 1015, Failures: 5, Errors: 2, Skipped: 9

[INFO] ------------------------------------------------------------------------
[INFO] Reactor Summary:
[INFO] 
[INFO] HBase ............................................. SUCCESS [2.689s]
[INFO] HBase - Common .................................... SUCCESS [5.054s]
[INFO] HBase - Server .................................... FAILURE [55:06.725s]
[INFO] HBase - Assembly .................................. SKIPPED
[INFO] HBase - Site ...................................... SKIPPED
[INFO] ------------------------------------------------------------------------
[INFO] BUILD FAILURE
[INFO] ------------------------------------------------------------------------
[INFO] Total time: 55:14.991s
[INFO] Finished at: Sat Jun 02 00:19:31 UTC 2012
[INFO] Final Memory: 42M/508M
[INFO] ------------------------------------------------------------------------
[ERROR] Failed to execute goal org.apache.maven.plugins:maven-surefire-plugin:2.12-TRUNK-HBASE-2:test
(secondPartTestsExecution) on project hbase-server: There are test failures.
[ERROR] 
[ERROR] Please refer to <https://builds.apache.org/job/HBase-TRUNK/ws/trunk/hbase-server/target/surefire-reports>
for the individual test results.
[ERROR] -> [Help 1]
org.apache.maven.lifecycle.LifecycleExecutionException: Failed to execute goal org.apache.maven.plugins:maven-surefire-plugin:2.12-TRUNK-HBASE-2:test
(secondPartTestsExecution) on project hbase-server: There are test failures.

Please refer to <https://builds.apache.org/job/HBase-TRUNK/ws/trunk/hbase-server/target/surefire-reports>
for the individual test results.
	at org.apache.maven.lifecycle.internal.MojoExecutor.execute(MojoExecutor.java:213)
	at org.apache.maven.lifecycle.internal.MojoExecutor.execute(MojoExecutor.java:153)
	at org.apache.maven.lifecycle.internal.MojoExecutor.execute(MojoExecutor.java:145)
	at org.apache.maven.lifecycle.internal.LifecycleModuleBuilder.buildProject(LifecycleModuleBuilder.java:84)
	at org.apache.maven.lifecycle.internal.LifecycleModuleBuilder.buildProject(LifecycleModuleBuilder.java:59)
	at org.apache.maven.lifecycle.internal.LifecycleStarter.singleThreadedBuild(LifecycleStarter.java:183)
	at org.apache.maven.lifecycle.internal.LifecycleStarter.execute(LifecycleStarter.java:161)
	at org.apache.maven.DefaultMaven.doExecute(DefaultMaven.java:319)
	at org.apache.maven.DefaultMaven.execute(DefaultMaven.java:156)
	at org.apache.maven.cli.MavenCli.execute(MavenCli.java:537)
	at org.apache.maven.cli.MavenCli.doMain(MavenCli.java:196)
	at org.apache.maven.cli.MavenCli.main(MavenCli.java:141)
	at sun.reflect.NativeMethodAccessorImpl.invoke0(Native Method)
	at sun.reflect.NativeMethodAccessorImpl.invoke(NativeMethodAccessorImpl.java:39)
	at sun.reflect.DelegatingMethodAccessorImpl.invoke(DelegatingMethodAccessorImpl.java:25)
	at java.lang.reflect.Method.invoke(Method.java:597)
	at org.codehaus.plexus.classworlds.launcher.Launcher.launchEnhanced(Launcher.java:290)
	at org.codehaus.plexus.classworlds.launcher.Launcher.launch(Launcher.java:230)
	at org.codehaus.plexus.classworlds.launcher.Launcher.mainWithExitCode(Launcher.java:409)
	at org.codehaus.plexus.classworlds.launcher.Launcher.main(Launcher.java:352)
Caused by: org.apache.maven.plugin.MojoFailureException: There are test failures.

Please refer to <https://builds.apache.org/job/HBase-TRUNK/ws/trunk/hbase-server/target/surefire-reports>
for the individual test results.
	at org.apache.maven.plugin.surefire.SurefireHelper.reportExecution(SurefireHelper.java:87)
	at org.apache.maven.plugin.surefire.SurefirePlugin.writeSummary(SurefirePlugin.java:651)
	at org.apache.maven.plugin.surefire.SurefirePlugin.handleSummary(SurefirePlugin.java:625)
	at org.apache.maven.plugin.surefire.AbstractSurefireMojo.executeAfterPreconditionsChecked(AbstractSurefireMojo.java:137)
	at org.apache.maven.plugin.surefire.AbstractSurefireMojo.execute(AbstractSurefireMojo.java:98)
	at org.apache.maven.plugin.DefaultBuildPluginManager.executeMojo(DefaultBuildPluginManager.java:101)
	at org.apache.maven.lifecycle.internal.MojoExecutor.execute(MojoExecutor.java:209)
	... 19 more
[ERROR] 
[ERROR] 
[ERROR] For more information about the errors and possible solutions, please read the following
articles:
[ERROR] [Help 1] http://cwiki.apache.org/confluence/display/MAVEN/MojoFailureException
[ERROR] 
[ERROR] After correcting the problems, you can resume the build with the command
[ERROR]   mvn <goals> -rf :hbase-server
Build step 'Invoke top-level Maven targets' marked build as failure
Archiving artifacts
Recording test results
Updating HBASE-5936
Updating HBASE-6138

Mime
View raw message