hbase-dev mailing list archives

Site index · List index
Message view « Date » · « Thread »
Top « Date » · « Thread »
From Apache Jenkins Server <jenk...@builds.apache.org>
Subject Build failed in Jenkins: HBase-TRUNK-on-Hadoop-2.0.0 #42
Date Tue, 05 Jun 2012 23:18:03 GMT
See <https://builds.apache.org/job/HBase-TRUNK-on-Hadoop-2.0.0/42/changes>

Changes:

[stack] HBASE-6167 Fix xinclude for docs broke when we multi-moduled

[stack] HBASE-3537 [site] Make it so each page of manual allows users comment like mysql's
manual does

[stack] HBASE-6160 META entries from daughters can be deleted before parent entries

[ramkrishna] HBASE-6046 Master retry on ZK session expiry causes inconsistent region assignments.
(Asutosh)

[stack] HBASE-5609 Add the ability to pass additional information for slow query logging

------------------------------------------
[...truncated 6049 lines...]
456 KB   
459 KB   
463 KB   
467 KB   
471 KB   
475 KB   
479 KB   
483 KB   
487 KB   
491 KB   
495 KB   
498 KB   
502 KB   
506 KB   
510 KB   
514 KB   
518 KB   
522 KB   
526 KB   
530 KB   
534 KB   
538 KB   
542 KB   
545 KB   
549 KB   
553 KB   
557 KB   
561 KB   
565 KB   
569 KB   
573 KB   
577 KB   
581 KB   
584 KB   
588 KB   
592 KB   
596 KB   
600 KB   
604 KB   
608 KB   
612 KB   
616 KB   
620 KB   
623 KB   
627 KB   
631 KB   
635 KB   
639 KB   
643 KB   
647 KB   
651 KB   
655 KB   
659 KB   
663 KB   
667 KB   
670 KB   
674 KB   
678 KB   
682 KB   
686 KB   
690 KB   
694 KB   
698 KB   
702 KB   
706 KB   
709 KB   
713 KB   
717 KB   
721 KB   
725 KB   
729 KB   
733 KB   
737 KB   
741 KB   
745 KB   
748 KB   
752 KB   
756 KB   
760 KB   
764 KB   
768 KB   
772 KB   
776 KB   
780 KB   
784 KB   
788 KB   
792 KB   
795 KB   
799 KB   
803 KB   
807 KB   
811 KB   
815 KB   
819 KB   
823 KB   
827 KB   
831 KB   
834 KB   
838 KB   
842 KB   
846 KB   
850 KB   
854 KB   
858 KB   
862 KB   
866 KB   
870 KB   
873 KB   
877 KB   
881 KB   
885 KB   
889 KB   
893 KB   
897 KB   
901 KB   
905 KB   
909 KB   
913 KB   
917 KB   
920 KB   
924 KB   
928 KB   
932 KB   
936 KB   
940 KB   
944 KB   
948 KB   
952 KB   
956 KB   
959 KB   
963 KB   
967 KB   
971 KB   
975 KB   
979 KB   
983 KB   
987 KB   
991 KB   
995 KB   
998 KB   
1002 KB   
1006 KB   
1010 KB   
1014 KB   
1018 KB   
1022 KB   
1026 KB   
1030 KB   
1034 KB   
1038 KB   
1042 KB   
1045 KB   
1049 KB   
1053 KB   
1057 KB   
1061 KB   
1065 KB   
1069 KB   
1073 KB   
1077 KB   
1081 KB   
1084 KB   
1088 KB   
1092 KB   
1096 KB   
1100 KB   
1104 KB   
1108 KB   
1112 KB   
1116 KB   
1120 KB   
1123 KB   
1127 KB   
1131 KB   
1135 KB   
1139 KB   
1143 KB   
1147 KB   
1151 KB   
1155 KB   
1159 KB   
1163 KB   
1167 KB   
1170 KB   
1174 KB   
1178 KB   
1182 KB   
1186 KB   
1190 KB   
1194 KB   
1198 KB   
1202 KB   
1206 KB   
1209 KB   
1213 KB   
1217 KB   
1221 KB   
1225 KB   
1229 KB   
1233 KB   
1237 KB   
1241 KB   
1245 KB   
1248 KB   
1252 KB   
1256 KB   
1260 KB   
1264 KB   
1268 KB   
1272 KB   
1273 KB   
          
Downloaded: https://repository.apache.org/content/repositories/releases/org/apache/hadoop/hadoop-mapreduce-client-jobclient/2.0.0-alpha/hadoop-mapreduce-client-jobclient-2.0.0-alpha-tests.jar
(1273 KB at 489.7 KB/sec)
[INFO]                                                                         
[INFO] ------------------------------------------------------------------------
[INFO] Skipping HBase
[INFO] This project has been banned from the build due to previous failures.
[INFO] ------------------------------------------------------------------------
[INFO] ------------------------------------------------------------------------
[INFO] Reactor Summary:
[INFO] 
[INFO] HBase ............................................. FAILURE [16.396s]
[INFO] HBase - Common .................................... SUCCESS [0.004s]
[INFO] HBase - Server .................................... SUCCESS [0.007s]
[INFO] ------------------------------------------------------------------------
[INFO] BUILD FAILURE
[INFO] ------------------------------------------------------------------------
[INFO] Total time: 22.941s
[INFO] Finished at: Tue Jun 05 23:18:01 UTC 2012
[INFO] Final Memory: 20M/172M
[INFO] ------------------------------------------------------------------------
[ERROR] Failed to execute goal on project hbase-server: Could not resolve dependencies for
project org.apache.hbase:hbase-server:jar:0.95-SNAPSHOT: Failure to find org.apache.hbase:hbase-common:jar:0.95-SNAPSHOT
in https://repository.apache.org/content/repositories/releases/ was cached in the local repository,
resolution will not be reattempted until the update interval of apache release has elapsed
or updates are forced -> [Help 1]
[ERROR] 
[ERROR] To see the full stack trace of the errors, re-run Maven with the -e switch.
[ERROR] Re-run Maven using the -X switch to enable full debug logging.
[ERROR] 
[ERROR] For more information about the errors and possible solutions, please read the following
articles:
[ERROR] [Help 1] http://cwiki.apache.org/confluence/display/MAVEN/DependencyResolutionException
[ERROR] 
[ERROR] After correcting the problems, you can resume the build with the command
[ERROR]   mvn <goals> -rf :hbase-server
Build step 'Invoke top-level Maven targets' marked build as failure
Archiving artifacts
Recording test results
Updating HBASE-3537
Updating HBASE-6167
Updating HBASE-5609
Updating HBASE-6046
Updating HBASE-6160

Mime
View raw message