hbase-dev mailing list archives

Site index · List index
Message view « Date » · « Thread »
Top « Date » · « Thread »
From Apache Jenkins Server <jenk...@builds.apache.org>
Subject Build failed in Jenkins: HBase-TRUNK-on-Hadoop-2.0.0 #38
Date Sun, 03 Jun 2012 23:16:42 GMT
See <https://builds.apache.org/job/HBase-TRUNK-on-Hadoop-2.0.0/38/changes>

Changes:

[stack] HBASE-6145 Fix site target post modularization

[stack] HBASE-6145 Fix site target post modularization

[tedyu] HBASE-6067 HBase won't start when hbase.rootdir uses ViewFileSystem

[tedyu] HBASE-6138 Addendum, the filter file location can be more general (Jesse Yates)

------------------------------------------
[...truncated 1706 lines...]
56 KB   
56 KB   
57 KB   
57 KB   
58 KB   
58 KB   
59 KB   
59 KB   
60 KB   
60 KB   
61 KB   
61 KB   
62 KB   
62 KB   
63 KB   
63 KB   
64 KB   
64 KB   
65 KB   
65 KB   
66 KB   
66 KB   
67 KB   
67 KB   
68 KB   
68 KB   
69 KB   
69 KB   
70 KB   
70 KB   
71 KB   
71 KB   
72 KB   
72 KB   
73 KB   
74 KB   
74 KB   
74 KB   
75 KB   
76 KB   
76 KB   
77 KB   
77 KB   
78 KB   
78 KB   
79 KB   
79 KB   
80 KB   
80 KB   
81 KB   
81 KB   
82 KB   
82 KB   
83 KB   
83 KB   
83 KB   
84 KB   
84 KB   
85 KB   
86 KB   
86 KB   
87 KB   
87 KB   
88 KB   
88 KB   
89 KB   
89 KB   
90 KB   
90 KB   
91 KB   
91 KB   
92 KB   
93 KB   
93 KB   
94 KB   
94 KB   
95 KB   
95 KB   
96 KB   
96 KB   
97 KB   
97 KB   
98 KB   
98 KB   
99 KB   
100 KB   
100 KB   
101 KB   
101 KB   
102 KB   
102 KB   
103 KB   
103 KB   
104 KB   
105 KB   
105 KB   
105 KB   
106 KB   
106 KB   
107 KB   
108 KB   
108 KB   
109 KB   
109 KB   
110 KB   
110 KB   
111 KB   
112 KB   
114 KB   
117 KB   
117 KB   
         
Downloaded: http://repo1.maven.org/maven2/org/apache/maven/plugins/maven-site-plugin/3.1/maven-site-plugin-3.1.jar
(117 KB at 193.0 KB/sec)
Downloading: http://people.apache.org/~garyh/mvn/org/eclipse/m2e/lifecycle-mapping/1.0.0/lifecycle-mapping-1.0.0.pom
         
[WARNING] The POM for org.eclipse.m2e:lifecycle-mapping:jar:1.0.0 is missing, no dependency
information available
[WARNING] Failed to retrieve plugin descriptor for org.eclipse.m2e:lifecycle-mapping:1.0.0:
Plugin org.eclipse.m2e:lifecycle-mapping:1.0.0 or one of its dependencies could not be resolved:
Failed to read artifact descriptor for org.eclipse.m2e:lifecycle-mapping:jar:1.0.0
Downloading: http://people.apache.org/~garyh/mvn/org/apache/maven/plugins/maven-metadata.xml
Downloading: http://people.apache.org/~garyh/mvn/org/codehaus/mojo/maven-metadata.xml
         
567 B    
        
Downloaded: http://people.apache.org/~garyh/mvn/org/apache/maven/plugins/maven-metadata.xml
(567 B at 5.2 KB/sec)
Downloading: http://people.apache.org/~garyh/mvn/org/apache/maven/plugins/maven-help-plugin/maven-metadata.xml
        
[INFO]                                                                         
[INFO] ------------------------------------------------------------------------
[INFO] Building HBase 0.95-SNAPSHOT
[INFO] ------------------------------------------------------------------------
[INFO] 
[INFO] --- maven-clean-plugin:2.4.1:clean (default-clean) @ hbase ---
[INFO]                                                                         
[INFO] ------------------------------------------------------------------------
[INFO] Building HBase - Common 0.95-SNAPSHOT
[INFO] ------------------------------------------------------------------------
[INFO] 
[INFO] --- maven-clean-plugin:2.4.1:clean (default-clean) @ hbase-common ---
[INFO]                                                                         
[INFO] ------------------------------------------------------------------------
[INFO] Building HBase - Server 0.95-SNAPSHOT
[INFO] ------------------------------------------------------------------------
[INFO] 
[INFO] --- maven-clean-plugin:2.4.1:clean (default-clean) @ hbase-server ---
[INFO]                                                                         
[INFO] ------------------------------------------------------------------------
[INFO] Building HBase 0.95-SNAPSHOT
[INFO] ------------------------------------------------------------------------
[WARNING] The POM for org.eclipse.m2e:lifecycle-mapping:jar:1.0.0 is missing, no dependency
information available
[WARNING] Failed to retrieve plugin descriptor for org.eclipse.m2e:lifecycle-mapping:1.0.0:
Plugin org.eclipse.m2e:lifecycle-mapping:1.0.0 or one of its dependencies could not be resolved:
Failed to read artifact descriptor for org.eclipse.m2e:lifecycle-mapping:jar:1.0.0
[INFO] 
[INFO] --- maven-help-plugin:2.1.1:active-profiles (default-cli) @ hbase ---
[INFO] 
Active Profiles for Project 'org.apache.hbase:hbase:pom:0.95-SNAPSHOT': 

The following profiles are active:

 - os.linux (source: pom)
 - release (source: pom)
 - hadoop-2.0 (source: pom)
 - runAllTests (source: pom)



Active Profiles for Project 'org.apache.hbase:hbase-common:jar:0.95-SNAPSHOT': 

The following profiles are active:

 - hadoop-2.0 (source: pom)



Active Profiles for Project 'org.apache.hbase:hbase-server:jar:0.95-SNAPSHOT': 

The following profiles are active:

 - hadoop-2.0 (source: pom)



[INFO]                                                                         
[INFO] ------------------------------------------------------------------------
[INFO] Building HBase 0.95-SNAPSHOT
[INFO] ------------------------------------------------------------------------
[INFO] 
[INFO] --- maven-remote-resources-plugin:1.1:process (default) @ hbase ---
[INFO] Setting property: classpath.resource.loader.class => 'org.codehaus.plexus.velocity.ContextClassLoaderResourceLoader'.
[INFO] Setting property: velocimacro.messages.on => 'false'.
[INFO] Setting property: resource.loader => 'classpath'.
[INFO] Setting property: resource.manager.logwhenfound => 'false'.
[INFO] 
[INFO] --- findbugs-maven-plugin:2.4.0:findbugs (default) @ hbase ---
[INFO] 
[INFO] --- apache-rat-plugin:0.8:check (default) @ hbase ---
[INFO] Exclude: **/.*
[INFO] Exclude: **/*.tgz
[INFO] Exclude: **/*.orig
[INFO] Exclude: **/test/**
[INFO] Exclude: **/8e8ab58dcf39412da19833fcd8f687ac
[INFO] Exclude: **/.git/**
[INFO] Exclude: **/target/**
[INFO] Exclude: **/CHANGES.txt
[INFO] Exclude: **/generated/**
[INFO] Exclude: **/conf/*
[INFO] Exclude: **/*.avpr
[INFO] Exclude: **/*.svg
[INFO] Exclude: **/*.vm
[INFO] Exclude: **/control
[INFO] Exclude: **/conffile
[INFO] Exclude: docs/*
[INFO] Exclude: **/src/site/resources/css/freebsd_docbook.css
[INFO] 
[INFO] --- maven-install-plugin:2.3:install (default-install) @ hbase ---
[INFO] Installing <https://builds.apache.org/job/HBase-TRUNK-on-Hadoop-2.0.0/ws/trunk/pom.xml>
to /home/jenkins/.m2/repository/org/apache/hbase/hbase/0.95-SNAPSHOT/hbase-0.95-SNAPSHOT.pom
[INFO] 
[INFO] --- maven-assembly-plugin:2.3:single (default-cli) @ hbase ---
[INFO] Reading assembly descriptor: src/assembly/all.xml
[WARNING] [DEPRECATION] moduleSet/binaries section detected in root-project assembly.

MODULE BINARIES MAY NOT BE AVAILABLE FOR THIS ASSEMBLY!

 To refactor, move this assembly into a child project and use the flag <useAllReactorProjects>true</useAllReactorProjects>
in each moduleSet.
[INFO] Processing sources for module project: org.apache.hbase:hbase-common:jar:0.95-SNAPSHOT
[INFO] Processing sources for module project: org.apache.hbase:hbase-server:jar:0.95-SNAPSHOT
[INFO] ------------------------------------------------------------------------
[INFO] Reactor Summary:
[INFO] 
[INFO] HBase ............................................. FAILURE [5.648s]
[INFO] HBase - Common .................................... SUCCESS [0.004s]
[INFO] HBase - Server .................................... SUCCESS [0.006s]
[INFO] ------------------------------------------------------------------------
[INFO] BUILD FAILURE
[INFO] ------------------------------------------------------------------------
[INFO] Total time: 10.277s
[INFO] Finished at: Sun Jun 03 23:16:36 UTC 2012
[INFO] Final Memory: 29M/316M
[INFO] ------------------------------------------------------------------------
[ERROR] Failed to execute goal org.apache.maven.plugins:maven-assembly-plugin:2.3:single (default-cli)
on project hbase: Failed to create assembly: Artifact: org.apache.hbase:hbase-common:jar:0.95-SNAPSHOT
(included by module) does not have an artifact with a file. Please ensure the package phase
is run before the assembly is generated. -> [Help 1]
[ERROR] 
[ERROR] To see the full stack trace of the errors, re-run Maven with the -e switch.
[ERROR] Re-run Maven using the -X switch to enable full debug logging.
[ERROR] 
[ERROR] For more information about the errors and possible solutions, please read the following
articles:
[ERROR] [Help 1] http://cwiki.apache.org/confluence/display/MAVEN/MojoExecutionException
Build step 'Invoke top-level Maven targets' marked build as failure
Archiving artifacts
Recording test results
Updating HBASE-6145
Updating HBASE-6138
Updating HBASE-6067

Mime
View raw message