hbase-dev mailing list archives

Site index · List index
Message view « Date » · « Thread »
Top « Date » · « Thread »
From Apache Jenkins Server <jenk...@builds.apache.org>
Subject Build failed in Jenkins: HBase-0.94-security #33
Date Fri, 01 Jun 2012 05:43:12 GMT
See <https://builds.apache.org/job/HBase-0.94-security/33/changes>

Changes:

[stack] HBASE-6141 InterfaceAudience breaks 0.94 on older versions of hadoop

[ramkrishna] HBASE-6089 SSH and AM.joinCluster causes Concurrent Modification exception. (Rajesh)

[ramkrishna] HBASE-6122 Backup master does not become Active master after ZK exception (Ram)

[stack] HBASE-6040 Use block encoding and HBase handled checksum verification in bulk loading
using HFileOutputFormat

[stack] HBASE-6016 ServerShutdownHandler#processDeadRegion could return false for disabling
table regions

[stack] HBASE-6062 preCheckAndPut/Delete() checks for READ when also a WRITE is performed

[stack] HBASE-6068 Secure HBase cluster : Client not able to call some admin APIs

[stack] HBASE-6122 Backup master does not become Active master after ZK exception: REVERT

[stack] HBASE-6124 Backport HBASE-6033 to 0.90, 0.92 and 0.94

[stack] HBASE-6129 Backport of Add Increment Coalescing in thrift.

[stack] HBASE-4720 Implement atomic update operations (checkAndPut, checkAndDelete) for REST
client/server

[stack] HBASE-6049 Serializing 'List' containing null elements will cause NullPointerException
in HbaseObjectWritable.writeObject()

[ramkrishna] HBASE-5733 AssignmentManager#processDeadServersAndRegionsInTransition can fail
with NPE. (Uma)

[ramkrishna] HBASE-5722 NPE in ZKUtil#getChildDataAndWatchForNewChildren when ZK not available
or NW down. (Uma)

[ramkrishna] HBASE-6122 Backup master does not become Active master after ZK exception (Ram)

[stack] HBASE-6131 Add attribution for code added by HBASE-5533 metrics

[stack] HBASE-6131 Add attribution for code added by HBASE-5533 metrics

[tedyu] HBASE-6088 Addendum fixes testSplitBeforeSettingSplittingInZK (Ram)

[apurtell] HBASE-6114. CacheControl flags should be tunable per table schema per CF

[stack] HBASE-6133 TestRestartCluster failing in 0.92

[stack] HBASE-6107 Distributed log splitting hangs even there is no task under /hbase/splitlog

[stack] HBASE-6126 Fix broke TestLocalHBaseCluster in 0.92/0.94

[stack] HBASE-6095 ActiveMasterManager NullPointerException

[ramkrishna] HBASE-6115 NullPointerException is thrown when root and meta table regions are
assigning to another RS. (Ram)

[ramkrishna] HBASE-6088 Region splitting not happened for long time due to ZK exception while
creating RS_ZK_SPLITTING node (Rajesh)

[ramkrishna] HBASE-6118 Add a testcase for HBASE-6065 (Ashutosh)

[ramkrishna] HBASE-5916 RS restart just before master intialization we make the cluster non
operative(RajeshBabu)

[ramkrishna] HBASE-6050 HLogSplitter renaming recovered.edits and CJ removing the parent directory
races, making the HBCK to think cluster is inconsistent. (Ram)

[ramkrishna] HBASE-6002 Possible chance of resource leak in HlogSplitter (Chinna rao)

------------------------------------------
[...truncated 7292 lines...]
Forking command line: /bin/sh -c cd <https://builds.apache.org/job/HBase-0.94-security/ws/trunk>
&& /home/jenkins/tools/java/jdk1.6.0_27-32/jre/bin/java -enableassertions -Xmx1900m
-Djava.security.egd=file:/dev/./urandom -jar <https://builds.apache.org/job/HBase-0.94-security/ws/trunk/target/surefire/surefirebooter7729274651677809887.jar>
<https://builds.apache.org/job/HBase-0.94-security/ws/trunk/target/surefire/surefire3975425295277280212tmp>
<https://builds.apache.org/job/HBase-0.94-security/ws/trunk/target/surefire/surefire_732912998771536132805tmp>
Running org.apache.hadoop.hbase.mapreduce.TestHLogRecordReader
Tests run: 2, Failures: 0, Errors: 0, Skipped: 0, Time elapsed: 6.12 sec
Forking command line: /bin/sh -c cd <https://builds.apache.org/job/HBase-0.94-security/ws/trunk>
&& /home/jenkins/tools/java/jdk1.6.0_27-32/jre/bin/java -enableassertions -Xmx1900m
-Djava.security.egd=file:/dev/./urandom -jar <https://builds.apache.org/job/HBase-0.94-security/ws/trunk/target/surefire/surefirebooter6567403741392136619.jar>
<https://builds.apache.org/job/HBase-0.94-security/ws/trunk/target/surefire/surefire4190214003762951499tmp>
<https://builds.apache.org/job/HBase-0.94-security/ws/trunk/target/surefire/surefire_748948833009140629562tmp>
Running org.apache.hadoop.hbase.TestGlobalMemStoreSize
Tests run: 1, Failures: 0, Errors: 0, Skipped: 0, Time elapsed: 17.055 sec
Forking command line: /bin/sh -c cd <https://builds.apache.org/job/HBase-0.94-security/ws/trunk>
&& /home/jenkins/tools/java/jdk1.6.0_27-32/jre/bin/java -enableassertions -Xmx1900m
-Djava.security.egd=file:/dev/./urandom -jar <https://builds.apache.org/job/HBase-0.94-security/ws/trunk/target/surefire/surefirebooter198522060435378291.jar>
<https://builds.apache.org/job/HBase-0.94-security/ws/trunk/target/surefire/surefire6246703634652980327tmp>
<https://builds.apache.org/job/HBase-0.94-security/ws/trunk/target/surefire/surefire_758584471646001787395tmp>
Running org.apache.hadoop.hbase.mapreduce.TestImportExport
Tests run: 2, Failures: 0, Errors: 0, Skipped: 0, Time elapsed: 62.905 sec
Forking command line: /bin/sh -c cd <https://builds.apache.org/job/HBase-0.94-security/ws/trunk>
&& /home/jenkins/tools/java/jdk1.6.0_27-32/jre/bin/java -enableassertions -Xmx1900m
-Djava.security.egd=file:/dev/./urandom -jar <https://builds.apache.org/job/HBase-0.94-security/ws/trunk/target/surefire/surefirebooter5663406232511590710.jar>
<https://builds.apache.org/job/HBase-0.94-security/ws/trunk/target/surefire/surefire2781030842034879987tmp>
<https://builds.apache.org/job/HBase-0.94-security/ws/trunk/target/surefire/surefire_767574883495831426669tmp>
Running org.apache.hadoop.hbase.TestAcidGuarantees
Tests run: 3, Failures: 0, Errors: 0, Skipped: 0, Time elapsed: 106.764 sec
Forking command line: /bin/sh -c cd <https://builds.apache.org/job/HBase-0.94-security/ws/trunk>
&& /home/jenkins/tools/java/jdk1.6.0_27-32/jre/bin/java -enableassertions -Xmx1900m
-Djava.security.egd=file:/dev/./urandom -jar <https://builds.apache.org/job/HBase-0.94-security/ws/trunk/target/surefire/surefirebooter1341308282420920598.jar>
<https://builds.apache.org/job/HBase-0.94-security/ws/trunk/target/surefire/surefire644351211611428320tmp>
<https://builds.apache.org/job/HBase-0.94-security/ws/trunk/target/surefire/surefire_775919113999522082398tmp>
Running org.apache.hadoop.hbase.mapreduce.TestImportTsv
Tests run: 9, Failures: 0, Errors: 0, Skipped: 0, Time elapsed: 179.747 sec
Forking command line: /bin/sh -c cd <https://builds.apache.org/job/HBase-0.94-security/ws/trunk>
&& /home/jenkins/tools/java/jdk1.6.0_27-32/jre/bin/java -enableassertions -Xmx1900m
-Djava.security.egd=file:/dev/./urandom -jar <https://builds.apache.org/job/HBase-0.94-security/ws/trunk/target/surefire/surefirebooter2774298741134334784.jar>
<https://builds.apache.org/job/HBase-0.94-security/ws/trunk/target/surefire/surefire8383281044951964884tmp>
<https://builds.apache.org/job/HBase-0.94-security/ws/trunk/target/surefire/surefire_785766123350994572137tmp>
Running org.apache.hadoop.hbase.catalog.TestMetaReaderEditorNoCluster
Tests run: 1, Failures: 0, Errors: 0, Skipped: 0, Time elapsed: 4.244 sec
Forking command line: /bin/sh -c cd <https://builds.apache.org/job/HBase-0.94-security/ws/trunk>
&& /home/jenkins/tools/java/jdk1.6.0_27-32/jre/bin/java -enableassertions -Xmx1900m
-Djava.security.egd=file:/dev/./urandom -jar <https://builds.apache.org/job/HBase-0.94-security/ws/trunk/target/surefire/surefirebooter488684655802811206.jar>
<https://builds.apache.org/job/HBase-0.94-security/ws/trunk/target/surefire/surefire2131869428640452951tmp>
<https://builds.apache.org/job/HBase-0.94-security/ws/trunk/target/surefire/surefire_79450241684022930137tmp>
Running org.apache.hadoop.hbase.thrift2.TestThriftHBaseServiceHandler
Tests run: 12, Failures: 0, Errors: 0, Skipped: 0, Time elapsed: 13.618 sec
Forking command line: /bin/sh -c cd <https://builds.apache.org/job/HBase-0.94-security/ws/trunk>
&& /home/jenkins/tools/java/jdk1.6.0_27-32/jre/bin/java -enableassertions -Xmx1900m
-Djava.security.egd=file:/dev/./urandom -jar <https://builds.apache.org/job/HBase-0.94-security/ws/trunk/target/surefire/surefirebooter8594932235090534969.jar>
<https://builds.apache.org/job/HBase-0.94-security/ws/trunk/target/surefire/surefire8906051984209374232tmp>
<https://builds.apache.org/job/HBase-0.94-security/ws/trunk/target/surefire/surefire_806297170711896944820tmp>
Running org.apache.hadoop.hbase.catalog.TestCatalogTracker
Tests run: 9, Failures: 0, Errors: 0, Skipped: 1, Time elapsed: 6.579 sec
Forking command line: /bin/sh -c cd <https://builds.apache.org/job/HBase-0.94-security/ws/trunk>
&& /home/jenkins/tools/java/jdk1.6.0_27-32/jre/bin/java -enableassertions -Xmx1900m
-Djava.security.egd=file:/dev/./urandom -jar <https://builds.apache.org/job/HBase-0.94-security/ws/trunk/target/surefire/surefirebooter5236581665202026859.jar>
<https://builds.apache.org/job/HBase-0.94-security/ws/trunk/target/surefire/surefire3630346568051522836tmp>
<https://builds.apache.org/job/HBase-0.94-security/ws/trunk/target/surefire/surefire_818226366423373111478tmp>
Running org.apache.hadoop.hbase.catalog.TestMetaReaderEditor
Tests run: 5, Failures: 0, Errors: 0, Skipped: 0, Time elapsed: 28.477 sec
Forking command line: /bin/sh -c cd <https://builds.apache.org/job/HBase-0.94-security/ws/trunk>
&& /home/jenkins/tools/java/jdk1.6.0_27-32/jre/bin/java -enableassertions -Xmx1900m
-Djava.security.egd=file:/dev/./urandom -jar <https://builds.apache.org/job/HBase-0.94-security/ws/trunk/target/surefire/surefirebooter1438978069267203388.jar>
<https://builds.apache.org/job/HBase-0.94-security/ws/trunk/target/surefire/surefire484040777252752732tmp>
<https://builds.apache.org/job/HBase-0.94-security/ws/trunk/target/surefire/surefire_824520396565570458482tmp>
Running org.apache.hadoop.hbase.client.TestTimestampsFilter
Tests run: 3, Failures: 0, Errors: 0, Skipped: 0, Time elapsed: 26.981 sec
Forking command line: /bin/sh -c cd <https://builds.apache.org/job/HBase-0.94-security/ws/trunk>
&& /home/jenkins/tools/java/jdk1.6.0_27-32/jre/bin/java -enableassertions -Xmx1900m
-Djava.security.egd=file:/dev/./urandom -jar <https://builds.apache.org/job/HBase-0.94-security/ws/trunk/target/surefire/surefirebooter4247476627407566507.jar>
<https://builds.apache.org/job/HBase-0.94-security/ws/trunk/target/surefire/surefire3551815848971508917tmp>
<https://builds.apache.org/job/HBase-0.94-security/ws/trunk/target/surefire/surefire_835321557884477850618tmp>
Running org.apache.hadoop.hbase.client.TestHCM
Tests run: 6, Failures: 0, Errors: 0, Skipped: 0, Time elapsed: 18.021 sec
Forking command line: /bin/sh -c cd <https://builds.apache.org/job/HBase-0.94-security/ws/trunk>
&& /home/jenkins/tools/java/jdk1.6.0_27-32/jre/bin/java -enableassertions -Xmx1900m
-Djava.security.egd=file:/dev/./urandom -jar <https://builds.apache.org/job/HBase-0.94-security/ws/trunk/target/surefire/surefirebooter6370531173253402924.jar>
<https://builds.apache.org/job/HBase-0.94-security/ws/trunk/target/surefire/surefire2755597442336437503tmp>
<https://builds.apache.org/job/HBase-0.94-security/ws/trunk/target/surefire/surefire_843133040745437585054tmp>
Running org.apache.hadoop.hbase.client.TestMetaScanner
Tests run: 1, Failures: 0, Errors: 0, Skipped: 0, Time elapsed: 13.119 sec
Forking command line: /bin/sh -c cd <https://builds.apache.org/job/HBase-0.94-security/ws/trunk>
&& /home/jenkins/tools/java/jdk1.6.0_27-32/jre/bin/java -enableassertions -Xmx1900m
-Djava.security.egd=file:/dev/./urandom -jar <https://builds.apache.org/job/HBase-0.94-security/ws/trunk/target/surefire/surefirebooter2908732767643794257.jar>
<https://builds.apache.org/job/HBase-0.94-security/ws/trunk/target/surefire/surefire8550659322565133151tmp>
<https://builds.apache.org/job/HBase-0.94-security/ws/trunk/target/surefire/surefire_852504640184802910441tmp>
Running org.apache.hadoop.hbase.client.TestHTableUtil
Tests run: 2, Failures: 0, Errors: 0, Skipped: 0, Time elapsed: 19.874 sec
Forking command line: /bin/sh -c cd <https://builds.apache.org/job/HBase-0.94-security/ws/trunk>
&& /home/jenkins/tools/java/jdk1.6.0_27-32/jre/bin/java -enableassertions -Xmx1900m
-Djava.security.egd=file:/dev/./urandom -jar <https://builds.apache.org/job/HBase-0.94-security/ws/trunk/target/surefire/surefirebooter6285238240039896378.jar>
<https://builds.apache.org/job/HBase-0.94-security/ws/trunk/target/surefire/surefire563642947541234159tmp>
<https://builds.apache.org/job/HBase-0.94-security/ws/trunk/target/surefire/surefire_868860099497171531057tmp>
Running org.apache.hadoop.hbase.client.TestMetaMigrationRemovingHTD
Tests run: 3, Failures: 0, Errors: 0, Skipped: 0, Time elapsed: 26.636 sec
Forking command line: /bin/sh -c cd <https://builds.apache.org/job/HBase-0.94-security/ws/trunk>
&& /home/jenkins/tools/java/jdk1.6.0_27-32/jre/bin/java -enableassertions -Xmx1900m
-Djava.security.egd=file:/dev/./urandom -jar <https://builds.apache.org/job/HBase-0.94-security/ws/trunk/target/surefire/surefirebooter1858946919703670146.jar>
<https://builds.apache.org/job/HBase-0.94-security/ws/trunk/target/surefire/surefire8702687069367557111tmp>
<https://builds.apache.org/job/HBase-0.94-security/ws/trunk/target/surefire/surefire_871555871113547694324tmp>
Running org.apache.hadoop.hbase.client.replication.TestReplicationAdmin
Tests run: 1, Failures: 0, Errors: 0, Skipped: 0, Time elapsed: 0.89 sec
Forking command line: /bin/sh -c cd <https://builds.apache.org/job/HBase-0.94-security/ws/trunk>
&& /home/jenkins/tools/java/jdk1.6.0_27-32/jre/bin/java -enableassertions -Xmx1900m
-Djava.security.egd=file:/dev/./urandom -jar <https://builds.apache.org/job/HBase-0.94-security/ws/trunk/target/surefire/surefirebooter8894282869701955648.jar>
<https://builds.apache.org/job/HBase-0.94-security/ws/trunk/target/surefire/surefire6498503219632512259tmp>
<https://builds.apache.org/job/HBase-0.94-security/ws/trunk/target/surefire/surefire_881766029069320056076tmp>
Running org.apache.hadoop.hbase.client.TestHTablePool$TestHTableReusablePool
Tests run: 9, Failures: 0, Errors: 0, Skipped: 0, Time elapsed: 4.111 sec
Running org.apache.hadoop.hbase.client.TestHTablePool$TestHTableThreadLocalPool
Tests run: 9, Failures: 0, Errors: 0, Skipped: 0, Time elapsed: 20.51 sec
Forking command line: /bin/sh -c cd <https://builds.apache.org/job/HBase-0.94-security/ws/trunk>
&& /home/jenkins/tools/java/jdk1.6.0_27-32/jre/bin/java -enableassertions -Xmx1900m
-Djava.security.egd=file:/dev/./urandom -jar <https://builds.apache.org/job/HBase-0.94-security/ws/trunk/target/surefire/surefirebooter6985932487706586654.jar>
<https://builds.apache.org/job/HBase-0.94-security/ws/trunk/target/surefire/surefire367343519404742675tmp>
<https://builds.apache.org/job/HBase-0.94-security/ws/trunk/target/surefire/surefire_899054425372772952432tmp>
Running org.apache.hadoop.hbase.metrics.TestMetricsMBeanBase
Tests run: 2, Failures: 0, Errors: 0, Skipped: 0, Time elapsed: 1.123 sec
Forking command line: /bin/sh -c cd <https://builds.apache.org/job/HBase-0.94-security/ws/trunk>
&& /home/jenkins/tools/java/jdk1.6.0_27-32/jre/bin/java -enableassertions -Xmx1900m
-Djava.security.egd=file:/dev/./urandom -jar <https://builds.apache.org/job/HBase-0.94-security/ws/trunk/target/surefire/surefirebooter3745469437834650658.jar>
<https://builds.apache.org/job/HBase-0.94-security/ws/trunk/target/surefire/surefire9160187168867483340tmp>
<https://builds.apache.org/job/HBase-0.94-security/ws/trunk/target/surefire/surefire_905243367963858962564tmp>
Running org.apache.hadoop.hbase.client.TestMultiParallel
Tests run: 11, Failures: 0, Errors: 0, Skipped: 0, Time elapsed: 42.325 sec
Running org.apache.hadoop.hbase.constraint.TestConstraint
Tests run: 5, Failures: 0, Errors: 0, Skipped: 0, Time elapsed: 32.713 sec
Forking command line: /bin/sh -c cd <https://builds.apache.org/job/HBase-0.94-security/ws/trunk>
&& /home/jenkins/tools/java/jdk1.6.0_27-32/jre/bin/java -enableassertions -Xmx1900m
-Djava.security.egd=file:/dev/./urandom -jar <https://builds.apache.org/job/HBase-0.94-security/ws/trunk/target/surefire/surefirebooter1833388959723375564.jar>
<https://builds.apache.org/job/HBase-0.94-security/ws/trunk/target/surefire/surefire5324100756497650595tmp>
<https://builds.apache.org/job/HBase-0.94-security/ws/trunk/target/surefire/surefire_918527575097271412035tmp>
Forking command line: /bin/sh -c cd <https://builds.apache.org/job/HBase-0.94-security/ws/trunk>
&& /home/jenkins/tools/java/jdk1.6.0_27-32/jre/bin/java -enableassertions -Xmx1900m
-Djava.security.egd=file:/dev/./urandom -jar <https://builds.apache.org/job/HBase-0.94-security/ws/trunk/target/surefire/surefirebooter7075392351130934403.jar>
<https://builds.apache.org/job/HBase-0.94-security/ws/trunk/target/surefire/surefire7303971009499403023tmp>
<https://builds.apache.org/job/HBase-0.94-security/ws/trunk/target/surefire/surefire_925486928439677360332tmp>
Running org.apache.hadoop.hbase.rest.TestGzipFilter
Tests run: 3, Failures: 0, Errors: 0, Skipped: 0, Time elapsed: 18.337 sec
Forking command line: /bin/sh -c cd <https://builds.apache.org/job/HBase-0.94-security/ws/trunk>
&& /home/jenkins/tools/java/jdk1.6.0_27-32/jre/bin/java -enableassertions -Xmx1900m
-Djava.security.egd=file:/dev/./urandom -jar <https://builds.apache.org/job/HBase-0.94-security/ws/trunk/target/surefire/surefirebooter5466096472612280986.jar>
<https://builds.apache.org/job/HBase-0.94-security/ws/trunk/target/surefire/surefire5856037991926754546tmp>
<https://builds.apache.org/job/HBase-0.94-security/ws/trunk/target/surefire/surefire_93750752551720029163tmp>
Running org.apache.hadoop.hbase.rest.TestMultiRowResource
Tests run: 3, Failures: 0, Errors: 0, Skipped: 0, Time elapsed: 18.894 sec
Forking command line: /bin/sh -c cd <https://builds.apache.org/job/HBase-0.94-security/ws/trunk>
&& /home/jenkins/tools/java/jdk1.6.0_27-32/jre/bin/java -enableassertions -Xmx1900m
-Djava.security.egd=file:/dev/./urandom -jar <https://builds.apache.org/job/HBase-0.94-security/ws/trunk/target/surefire/surefirebooter4037049098340533560.jar>
<https://builds.apache.org/job/HBase-0.94-security/ws/trunk/target/surefire/surefire8475251060534300385tmp>
<https://builds.apache.org/job/HBase-0.94-security/ws/trunk/target/surefire/surefire_945221618791847520371tmp>
Running org.apache.hadoop.hbase.rest.TestRowResource
Tests run: 11, Failures: 0, Errors: 0, Skipped: 0, Time elapsed: 16.124 sec
Forking command line: /bin/sh -c cd <https://builds.apache.org/job/HBase-0.94-security/ws/trunk>
&& /home/jenkins/tools/java/jdk1.6.0_27-32/jre/bin/java -enableassertions -Xmx1900m
-Djava.security.egd=file:/dev/./urandom -jar <https://builds.apache.org/job/HBase-0.94-security/ws/trunk/target/surefire/surefirebooter3605564792246219216.jar>
<https://builds.apache.org/job/HBase-0.94-security/ws/trunk/target/surefire/surefire2009548424347519882tmp>
<https://builds.apache.org/job/HBase-0.94-security/ws/trunk/target/surefire/surefire_956997571484370039122tmp>
Running org.apache.hadoop.hbase.rest.TestScannersWithFilters
Tests run: 10, Failures: 0, Errors: 0, Skipped: 0, Time elapsed: 17.459 sec
Forking command line: /bin/sh -c cd <https://builds.apache.org/job/HBase-0.94-security/ws/trunk>
&& /home/jenkins/tools/java/jdk1.6.0_27-32/jre/bin/java -enableassertions -Xmx1900m
-Djava.security.egd=file:/dev/./urandom -jar <https://builds.apache.org/job/HBase-0.94-security/ws/trunk/target/surefire/surefirebooter8587078024198331788.jar>
<https://builds.apache.org/job/HBase-0.94-security/ws/trunk/target/surefire/surefire7589164670375071735tmp>
<https://builds.apache.org/job/HBase-0.94-security/ws/trunk/target/surefire/surefire_966744437153403565055tmp>
Running org.apache.hadoop.hbase.rest.client.TestRemoteAdmin
Tests run: 1, Failures: 0, Errors: 0, Skipped: 0, Time elapsed: 18.514 sec
Forking command line: /bin/sh -c cd <https://builds.apache.org/job/HBase-0.94-security/ws/trunk>
&& /home/jenkins/tools/java/jdk1.6.0_27-32/jre/bin/java -enableassertions -Xmx1900m
-Djava.security.egd=file:/dev/./urandom -jar <https://builds.apache.org/job/HBase-0.94-security/ws/trunk/target/surefire/surefirebooter3439233491018180267.jar>
<https://builds.apache.org/job/HBase-0.94-security/ws/trunk/target/surefire/surefire2179437912461087833tmp>
<https://builds.apache.org/job/HBase-0.94-security/ws/trunk/target/surefire/surefire_974068628580411089023tmp>
Running org.apache.hadoop.hbase.rest.client.TestRemoteTable
Tests run: 3, Failures: 0, Errors: 0, Skipped: 0, Time elapsed: 18.957 sec
Forking command line: /bin/sh -c cd <https://builds.apache.org/job/HBase-0.94-security/ws/trunk>
&& /home/jenkins/tools/java/jdk1.6.0_27-32/jre/bin/java -enableassertions -Xmx1900m
-Djava.security.egd=file:/dev/./urandom -jar <https://builds.apache.org/job/HBase-0.94-security/ws/trunk/target/surefire/surefirebooter3660629075232129826.jar>
<https://builds.apache.org/job/HBase-0.94-security/ws/trunk/target/surefire/surefire1302553917313625517tmp>
<https://builds.apache.org/job/HBase-0.94-security/ws/trunk/target/surefire/surefire_988988083369237390313tmp>
Running org.apache.hadoop.hbase.rest.TestVersionResource
Tests run: 7, Failures: 0, Errors: 0, Skipped: 0, Time elapsed: 11.098 sec
Forking command line: /bin/sh -c cd <https://builds.apache.org/job/HBase-0.94-security/ws/trunk>
&& /home/jenkins/tools/java/jdk1.6.0_27-32/jre/bin/java -enableassertions -Xmx1900m
-Djava.security.egd=file:/dev/./urandom -jar <https://builds.apache.org/job/HBase-0.94-security/ws/trunk/target/surefire/surefirebooter7200127891345800947.jar>
<https://builds.apache.org/job/HBase-0.94-security/ws/trunk/target/surefire/surefire2461000148197104831tmp>
<https://builds.apache.org/job/HBase-0.94-security/ws/trunk/target/surefire/surefire_997978527188992420838tmp>
Running org.apache.hadoop.hbase.rest.TestScannerResource
Tests run: 5, Failures: 0, Errors: 0, Skipped: 0, Time elapsed: 27.212 sec
Forking command line: /bin/sh -c cd <https://builds.apache.org/job/HBase-0.94-security/ws/trunk>
&& /home/jenkins/tools/java/jdk1.6.0_27-32/jre/bin/java -enableassertions -Xmx1900m
-Djava.security.egd=file:/dev/./urandom -jar <https://builds.apache.org/job/HBase-0.94-security/ws/trunk/target/surefire/surefirebooter5881954688632273170.jar>
<https://builds.apache.org/job/HBase-0.94-security/ws/trunk/target/surefire/surefire1449566673618772711tmp>
<https://builds.apache.org/job/HBase-0.94-security/ws/trunk/target/surefire/surefire_1003387216981495054937tmp>
Running org.apache.hadoop.hbase.rest.TestTableResource
Tests run: 8, Failures: 0, Errors: 0, Skipped: 0, Time elapsed: 25.486 sec
Forking command line: /bin/sh -c cd <https://builds.apache.org/job/HBase-0.94-security/ws/trunk>
&& /home/jenkins/tools/java/jdk1.6.0_27-32/jre/bin/java -enableassertions -Xmx1900m
-Djava.security.egd=file:/dev/./urandom -jar <https://builds.apache.org/job/HBase-0.94-security/ws/trunk/target/surefire/surefirebooter810419018358005313.jar>
<https://builds.apache.org/job/HBase-0.94-security/ws/trunk/target/surefire/surefire5342877044877016574tmp>
<https://builds.apache.org/job/HBase-0.94-security/ws/trunk/target/surefire/surefire_1013226179142942906641tmp>
Running org.apache.hadoop.hbase.rest.TestStatusResource
Tests run: 2, Failures: 0, Errors: 0, Skipped: 0, Time elapsed: 10.989 sec
Forking command line: /bin/sh -c cd <https://builds.apache.org/job/HBase-0.94-security/ws/trunk>
&& /home/jenkins/tools/java/jdk1.6.0_27-32/jre/bin/java -enableassertions -Xmx1900m
-Djava.security.egd=file:/dev/./urandom -jar <https://builds.apache.org/job/HBase-0.94-security/ws/trunk/target/surefire/surefirebooter3305634645453739299.jar>
<https://builds.apache.org/job/HBase-0.94-security/ws/trunk/target/surefire/surefire7703348537213694230tmp>
<https://builds.apache.org/job/HBase-0.94-security/ws/trunk/target/surefire/surefire_1024132007543765914917tmp>
Running org.apache.hadoop.hbase.rest.TestSchemaResource
Tests run: 2, Failures: 0, Errors: 0, Skipped: 0, Time elapsed: 19.382 sec
Forking command line: /bin/sh -c cd <https://builds.apache.org/job/HBase-0.94-security/ws/trunk>
&& /home/jenkins/tools/java/jdk1.6.0_27-32/jre/bin/java -enableassertions -Xmx1900m
-Djava.security.egd=file:/dev/./urandom -jar <https://builds.apache.org/job/HBase-0.94-security/ws/trunk/target/surefire/surefirebooter7145543636668780066.jar>
<https://builds.apache.org/job/HBase-0.94-security/ws/trunk/target/surefire/surefire248344482793435386tmp>
<https://builds.apache.org/job/HBase-0.94-security/ws/trunk/target/surefire/surefire_1031785919664736855836tmp>
Running org.apache.hadoop.hbase.thrift.TestThriftServer
Running org.apache.hadoop.hbase.io.encoding.TestLoadAndSwitchEncodeOnDisk
Tests run: 1, Failures: 0, Errors: 0, Skipped: 0, Time elapsed: 48.886 sec
Tests run: 1, Failures: 0, Errors: 0, Skipped: 0, Time elapsed: 31.371 sec
Forking command line: /bin/sh -c cd <https://builds.apache.org/job/HBase-0.94-security/ws/trunk>
&& /home/jenkins/tools/java/jdk1.6.0_27-32/jre/bin/java -enableassertions -Xmx1900m
-Djava.security.egd=file:/dev/./urandom -jar <https://builds.apache.org/job/HBase-0.94-security/ws/trunk/target/surefire/surefirebooter5920786725650796982.jar>
<https://builds.apache.org/job/HBase-0.94-security/ws/trunk/target/surefire/surefire4113973668163348231tmp>
<https://builds.apache.org/job/HBase-0.94-security/ws/trunk/target/surefire/surefire_1042414304149749397050tmp>
Forking command line: /bin/sh -c cd <https://builds.apache.org/job/HBase-0.94-security/ws/trunk>
&& /home/jenkins/tools/java/jdk1.6.0_27-32/jre/bin/java -enableassertions -Xmx1900m
-Djava.security.egd=file:/dev/./urandom -jar <https://builds.apache.org/job/HBase-0.94-security/ws/trunk/target/surefire/surefirebooter6925813193430927406.jar>
<https://builds.apache.org/job/HBase-0.94-security/ws/trunk/target/surefire/surefire106475148627706177tmp>
<https://builds.apache.org/job/HBase-0.94-security/ws/trunk/target/surefire/surefire_1051292103883915160522tmp>
Running org.apache.hadoop.hbase.io.hfile.TestHFileSeek
Tests run: 1, Failures: 0, Errors: 0, Skipped: 0, Time elapsed: 10.384 sec
Forking command line: /bin/sh -c cd <https://builds.apache.org/job/HBase-0.94-security/ws/trunk>
&& /home/jenkins/tools/java/jdk1.6.0_27-32/jre/bin/java -enableassertions -Xmx1900m
-Djava.security.egd=file:/dev/./urandom -jar <https://builds.apache.org/job/HBase-0.94-security/ws/trunk/target/surefire/surefirebooter7287189904637599027.jar>
<https://builds.apache.org/job/HBase-0.94-security/ws/trunk/target/surefire/surefire3775128992526860398tmp>
<https://builds.apache.org/job/HBase-0.94-security/ws/trunk/target/surefire/surefire_1065494719149534329615tmp>
Running org.apache.hadoop.hbase.io.hfile.slab.TestSlabCache
Tests run: 7, Failures: 0, Errors: 0, Skipped: 0, Time elapsed: 19.607 sec
Forking command line: /bin/sh -c cd <https://builds.apache.org/job/HBase-0.94-security/ws/trunk>
&& /home/jenkins/tools/java/jdk1.6.0_27-32/jre/bin/java -enableassertions -Xmx1900m
-Djava.security.egd=file:/dev/./urandom -jar <https://builds.apache.org/job/HBase-0.94-security/ws/trunk/target/surefire/surefirebooter3520122360597955477.jar>
<https://builds.apache.org/job/HBase-0.94-security/ws/trunk/target/surefire/surefire6393210202088064904tmp>
<https://builds.apache.org/job/HBase-0.94-security/ws/trunk/target/surefire/surefire_107693010267395198226tmp>
Running org.apache.hadoop.hbase.io.hfile.TestChecksum
Tests run: 3, Failures: 0, Errors: 0, Skipped: 0, Time elapsed: 0.894 sec
Forking command line: /bin/sh -c cd <https://builds.apache.org/job/HBase-0.94-security/ws/trunk>
&& /home/jenkins/tools/java/jdk1.6.0_27-32/jre/bin/java -enableassertions -Xmx1900m
-Djava.security.egd=file:/dev/./urandom -jar <https://builds.apache.org/job/HBase-0.94-security/ws/trunk/target/surefire/surefirebooter2245073710408631153.jar>
<https://builds.apache.org/job/HBase-0.94-security/ws/trunk/target/surefire/surefire1393333030083995993tmp>
<https://builds.apache.org/job/HBase-0.94-security/ws/trunk/target/surefire/surefire_1086439076835778699317tmp>
Running org.apache.hadoop.hbase.io.hfile.TestHFileBlockIndex
Tests run: 10, Failures: 0, Errors: 0, Skipped: 0, Time elapsed: 10.329 sec
Forking command line: /bin/sh -c cd <https://builds.apache.org/job/HBase-0.94-security/ws/trunk>
&& /home/jenkins/tools/java/jdk1.6.0_27-32/jre/bin/java -enableassertions -Xmx1900m
-Djava.security.egd=file:/dev/./urandom -jar <https://builds.apache.org/job/HBase-0.94-security/ws/trunk/target/surefire/surefirebooter7173413443787781194.jar>
<https://builds.apache.org/job/HBase-0.94-security/ws/trunk/target/surefire/surefire4057802097332381738tmp>
<https://builds.apache.org/job/HBase-0.94-security/ws/trunk/target/surefire/surefire_1097379466393071109699tmp>
Running org.apache.hadoop.hbase.io.hfile.TestLruBlockCache
Tests run: 16, Failures: 1, Errors: 0, Skipped: 0, Time elapsed: 2.76 sec <<< FAILURE!
Forking command line: /bin/sh -c cd <https://builds.apache.org/job/HBase-0.94-security/ws/trunk>
&& /home/jenkins/tools/java/jdk1.6.0_27-32/jre/bin/java -enableassertions -Xmx1900m
-Djava.security.egd=file:/dev/./urandom -jar <https://builds.apache.org/job/HBase-0.94-security/ws/trunk/target/surefire/surefirebooter5496535573566698535.jar>
<https://builds.apache.org/job/HBase-0.94-security/ws/trunk/target/surefire/surefire9146756228419174715tmp>
<https://builds.apache.org/job/HBase-0.94-security/ws/trunk/target/surefire/surefire_1102476183931348132998tmp>
Running org.apache.hadoop.hbase.io.hfile.slab.TestSingleSizeCache
Tests run: 5, Failures: 0, Errors: 0, Skipped: 0, Time elapsed: 26.837 sec
Forking command line: /bin/sh -c cd <https://builds.apache.org/job/HBase-0.94-security/ws/trunk>
&& /home/jenkins/tools/java/jdk1.6.0_27-32/jre/bin/java -enableassertions -Xmx1900m
-Djava.security.egd=file:/dev/./urandom -jar <https://builds.apache.org/job/HBase-0.94-security/ws/trunk/target/surefire/surefirebooter7586904365665252200.jar>
<https://builds.apache.org/job/HBase-0.94-security/ws/trunk/target/surefire/surefire1797234140537486477tmp>
<https://builds.apache.org/job/HBase-0.94-security/ws/trunk/target/surefire/surefire_1111476845229214602657tmp>
Running org.apache.hadoop.hbase.io.hfile.TestFixedFileTrailer
Tests run: 2, Failures: 0, Errors: 0, Skipped: 0, Time elapsed: 0.601 sec
Forking command line: /bin/sh -c cd <https://builds.apache.org/job/HBase-0.94-security/ws/trunk>
&& /home/jenkins/tools/java/jdk1.6.0_27-32/jre/bin/java -enableassertions -Xmx1900m
-Djava.security.egd=file:/dev/./urandom -jar <https://builds.apache.org/job/HBase-0.94-security/ws/trunk/target/surefire/surefirebooter166197713135271977.jar>
<https://builds.apache.org/job/HBase-0.94-security/ws/trunk/target/surefire/surefire1571560722995991901tmp>
<https://builds.apache.org/job/HBase-0.94-security/ws/trunk/target/surefire/surefire_1125114073745408531284tmp>
Running org.apache.hadoop.hbase.io.hfile.TestHFileBlockCompatibility
Tests run: 10, Failures: 0, Errors: 0, Skipped: 0, Time elapsed: 1.476 sec
Forking command line: /bin/sh -c cd <https://builds.apache.org/job/HBase-0.94-security/ws/trunk>
&& /home/jenkins/tools/java/jdk1.6.0_27-32/jre/bin/java -enableassertions -Xmx1900m
-Djava.security.egd=file:/dev/./urandom -jar <https://builds.apache.org/job/HBase-0.94-security/ws/trunk/target/surefire/surefirebooter5254161166182718142.jar>
<https://builds.apache.org/job/HBase-0.94-security/ws/trunk/target/surefire/surefire7555174286163352286tmp>
<https://builds.apache.org/job/HBase-0.94-security/ws/trunk/target/surefire/surefire_1134817237370174046834tmp>
Running org.apache.hadoop.hbase.io.hfile.TestHFilePerformance
Tests run: 1, Failures: 0, Errors: 0, Skipped: 0, Time elapsed: 6.833 sec
Forking command line: /bin/sh -c cd <https://builds.apache.org/job/HBase-0.94-security/ws/trunk>
&& /home/jenkins/tools/java/jdk1.6.0_27-32/jre/bin/java -enableassertions -Xmx1900m
-Djava.security.egd=file:/dev/./urandom -jar <https://builds.apache.org/job/HBase-0.94-security/ws/trunk/target/surefire/surefirebooter1263047554055145600.jar>
<https://builds.apache.org/job/HBase-0.94-security/ws/trunk/target/surefire/surefire529246969234180894tmp>
<https://builds.apache.org/job/HBase-0.94-security/ws/trunk/target/surefire/surefire_1149010642038165321919tmp>
Running org.apache.hadoop.hbase.io.hfile.TestHFileBlock
Tests run: 16, Failures: 0, Errors: 0, Skipped: 0, Time elapsed: 48.914 sec
Forking command line: /bin/sh -c cd <https://builds.apache.org/job/HBase-0.94-security/ws/trunk>
&& /home/jenkins/tools/java/jdk1.6.0_27-32/jre/bin/java -enableassertions -Xmx1900m
-Djava.security.egd=file:/dev/./urandom -jar <https://builds.apache.org/job/HBase-0.94-security/ws/trunk/target/surefire/surefirebooter7091019158389132009.jar>
<https://builds.apache.org/job/HBase-0.94-security/ws/trunk/target/surefire/surefire3502035502998226856tmp>
<https://builds.apache.org/job/HBase-0.94-security/ws/trunk/target/surefire/surefire_1155896723970195935031tmp>
Running org.apache.hadoop.hbase.io.hfile.TestForceCacheImportantBlocks
Tests run: 4, Failures: 0, Errors: 0, Skipped: 0, Time elapsed: 67.437 sec
Forking command line: /bin/sh -c cd <https://builds.apache.org/job/HBase-0.94-security/ws/trunk>
&& /home/jenkins/tools/java/jdk1.6.0_27-32/jre/bin/java -enableassertions -Xmx1900m
-Djava.security.egd=file:/dev/./urandom -jar <https://builds.apache.org/job/HBase-0.94-security/ws/trunk/target/surefire/surefirebooter7392783337890658896.jar>
<https://builds.apache.org/job/HBase-0.94-security/ws/trunk/target/surefire/surefire5239257628467052757tmp>
<https://builds.apache.org/job/HBase-0.94-security/ws/trunk/target/surefire/surefire_1169037295116174770940tmp>
Running org.apache.hadoop.hbase.io.hfile.TestCacheOnWrite
Tests run: 36, Failures: 0, Errors: 0, Skipped: 0, Time elapsed: 37.842 sec
Forking command line: /bin/sh -c cd <https://builds.apache.org/job/HBase-0.94-security/ws/trunk>
&& /home/jenkins/tools/java/jdk1.6.0_27-32/jre/bin/java -enableassertions -Xmx1900m
-Djava.security.egd=file:/dev/./urandom -jar <https://builds.apache.org/job/HBase-0.94-security/ws/trunk/target/surefire/surefirebooter160353140996080075.jar>
<https://builds.apache.org/job/HBase-0.94-security/ws/trunk/target/surefire/surefire5454914967611864430tmp>
<https://builds.apache.org/job/HBase-0.94-security/ws/trunk/target/surefire/surefire_1172319029707105053607tmp>
Running org.apache.hadoop.hbase.TestClusterBootOrder
Tests run: 2, Failures: 0, Errors: 0, Skipped: 0, Time elapsed: 35.068 sec
Forking command line: /bin/sh -c cd <https://builds.apache.org/job/HBase-0.94-security/ws/trunk>
&& /home/jenkins/tools/java/jdk1.6.0_27-32/jre/bin/java -enableassertions -Xmx1900m
-Djava.security.egd=file:/dev/./urandom -jar <https://builds.apache.org/job/HBase-0.94-security/ws/trunk/target/surefire/surefirebooter6282183861871235200.jar>
<https://builds.apache.org/job/HBase-0.94-security/ws/trunk/target/surefire/surefire8218774845149629423tmp>
<https://builds.apache.org/job/HBase-0.94-security/ws/trunk/target/surefire/surefire_1188243843398258019797tmp>
Running org.apache.hadoop.hbase.replication.regionserver.TestReplicationSourceManager
Tests run: 1, Failures: 0, Errors: 0, Skipped: 0, Time elapsed: 1.181 sec
Forking command line: /bin/sh -c cd <https://builds.apache.org/job/HBase-0.94-security/ws/trunk>
&& /home/jenkins/tools/java/jdk1.6.0_27-32/jre/bin/java -enableassertions -Xmx1900m
-Djava.security.egd=file:/dev/./urandom -jar <https://builds.apache.org/job/HBase-0.94-security/ws/trunk/target/surefire/surefirebooter8377277406221372162.jar>
<https://builds.apache.org/job/HBase-0.94-security/ws/trunk/target/surefire/surefire1683743797527351437tmp>
<https://builds.apache.org/job/HBase-0.94-security/ws/trunk/target/surefire/surefire_1193109235673786830054tmp>
Running org.apache.hadoop.hbase.replication.regionserver.TestReplicationSink
Tests run: 5, Failures: 0, Errors: 0, Skipped: 0, Time elapsed: 17.06 sec
Forking command line: /bin/sh -c cd <https://builds.apache.org/job/HBase-0.94-security/ws/trunk>
&& /home/jenkins/tools/java/jdk1.6.0_27-32/jre/bin/java -enableassertions -Xmx1900m
-Djava.security.egd=file:/dev/./urandom -jar <https://builds.apache.org/job/HBase-0.94-security/ws/trunk/target/surefire/surefirebooter989752951514739950.jar>
<https://builds.apache.org/job/HBase-0.94-security/ws/trunk/target/surefire/surefire2119958467643705233tmp>
<https://builds.apache.org/job/HBase-0.94-security/ws/trunk/target/surefire/surefire_1205706377121731010901tmp>
Running org.apache.hadoop.hbase.avro.TestAvroServer
Tests run: 3, Failures: 0, Errors: 0, Skipped: 0, Time elapsed: 33.437 sec
Forking command line: /bin/sh -c cd <https://builds.apache.org/job/HBase-0.94-security/ws/trunk>
&& /home/jenkins/tools/java/jdk1.6.0_27-32/jre/bin/java -enableassertions -Xmx1900m
-Djava.security.egd=file:/dev/./urandom -jar <https://builds.apache.org/job/HBase-0.94-security/ws/trunk/target/surefire/surefirebooter2614466708442064225.jar>
<https://builds.apache.org/job/HBase-0.94-security/ws/trunk/target/surefire/surefire6602210922563250804tmp>
<https://builds.apache.org/job/HBase-0.94-security/ws/trunk/target/surefire/surefire_1212941096392399802033tmp>
Running org.apache.hadoop.hbase.replication.TestReplicationSource
Tests run: 1, Failures: 0, Errors: 0, Skipped: 0, Time elapsed: 3.287 sec
Forking command line: /bin/sh -c cd <https://builds.apache.org/job/HBase-0.94-security/ws/trunk>
&& /home/jenkins/tools/java/jdk1.6.0_27-32/jre/bin/java -enableassertions -Xmx1900m
-Djava.security.egd=file:/dev/./urandom -jar <https://builds.apache.org/job/HBase-0.94-security/ws/trunk/target/surefire/surefirebooter3276511860855984218.jar>
<https://builds.apache.org/job/HBase-0.94-security/ws/trunk/target/surefire/surefire7898209008201718890tmp>
<https://builds.apache.org/job/HBase-0.94-security/ws/trunk/target/surefire/surefire_1226420770234831615163tmp>
Running org.apache.hadoop.hbase.replication.TestReplicationZookeeper
Tests run: 1, Failures: 0, Errors: 0, Skipped: 0, Time elapsed: 0.623 sec
Forking command line: /bin/sh -c cd <https://builds.apache.org/job/HBase-0.94-security/ws/trunk>
&& /home/jenkins/tools/java/jdk1.6.0_27-32/jre/bin/java -enableassertions -Xmx1900m
-Djava.security.egd=file:/dev/./urandom -jar <https://builds.apache.org/job/HBase-0.94-security/ws/trunk/target/surefire/surefirebooter6764691828321690024.jar>
<https://builds.apache.org/job/HBase-0.94-security/ws/trunk/target/surefire/surefire273332540910172391tmp>
<https://builds.apache.org/job/HBase-0.94-security/ws/trunk/target/surefire/surefire_1236010306177427622848tmp>
Running org.apache.hadoop.hbase.ipc.TestDelayedRpc
Tests run: 4, Failures: 0, Errors: 0, Skipped: 0, Time elapsed: 2.411 sec
Running org.apache.hadoop.hbase.replication.TestReplicationPeer
Tests run: 1, Failures: 0, Errors: 0, Skipped: 0, Time elapsed: 7.703 sec

Results :

Failed tests:   testDeleteExpiredStoreFiles(org.apache.hadoop.hbase.regionserver.TestStore):
expected:<1> but was:<2>
  testBackgroundEvictionThread[1](org.apache.hadoop.hbase.io.hfile.TestLruBlockCache)

Tests run: 637, Failures: 2, Errors: 0, Skipped: 2

[INFO] ------------------------------------------------------------------------
[INFO] BUILD FAILURE
[INFO] ------------------------------------------------------------------------
[INFO] Total time: 29:46.796s
[INFO] Finished at: Fri Jun 01 05:42:22 UTC 2012
[INFO] Final Memory: 42M/863M
[INFO] ------------------------------------------------------------------------
[ERROR] Failed to execute goal org.apache.maven.plugins:maven-surefire-plugin:2.12-TRUNK-HBASE-2:test
(secondPartTestsExecution) on project hbase: There are test failures.
[ERROR] 
[ERROR] Please refer to <https://builds.apache.org/job/HBase-0.94-security/ws/trunk/target/surefire-reports>
for the individual test results.
[ERROR] -> [Help 1]
org.apache.maven.lifecycle.LifecycleExecutionException: Failed to execute goal org.apache.maven.plugins:maven-surefire-plugin:2.12-TRUNK-HBASE-2:test
(secondPartTestsExecution) on project hbase: There are test failures.

Please refer to <https://builds.apache.org/job/HBase-0.94-security/ws/trunk/target/surefire-reports>
for the individual test results.
	at org.apache.maven.lifecycle.internal.MojoExecutor.execute(MojoExecutor.java:213)
	at org.apache.maven.lifecycle.internal.MojoExecutor.execute(MojoExecutor.java:153)
	at org.apache.maven.lifecycle.internal.MojoExecutor.execute(MojoExecutor.java:145)
	at org.apache.maven.lifecycle.internal.MojoExecutor.executeForkedExecutions(MojoExecutor.java:365)
	at org.apache.maven.lifecycle.internal.MojoExecutor.execute(MojoExecutor.java:199)
	at org.apache.maven.lifecycle.internal.MojoExecutor.execute(MojoExecutor.java:153)
	at org.apache.maven.lifecycle.internal.MojoExecutor.execute(MojoExecutor.java:145)
	at org.apache.maven.lifecycle.internal.LifecycleModuleBuilder.buildProject(LifecycleModuleBuilder.java:84)
	at org.apache.maven.lifecycle.internal.LifecycleModuleBuilder.buildProject(LifecycleModuleBuilder.java:59)
	at org.apache.maven.lifecycle.internal.LifecycleStarter.singleThreadedBuild(LifecycleStarter.java:183)
	at org.apache.maven.lifecycle.internal.LifecycleStarter.execute(LifecycleStarter.java:161)
	at org.apache.maven.DefaultMaven.doExecute(DefaultMaven.java:319)
	at org.apache.maven.DefaultMaven.execute(DefaultMaven.java:156)
	at org.apache.maven.cli.MavenCli.execute(MavenCli.java:537)
	at org.apache.maven.cli.MavenCli.doMain(MavenCli.java:196)
	at org.apache.maven.cli.MavenCli.main(MavenCli.java:141)
	at sun.reflect.NativeMethodAccessorImpl.invoke0(Native Method)
	at sun.reflect.NativeMethodAccessorImpl.invoke(NativeMethodAccessorImpl.java:39)
	at sun.reflect.DelegatingMethodAccessorImpl.invoke(DelegatingMethodAccessorImpl.java:25)
	at java.lang.reflect.Method.invoke(Method.java:597)
	at org.codehaus.plexus.classworlds.launcher.Launcher.launchEnhanced(Launcher.java:290)
	at org.codehaus.plexus.classworlds.launcher.Launcher.launch(Launcher.java:230)
	at org.codehaus.plexus.classworlds.launcher.Launcher.mainWithExitCode(Launcher.java:409)
	at org.codehaus.plexus.classworlds.launcher.Launcher.main(Launcher.java:352)
Caused by: org.apache.maven.plugin.MojoFailureException: There are test failures.

Please refer to <https://builds.apache.org/job/HBase-0.94-security/ws/trunk/target/surefire-reports>
for the individual test results.
	at org.apache.maven.plugin.surefire.SurefireHelper.reportExecution(SurefireHelper.java:87)
	at org.apache.maven.plugin.surefire.SurefirePlugin.writeSummary(SurefirePlugin.java:651)
	at org.apache.maven.plugin.surefire.SurefirePlugin.handleSummary(SurefirePlugin.java:625)
	at org.apache.maven.plugin.surefire.AbstractSurefireMojo.executeAfterPreconditionsChecked(AbstractSurefireMojo.java:137)
	at org.apache.maven.plugin.surefire.AbstractSurefireMojo.execute(AbstractSurefireMojo.java:98)
	at org.apache.maven.plugin.DefaultBuildPluginManager.executeMojo(DefaultBuildPluginManager.java:101)
	at org.apache.maven.lifecycle.internal.MojoExecutor.execute(MojoExecutor.java:209)
	... 23 more
[ERROR] 
[ERROR] 
[ERROR] For more information about the errors and possible solutions, please read the following
articles:
[ERROR] [Help 1] http://cwiki.apache.org/confluence/display/MAVEN/MojoFailureException
Build step 'Invoke top-level Maven targets' marked build as failure
Archiving artifacts
Updating HBASE-6122
Updating HBASE-6002
Updating HBASE-6089
Updating HBASE-6062
Updating HBASE-6088
Updating HBASE-6049
Updating HBASE-6065
Updating HBASE-4720
Updating HBASE-6141
Updating HBASE-6068
Updating HBASE-6040
Updating HBASE-6129
Updating HBASE-5722
Updating HBASE-6107
Updating HBASE-6126
Updating HBASE-6124
Updating HBASE-6095
Updating HBASE-6050
Updating HBASE-6016
Updating HBASE-6131
Updating HBASE-6133
Updating HBASE-6033
Updating HBASE-5533
Updating HBASE-6118
Updating HBASE-5733
Updating HBASE-5916
Updating HBASE-6114
Updating HBASE-6115
Recording test results

Mime
View raw message